summaryrefslogtreecommitdiff
diff options
context:
space:
mode:
Diffstat (limited to 'spike.txt')
-rw-r--r--spike.txt20
1 files changed, 10 insertions, 10 deletions
diff --git a/spike.txt b/spike.txt
index 0b5107e73292..6ffb648c48a4 100644
--- a/spike.txt
+++ b/spike.txt
@@ -360,17 +360,17 @@ ERROR pkgcore: returned val from gen_metadata was 'False'
ERROR pkgcore: returned val from gen_metadata was 'False'
!!! caught exception False while processing ebuild src: net-analyzer/wfuzz-2.1.3
ERROR pkgcore: returned val from gen_metadata was 'False'
-caught exception '%s' while processing '%s'(MetadataException('Metadata Exception: pkg ebuild src: net-proxy/mallory-0.2.0_p20130109, attr description\nerror: Metadata Exception: pkg ebuild src: net-proxy/mallory-0.2.0_p20130109, attr data\nerror: False',), <<class 'pkgcore.ebuild.ebuild_src.package'> cpv='net-proxy/mallory-0.2.0_p20130109' @0x7f16cf90b410>)
+caught exception '%s' while processing '%s'(MetadataException('Metadata Exception: pkg ebuild src: net-proxy/mallory-0.2.0_p20130109, attr description\nerror: Metadata Exception: pkg ebuild src: net-proxy/mallory-0.2.0_p20130109, attr data\nerror: False',), <<class 'pkgcore.ebuild.ebuild_src.package'> cpv='net-proxy/mallory-0.2.0_p20130109' @0x7fbd5ed4d410>)
ERROR pkgcore: returned val from gen_metadata was 'False'
-caught exception '%s' while processing '%s'(MetadataException('Metadata Exception: pkg ebuild src: net-analyzer/geoedge-0.2-r2, attr description\nerror: Metadata Exception: pkg ebuild src: net-analyzer/geoedge-0.2-r2, attr data\nerror: False',), <<class 'pkgcore.ebuild.ebuild_src.package'> cpv='net-analyzer/geoedge-0.2-r2' @0x7f16cf71d2d0>)
+caught exception '%s' while processing '%s'(MetadataException('Metadata Exception: pkg ebuild src: net-analyzer/geoedge-0.2-r2, attr description\nerror: Metadata Exception: pkg ebuild src: net-analyzer/geoedge-0.2-r2, attr data\nerror: False',), <<class 'pkgcore.ebuild.ebuild_src.package'> cpv='net-analyzer/geoedge-0.2-r2' @0x7fbd5ebde2d0>)
ERROR pkgcore: returned val from gen_metadata was 'False'
-caught exception '%s' while processing '%s'(MetadataException('Metadata Exception: pkg ebuild src: net-analyzer/inguma-0.4-r1, attr description\nerror: Metadata Exception: pkg ebuild src: net-analyzer/inguma-0.4-r1, attr data\nerror: False',), <<class 'pkgcore.ebuild.ebuild_src.package'> cpv='net-analyzer/inguma-0.4-r1' @0x7f16cf71db90>)
+caught exception '%s' while processing '%s'(MetadataException('Metadata Exception: pkg ebuild src: net-analyzer/inguma-0.4-r1, attr description\nerror: Metadata Exception: pkg ebuild src: net-analyzer/inguma-0.4-r1, attr data\nerror: False',), <<class 'pkgcore.ebuild.ebuild_src.package'> cpv='net-analyzer/inguma-0.4-r1' @0x7fbd5ebdeb90>)
ERROR pkgcore: returned val from gen_metadata was 'False'
-caught exception '%s' while processing '%s'(MetadataException('Metadata Exception: pkg ebuild src: net-analyzer/metagoofil-1.4b-r1, attr description\nerror: Metadata Exception: pkg ebuild src: net-analyzer/metagoofil-1.4b-r1, attr data\nerror: False',), <<class 'pkgcore.ebuild.ebuild_src.package'> cpv='net-analyzer/metagoofil-1.4b-r1' @0x7f16cf729a50>)
+caught exception '%s' while processing '%s'(MetadataException('Metadata Exception: pkg ebuild src: net-analyzer/metagoofil-1.4b-r1, attr description\nerror: Metadata Exception: pkg ebuild src: net-analyzer/metagoofil-1.4b-r1, attr data\nerror: False',), <<class 'pkgcore.ebuild.ebuild_src.package'> cpv='net-analyzer/metagoofil-1.4b-r1' @0x7fbd5eb6aa50>)
ERROR pkgcore: returned val from gen_metadata was 'False'
-caught exception '%s' while processing '%s'(MetadataException('Metadata Exception: pkg ebuild src: net-analyzer/polenum-0.2-r2, attr description\nerror: Metadata Exception: pkg ebuild src: net-analyzer/polenum-0.2-r2, attr data\nerror: False',), <<class 'pkgcore.ebuild.ebuild_src.package'> cpv='net-analyzer/polenum-0.2-r2' @0x7f16cf73ce10>)
+caught exception '%s' while processing '%s'(MetadataException('Metadata Exception: pkg ebuild src: net-analyzer/polenum-0.2-r2, attr description\nerror: Metadata Exception: pkg ebuild src: net-analyzer/polenum-0.2-r2, attr data\nerror: False',), <<class 'pkgcore.ebuild.ebuild_src.package'> cpv='net-analyzer/polenum-0.2-r2' @0x7fbd5eb7de10>)
ERROR pkgcore: returned val from gen_metadata was 'False'
-caught exception '%s' while processing '%s'(MetadataException('Metadata Exception: pkg ebuild src: net-analyzer/sipvicious-0.2.8-r3, attr description\nerror: Metadata Exception: pkg ebuild src: net-analyzer/sipvicious-0.2.8-r3, attr data\nerror: False',), <<class 'pkgcore.ebuild.ebuild_src.package'> cpv='net-analyzer/sipvicious-0.2.8-r3' @0x7f16cf74a7d0>)
+caught exception '%s' while processing '%s'(MetadataException('Metadata Exception: pkg ebuild src: net-analyzer/sipvicious-0.2.8-r3, attr description\nerror: Metadata Exception: pkg ebuild src: net-analyzer/sipvicious-0.2.8-r3, attr data\nerror: False',), <<class 'pkgcore.ebuild.ebuild_src.package'> cpv='net-analyzer/sipvicious-0.2.8-r3' @0x7fbd5eb8b7d0>)
ERROR pkgcore: returned val from gen_metadata was 'False'
caught exception '%s' while processing '%s'(MetadataException('Metadata Exception: pkg ebuild src: net-analyzer/subdomainer-1.3-r2, attr description\nerror:
!!! ERROR: net-analyzer/webshag-1.1-r1 failed.
@@ -429,11 +429,11 @@ caught exception '%s' while processing '%s'(MetadataException('Metadata Exceptio
!!! The die message:
!!! PYTHON_COMPAT must be an array.
-Metadata Exception: pkg ebuild src: net-analyzer/subdomainer-1.3-r2, attr data\nerror: False',), <<class 'pkgcore.ebuild.ebuild_src.package'> cpv='net-analyzer/subdomainer-1.3-r2' @0x7f16cf755690>)
+Metadata Exception: pkg ebuild src: net-analyzer/subdomainer-1.3-r2, attr data\nerror: False',), <<class 'pkgcore.ebuild.ebuild_src.package'> cpv='net-analyzer/subdomainer-1.3-r2' @0x7fbd5eb97690>)
ERROR pkgcore: returned val from gen_metadata was 'False'
-caught exception '%s' while processing '%s'(MetadataException('Metadata Exception: pkg ebuild src: net-analyzer/webshag-1.1-r1, attr description\nerror: Metadata Exception: pkg ebuild src: net-analyzer/webshag-1.1-r1, attr data\nerror: False',), <<class 'pkgcore.ebuild.ebuild_src.package'> cpv='net-analyzer/webshag-1.1-r1' @0x7f16cf6e3910>)
+caught exception '%s' while processing '%s'(MetadataException('Metadata Exception: pkg ebuild src: net-analyzer/webshag-1.1-r1, attr description\nerror: Metadata Exception: pkg ebuild src: net-analyzer/webshag-1.1-r1, attr data\nerror: False',), <<class 'pkgcore.ebuild.ebuild_src.package'> cpv='net-analyzer/webshag-1.1-r1' @0x7fbd5eb27910>)
ERROR pkgcore: returned val from gen_metadata was 'False'
-caught exception '%s' while processing '%s'(MetadataException('Metadata Exception: pkg ebuild src: net-analyzer/wfuzz-2.0-r1, attr description\nerror: Metadata Exception: pkg ebuild src: net-analyzer/wfuzz-2.0-r1, attr data\nerror: False',), <<class 'pkgcore.ebuild.ebuild_src.package'> cpv='net-analyzer/wfuzz-2.0-r1' @0x7f16cf755690>)
+caught exception '%s' while processing '%s'(MetadataException('Metadata Exception: pkg ebuild src: net-analyzer/wfuzz-2.0-r1, attr description\nerror: Metadata Exception: pkg ebuild src: net-analyzer/wfuzz-2.0-r1, attr data\nerror: False',), <<class 'pkgcore.ebuild.ebuild_src.package'> cpv='net-analyzer/wfuzz-2.0-r1' @0x7fbd5eb97690>)
ERROR pkgcore: returned val from gen_metadata was 'False'
-caught exception '%s' while processing '%s'(MetadataException('Metadata Exception: pkg ebuild src: net-analyzer/wfuzz-2.1.3, attr description\nerror: Metadata Exception: pkg ebuild src: net-analyzer/wfuzz-2.1.3, attr data\nerror: False',), <<class 'pkgcore.ebuild.ebuild_src.package'> cpv='net-analyzer/wfuzz-2.1.3' @0x7f16cf6e3910>)
+caught exception '%s' while processing '%s'(MetadataException('Metadata Exception: pkg ebuild src: net-analyzer/wfuzz-2.1.3, attr description\nerror: Metadata Exception: pkg ebuild src: net-analyzer/wfuzz-2.1.3, attr data\nerror: False',), <<class 'pkgcore.ebuild.ebuild_src.package'> cpv='net-analyzer/wfuzz-2.1.3' @0x7fbd5eb27910>)
* Cache regen failed with 1