diff options
Diffstat (limited to 'nikai.txt')
-rw-r--r-- | nikai.txt | 7 |
1 files changed, 2 insertions, 5 deletions
diff --git a/nikai.txt b/nikai.txt index b71bbbb7eb3c..b74a8b71286b 100644 --- a/nikai.txt +++ b/nikai.txt @@ -11,8 +11,6 @@ 'uri': 'git+ssh://git@git.gentoo.org/user/nikai.git'}], 'status': 'unofficial'} $ pmaint sync nikai -WARNING:pkgcore:repo lacks a defined name: '/home/mgorny/sync/hanno' -WARNING:pkgcore:repo at '/home/mgorny/sync/hanno', named 'hanno', doesn't specify masters in metadata/layout.conf. Please explicitly set masters (use "masters =" if the repo is standalone). Already up-to-date. *** syncing nikai *** synced nikai @@ -27,7 +25,6 @@ $ pmaint regen --use-local-desc --pkg-desc-index -t 1 nikai * vegastrike-data-9999.ebuild, line 7: Called inherit 'eutils' 'python' 'games' * ebuild-default-functions.lib, line 210: Called __internal_inherit 'python' * ebuild-daemon.lib, line 35: Called die -Sandboxed process killed by signal: Broken pipe * ERROR: games-simulation/vegastrike-data-9999 failed (depend phase): * inherit for python failed * @@ -36,8 +33,8 @@ Sandboxed process killed by signal: Broken pipe * vegastrike-data-9999.ebuild, line 7: Called inherit 'eutils' 'python' 'games' * ebuild-default-functions.lib, line 210: Called __internal_inherit 'python' * ebuild-daemon.lib, line 35: Called die -sandbox:stop caught signal 15 in pid 30914 +sandbox:stop caught signal 15 in pid 8733 Sandboxed process killed by signal: Terminated !!! caught exception inherit requires an unknown eclass, python cannot be found while processing ebuild src: games-simulation/vegastrike-data-9999 -caught exception '%s' while processing '%s'(MetadataException('Metadata Exception: pkg ebuild src: games-simulation/vegastrike-data-9999, attr description\nerror: Metadata Exception: pkg ebuild src: games-simulation/vegastrike-data-9999, attr data\nerror: inherit requires an unknown eclass, python cannot be found',), <<class 'pkgcore.ebuild.ebuild_src.package'> cpv='games-simulation/vegastrike-data-9999' @0x7f7a4bfc9050>) +caught exception '%s' while processing '%s'(MetadataException('Metadata Exception: pkg ebuild src: games-simulation/vegastrike-data-9999, attr description\nerror: Metadata Exception: pkg ebuild src: games-simulation/vegastrike-data-9999, attr data\nerror: inherit requires an unknown eclass, python cannot be found',), <<class 'pkgcore.ebuild.ebuild_src.package'> cpv='games-simulation/vegastrike-data-9999' @0x7fc4c8225050>) * Cache regen failed with 1 |