summaryrefslogtreecommitdiff
diff options
context:
space:
mode:
Diffstat (limited to 'nikai.html')
-rw-r--r--nikai.html84
1 files changed, 41 insertions, 43 deletions
diff --git a/nikai.html b/nikai.html
index fbf9f8912849..128bd0160451 100644
--- a/nikai.html
+++ b/nikai.html
@@ -104,89 +104,87 @@
</pre></td></tr>
<tr class="" id="l47"><td><a href="#l47"><span>47</span></a></td><td><pre> * ebuild-daemon.lib, line 36: Called die
</pre></td></tr>
- <tr class="" id="l48"><td><a href="#l48"><span>48</span></a></td><td><pre>Sandboxed process killed by signal: Broken pipe
+ <tr class="" id="l48"><td><a href="#l48"><span>48</span></a></td><td><pre> * ERROR: dev-util/nvidia-texture-tools-2.0.8 failed (depend phase):
</pre></td></tr>
- <tr class="" id="l49"><td><a href="#l49"><span>49</span></a></td><td><pre> * ERROR: dev-util/nvidia-texture-tools-2.0.8 failed (depend phase):
+ <tr class="" id="l49"><td><a href="#l49"><span>49</span></a></td><td><pre> * EAPI=2 is not supported
</pre></td></tr>
- <tr class="" id="l50"><td><a href="#l50"><span>50</span></a></td><td><pre> * EAPI=2 is not supported
+ <tr class="" id="l50"><td><a href="#l50"><span>50</span></a></td><td><pre> *
</pre></td></tr>
- <tr class="" id="l51"><td><a href="#l51"><span>51</span></a></td><td><pre> *
+ <tr class="" id="l51"><td><a href="#l51"><span>51</span></a></td><td><pre> * Call stack:
</pre></td></tr>
- <tr class="" id="l52"><td><a href="#l52"><span>52</span></a></td><td><pre> * Call stack:
+ <tr class="" id="l52"><td><a href="#l52"><span>52</span></a></td><td><pre> * isolated-functions.lib, line 345: Called source '/home/mgorny/repos/nikai/dev-util/nvidia-texture-tools/nvidia-texture-tools-2.0.8.ebuild'
</pre></td></tr>
- <tr class="" id="l53"><td><a href="#l53"><span>53</span></a></td><td><pre> * isolated-functions.lib, line 345: Called source '/home/mgorny/repos/nikai/dev-util/nvidia-texture-tools/nvidia-texture-tools-2.0.8.ebuild'
+ <tr class="" id="l53"><td><a href="#l53"><span>53</span></a></td><td><pre> * nvidia-texture-tools-2.0.8.ebuild, line 6: Called inherit 'cmake-utils' 'eutils'
</pre></td></tr>
- <tr class="" id="l54"><td><a href="#l54"><span>54</span></a></td><td><pre> * nvidia-texture-tools-2.0.8.ebuild, line 6: Called inherit 'cmake-utils' 'eutils'
+ <tr class="" id="l54"><td><a href="#l54"><span>54</span></a></td><td><pre> * ebuild-default-functions.lib, line 209: Called __internal_inherit 'cmake-utils'
</pre></td></tr>
- <tr class="" id="l55"><td><a href="#l55"><span>55</span></a></td><td><pre> * ebuild-default-functions.lib, line 209: Called __internal_inherit 'cmake-utils'
+ <tr class="" id="l55"><td><a href="#l55"><span>55</span></a></td><td><pre> * ebuild-daemon.lib, line 29: Called __qa_invoke 'source' '/home/mgorny/repos/gentoo/eclass/cmake-utils.eclass'
</pre></td></tr>
- <tr class="" id="l56"><td><a href="#l56"><span>56</span></a></td><td><pre> * ebuild-daemon.lib, line 29: Called __qa_invoke 'source' '/home/mgorny/repos/gentoo/eclass/cmake-utils.eclass'
+ <tr class="" id="l56"><td><a href="#l56"><span>56</span></a></td><td><pre> * isolated-functions.lib, line 345: Called source '/home/mgorny/repos/gentoo/eclass/cmake-utils.eclass'
</pre></td></tr>
- <tr class="" id="l57"><td><a href="#l57"><span>57</span></a></td><td><pre> * isolated-functions.lib, line 345: Called source '/home/mgorny/repos/gentoo/eclass/cmake-utils.eclass'
+ <tr class="" id="l57"><td><a href="#l57"><span>57</span></a></td><td><pre> * cmake-utils.eclass, line 99: Called die
</pre></td></tr>
- <tr class="" id="l58"><td><a href="#l58"><span>58</span></a></td><td><pre> * cmake-utils.eclass, line 99: Called die
+ <tr class="" id="l58"><td><a href="#l58"><span>58</span></a></td><td><pre> * ERROR: games-simulation/vegastrike-data-9999 failed (depend phase):
</pre></td></tr>
- <tr class="" id="l59"><td><a href="#l59"><span>59</span></a></td><td><pre> * ERROR: games-simulation/vegastrike-data-9999 failed (depend phase):
+ <tr class="" id="l59"><td><a href="#l59"><span>59</span></a></td><td><pre> * inherit for python failed
</pre></td></tr>
- <tr class="" id="l60"><td><a href="#l60"><span>60</span></a></td><td><pre> * inherit for python failed
+ <tr class="" id="l60"><td><a href="#l60"><span>60</span></a></td><td><pre> *
</pre></td></tr>
- <tr class="" id="l61"><td><a href="#l61"><span>61</span></a></td><td><pre> *
+ <tr class="" id="l61"><td><a href="#l61"><span>61</span></a></td><td><pre> * Call stack:
</pre></td></tr>
- <tr class="" id="l62"><td><a href="#l62"><span>62</span></a></td><td><pre> * Call stack:
+ <tr class="" id="l62"><td><a href="#l62"><span>62</span></a></td><td><pre> * isolated-functions.lib, line 345: Called source '/home/mgorny/repos/nikai/games-simulation/vegastrike-data/vegastrike-data-9999.ebuild'
</pre></td></tr>
- <tr class="" id="l63"><td><a href="#l63"><span>63</span></a></td><td><pre> * isolated-functions.lib, line 345: Called source '/home/mgorny/repos/nikai/games-simulation/vegastrike-data/vegastrike-data-9999.ebuild'
+ <tr class="" id="l63"><td><a href="#l63"><span>63</span></a></td><td><pre> * vegastrike-data-9999.ebuild, line 7: Called inherit 'eutils' 'python' 'games'
</pre></td></tr>
- <tr class="" id="l64"><td><a href="#l64"><span>64</span></a></td><td><pre> * vegastrike-data-9999.ebuild, line 7: Called inherit 'eutils' 'python' 'games'
+ <tr class="" id="l64"><td><a href="#l64"><span>64</span></a></td><td><pre> * ebuild-default-functions.lib, line 209: Called __internal_inherit 'python'
</pre></td></tr>
- <tr class="" id="l65"><td><a href="#l65"><span>65</span></a></td><td><pre> * ebuild-default-functions.lib, line 209: Called __internal_inherit 'python'
+ <tr class="" id="l65"><td><a href="#l65"><span>65</span></a></td><td><pre> * ebuild-daemon.lib, line 34: Called die
</pre></td></tr>
- <tr class="" id="l66"><td><a href="#l66"><span>66</span></a></td><td><pre> * ebuild-daemon.lib, line 34: Called die
+ <tr class="" id="l66"><td><a href="#l66"><span>66</span></a></td><td><pre>sandbox:stop caught signal 15 in pid 8228
</pre></td></tr>
- <tr class="" id="l67"><td><a href="#l67"><span>67</span></a></td><td><pre>sandbox:stop caught signal 15 in pid 2073
+ <tr class="" id="l67"><td><a href="#l67"><span>67</span></a></td><td><pre>Sandboxed process killed by signal: Terminated
</pre></td></tr>
- <tr class="" id="l68"><td><a href="#l68"><span>68</span></a></td><td><pre>Sandboxed process killed by signal: Terminated
+ <tr class="" id="l68"><td><a href="#l68"><span>68</span></a></td><td><pre> * ERROR: games-simulation/vegastrike-9999 failed (depend phase):
</pre></td></tr>
- <tr class="" id="l69"><td><a href="#l69"><span>69</span></a></td><td><pre> * ERROR: games-simulation/vegastrike-9999 failed (depend phase):
+ <tr class="" id="l69"><td><a href="#l69"><span>69</span></a></td><td><pre> * EAPI=2 is not supported
</pre></td></tr>
- <tr class="" id="l70"><td><a href="#l70"><span>70</span></a></td><td><pre> * EAPI=2 is not supported
+ <tr class="" id="l70"><td><a href="#l70"><span>70</span></a></td><td><pre> *
</pre></td></tr>
- <tr class="" id="l71"><td><a href="#l71"><span>71</span></a></td><td><pre> *
+ <tr class="" id="l71"><td><a href="#l71"><span>71</span></a></td><td><pre> * Call stack:
</pre></td></tr>
- <tr class="" id="l72"><td><a href="#l72"><span>72</span></a></td><td><pre> * Call stack:
+ <tr class="" id="l72"><td><a href="#l72"><span>72</span></a></td><td><pre> * isolated-functions.lib, line 345: Called source '/home/mgorny/repos/nikai/games-simulation/vegastrike/vegastrike-9999.ebuild'
</pre></td></tr>
- <tr class="" id="l73"><td><a href="#l73"><span>73</span></a></td><td><pre> * isolated-functions.lib, line 345: Called source '/home/mgorny/repos/nikai/games-simulation/vegastrike/vegastrike-9999.ebuild'
+ <tr class="" id="l73"><td><a href="#l73"><span>73</span></a></td><td><pre> * vegastrike-9999.ebuild, line 8: Called inherit 'cmake-utils' 'flag-o-matic' 'eutils' 'games'
</pre></td></tr>
- <tr class="" id="l74"><td><a href="#l74"><span>74</span></a></td><td><pre> * vegastrike-9999.ebuild, line 8: Called inherit 'cmake-utils' 'flag-o-matic' 'eutils' 'games'
+ <tr class="" id="l74"><td><a href="#l74"><span>74</span></a></td><td><pre> * ebuild-default-functions.lib, line 209: Called __internal_inherit 'cmake-utils'
</pre></td></tr>
- <tr class="" id="l75"><td><a href="#l75"><span>75</span></a></td><td><pre> * ebuild-default-functions.lib, line 209: Called __internal_inherit 'cmake-utils'
+ <tr class="" id="l75"><td><a href="#l75"><span>75</span></a></td><td><pre> * ebuild-daemon.lib, line 29: Called __qa_invoke 'source' '/home/mgorny/repos/gentoo/eclass/cmake-utils.eclass'
</pre></td></tr>
- <tr class="" id="l76"><td><a href="#l76"><span>76</span></a></td><td><pre> * ebuild-daemon.lib, line 29: Called __qa_invoke 'source' '/home/mgorny/repos/gentoo/eclass/cmake-utils.eclass'
+ <tr class="" id="l76"><td><a href="#l76"><span>76</span></a></td><td><pre> * isolated-functions.lib, line 345: Called source '/home/mgorny/repos/gentoo/eclass/cmake-utils.eclass'
</pre></td></tr>
- <tr class="" id="l77"><td><a href="#l77"><span>77</span></a></td><td><pre> * isolated-functions.lib, line 345: Called source '/home/mgorny/repos/gentoo/eclass/cmake-utils.eclass'
+ <tr class="" id="l77"><td><a href="#l77"><span>77</span></a></td><td><pre> * cmake-utils.eclass, line 99: Called die
</pre></td></tr>
- <tr class="" id="l78"><td><a href="#l78"><span>78</span></a></td><td><pre> * cmake-utils.eclass, line 99: Called die
+ <tr class="" id="l78"><td><a href="#l78"><span>78</span></a></td><td><pre>ERROR pkgcore: returned val from gen_metadata was 'False'
</pre></td></tr>
- <tr class="" id="l79"><td><a href="#l79"><span>79</span></a></td><td><pre>ERROR pkgcore: returned val from gen_metadata was 'False'
-</pre></td></tr>
- <tr class="err" id="l80"><td><a href="#l80"><span>80</span></a></td><td><pre>!!! caught exception False while processing ebuild src: dev-util/nvidia-texture-tools-2.0.8
+ <tr class="err" id="l79"><td><a href="#l79"><span>79</span></a></td><td><pre>!!! caught exception False while processing ebuild src: dev-util/nvidia-texture-tools-2.0.8
</pre></td><td>[FATAL]</td></tr>
- <tr class="err" id="l81"><td><a href="#l81"><span>81</span></a></td><td><pre>!!! caught exception inherit requires an unknown eclass, python cannot be found while processing ebuild src: games-simulation/vegastrike-data-9999
+ <tr class="err" id="l80"><td><a href="#l80"><span>80</span></a></td><td><pre>!!! caught exception inherit requires an unknown eclass, python cannot be found while processing ebuild src: games-simulation/vegastrike-data-9999
</pre></td><td>[FATAL]</td></tr>
- <tr class="" id="l82"><td><a href="#l82"><span>82</span></a></td><td><pre>ERROR pkgcore: returned val from gen_metadata was 'False'
+ <tr class="" id="l81"><td><a href="#l81"><span>81</span></a></td><td><pre>ERROR pkgcore: returned val from gen_metadata was 'False'
</pre></td></tr>
- <tr class="err" id="l83"><td><a href="#l83"><span>83</span></a></td><td><pre>!!! caught exception False while processing ebuild src: games-simulation/vegastrike-9999
+ <tr class="err" id="l82"><td><a href="#l82"><span>82</span></a></td><td><pre>!!! caught exception False while processing ebuild src: games-simulation/vegastrike-9999
</pre></td><td>[FATAL]</td></tr>
- <tr class="" id="l84"><td><a href="#l84"><span>84</span></a></td><td><pre>ERROR pkgcore: returned val from gen_metadata was 'False'
+ <tr class="" id="l83"><td><a href="#l83"><span>83</span></a></td><td><pre>ERROR pkgcore: returned val from gen_metadata was 'False'
</pre></td></tr>
- <tr class="err" id="l85"><td><a href="#l85"><span>85</span></a></td><td><pre>caught exception '%s' while processing '%s'(MetadataException('Metadata Exception: pkg ebuild src: dev-util/nvidia-texture-tools-2.0.8, attr description\nerror: Metadata Exception: pkg ebuild src: dev-util/nvidia-texture-tools-2.0.8, attr data\nerror: False',), &lt;&lt;class 'pkgcore.ebuild.ebuild_src.package'&gt; cpv='dev-util/nvidia-texture-tools-2.0.8' @0x7f98357d5bd8&gt;)
+ <tr class="err" id="l84"><td><a href="#l84"><span>84</span></a></td><td><pre>caught exception '%s' while processing '%s'(MetadataException('Metadata Exception: pkg ebuild src: dev-util/nvidia-texture-tools-2.0.8, attr description\nerror: Metadata Exception: pkg ebuild src: dev-util/nvidia-texture-tools-2.0.8, attr data\nerror: False',), &lt;&lt;class 'pkgcore.ebuild.ebuild_src.package'&gt; cpv='dev-util/nvidia-texture-tools-2.0.8' @0x7ff641c3cbd8&gt;)
</pre></td><td>[FATAL]</td></tr>
- <tr class="err" id="l86"><td><a href="#l86"><span>86</span></a></td><td><pre>caught exception '%s' while processing '%s'(MetadataException('Metadata Exception: pkg ebuild src: games-simulation/vegastrike-data-9999, attr description\nerror: Metadata Exception: pkg ebuild src: games-simulation/vegastrike-data-9999, attr data\nerror: inherit requires an unknown eclass, python cannot be found',), &lt;&lt;class 'pkgcore.ebuild.ebuild_src.package'&gt; cpv='games-simulation/vegastrike-data-9999' @0x7f983336f198&gt;)
+ <tr class="err" id="l85"><td><a href="#l85"><span>85</span></a></td><td><pre>caught exception '%s' while processing '%s'(MetadataException('Metadata Exception: pkg ebuild src: games-simulation/vegastrike-data-9999, attr description\nerror: Metadata Exception: pkg ebuild src: games-simulation/vegastrike-data-9999, attr data\nerror: inherit requires an unknown eclass, python cannot be found',), &lt;&lt;class 'pkgcore.ebuild.ebuild_src.package'&gt; cpv='games-simulation/vegastrike-data-9999' @0x7ff63f7d6198&gt;)
</pre></td><td>[FATAL]</td></tr>
- <tr class="" id="l87"><td><a href="#l87"><span>87</span></a></td><td><pre>ERROR pkgcore: returned val from gen_metadata was 'False'
+ <tr class="" id="l86"><td><a href="#l86"><span>86</span></a></td><td><pre>ERROR pkgcore: returned val from gen_metadata was 'False'
</pre></td></tr>
- <tr class="err" id="l88"><td><a href="#l88"><span>88</span></a></td><td><pre>caught exception '%s' while processing '%s'(MetadataException('Metadata Exception: pkg ebuild src: games-simulation/vegastrike-9999, attr description\nerror: Metadata Exception: pkg ebuild src: games-simulation/vegastrike-9999, attr data\nerror: False',), &lt;&lt;class 'pkgcore.ebuild.ebuild_src.package'&gt; cpv='games-simulation/vegastrike-9999' @0x7f98357d5bd8&gt;)
+ <tr class="err" id="l87"><td><a href="#l87"><span>87</span></a></td><td><pre>caught exception '%s' while processing '%s'(MetadataException('Metadata Exception: pkg ebuild src: games-simulation/vegastrike-9999, attr description\nerror: Metadata Exception: pkg ebuild src: games-simulation/vegastrike-9999, attr data\nerror: False',), &lt;&lt;class 'pkgcore.ebuild.ebuild_src.package'&gt; cpv='games-simulation/vegastrike-9999' @0x7ff641c3cbd8&gt;)
</pre></td><td>[FATAL]</td></tr>
- <tr class="" id="l89"><td><a href="#l89"><span>89</span></a></td><td><pre> * Cache regen failed with 1
+ <tr class="" id="l88"><td><a href="#l88"><span>88</span></a></td><td><pre> * Cache regen failed with 1
</pre></td></tr>
</table>