summaryrefslogtreecommitdiff
diff options
context:
space:
mode:
-rw-r--r--R_Overlay.html6
-rw-r--r--R_Overlay.txt6
-rw-r--r--belak.html4
-rw-r--r--belak.txt4
-rw-r--r--betelgeuse.html4
-rw-r--r--betelgeuse.txt4
-rw-r--r--ephemeral.html18
-rw-r--r--ephemeral.txt18
-rw-r--r--fidonet.html6
-rw-r--r--fidonet.txt6
-rw-r--r--gbin.html6
-rw-r--r--gbin.txt6
-rw-r--r--gentoo-el.html10
-rw-r--r--gentoo-el.txt10
-rw-r--r--gentoo-guis.html68
-rw-r--r--gentoo-guis.txt1
-rw-r--r--hacking-gentoo.html2
-rw-r--r--hacking-gentoo.txt2
-rw-r--r--index.html2
-rw-r--r--jensp.html4
-rw-r--r--jensp.txt4
-rw-r--r--kormoc.html68
-rw-r--r--kormoc.txt1
-rw-r--r--loongson.html10
-rw-r--r--loongson.txt10
-rw-r--r--lordvan.html2
-rw-r--r--lordvan.txt2
-rw-r--r--luke-jr.html68
-rw-r--r--luke-jr.txt1
-rw-r--r--n4g.html2
-rw-r--r--n4g.txt2
-rw-r--r--n8x0.html6
-rw-r--r--n8x0.txt6
-rw-r--r--o11c.html2
-rw-r--r--o11c.txt2
-rw-r--r--pentoo.html28
-rw-r--r--pentoo.txt8
-rw-r--r--quantumsummers.html4
-rw-r--r--quantumsummers.txt4
-rw-r--r--rainyday.html46
-rw-r--r--rainyday.txt46
-rw-r--r--raw.html4
-rw-r--r--raw.txt4
-rw-r--r--rebel.html2
-rw-r--r--rebel.txt2
-rw-r--r--sigrok.html12
-rw-r--r--sigrok.txt12
-rw-r--r--sunrise.html4
-rw-r--r--sunrise.txt4
-rw-r--r--swegener.html4
-rw-r--r--swegener.txt4
-rw-r--r--triquetra.html2
-rw-r--r--triquetra.txt2
-rw-r--r--underlay.html68
-rw-r--r--underlay.txt1
-rw-r--r--vdr-testing.html4
-rw-r--r--vdr-testing.txt4
-rw-r--r--voip.html68
-rw-r--r--voip.txt1
-rw-r--r--wtk.html6
-rw-r--r--wtk.txt6
-rw-r--r--wuodan.html2
-rw-r--r--wuodan.txt2
-rw-r--r--xmw.html2
-rw-r--r--xmw.txt2
-rw-r--r--zugaina.html4
-rw-r--r--zugaina.txt4
67 files changed, 377 insertions, 362 deletions
diff --git a/R_Overlay.html b/R_Overlay.html
index 452667f8d07c..13d1ffa7e321 100644
--- a/R_Overlay.html
+++ b/R_Overlay.html
@@ -54,19 +54,19 @@
</pre></td></tr>
<tr class="" id="l22"><td><a href="#l22"><span>22</span></a></td><td><pre>Matched data: 0 bytes
</pre></td></tr>
- <tr class="" id="l23"><td><a href="#l23"><span>23</span></a></td><td><pre>File list size: 2.69M
+ <tr class="" id="l23"><td><a href="#l23"><span>23</span></a></td><td><pre>File list size: 2.68M
</pre></td></tr>
<tr class="" id="l24"><td><a href="#l24"><span>24</span></a></td><td><pre>File list generation time: 0.001 seconds
</pre></td></tr>
<tr class="" id="l25"><td><a href="#l25"><span>25</span></a></td><td><pre>File list transfer time: 0.000 seconds
</pre></td></tr>
- <tr class="" id="l26"><td><a href="#l26"><span>26</span></a></td><td><pre>Total bytes sent: 13.53K
+ <tr class="" id="l26"><td><a href="#l26"><span>26</span></a></td><td><pre>Total bytes sent: 13.62K
</pre></td></tr>
<tr class="" id="l27"><td><a href="#l27"><span>27</span></a></td><td><pre>Total bytes received: 2.89M
</pre></td></tr>
<tr class="" id="l28"><td><a href="#l28"><span>28</span></a></td><td><pre>
</pre></td></tr>
- <tr class="" id="l29"><td><a href="#l29"><span>29</span></a></td><td><pre>sent 13.53K bytes received 2.89M bytes 187.06K bytes/sec
+ <tr class="" id="l29"><td><a href="#l29"><span>29</span></a></td><td><pre>sent 13.62K bytes received 2.89M bytes 187.06K bytes/sec
</pre></td></tr>
<tr class="" id="l30"><td><a href="#l30"><span>30</span></a></td><td><pre>total size is 71.55M speedup is 24.68
</pre></td></tr>
diff --git a/R_Overlay.txt b/R_Overlay.txt
index d5ee3c57c054..f93dd4922dfd 100644
--- a/R_Overlay.txt
+++ b/R_Overlay.txt
@@ -20,13 +20,13 @@ Total file size: 71.55M bytes
Total transferred file size: 0 bytes
Literal data: 0 bytes
Matched data: 0 bytes
-File list size: 2.69M
+File list size: 2.68M
File list generation time: 0.001 seconds
File list transfer time: 0.000 seconds
-Total bytes sent: 13.53K
+Total bytes sent: 13.62K
Total bytes received: 2.89M
-sent 13.53K bytes received 2.89M bytes 187.06K bytes/sec
+sent 13.62K bytes received 2.89M bytes 187.06K bytes/sec
total size is 71.55M speedup is 24.68
*** syncing R_Overlay
*** synced R_Overlay
diff --git a/belak.html b/belak.html
index 426f3fca5e54..27286b7d553a 100644
--- a/belak.html
+++ b/belak.html
@@ -246,11 +246,11 @@
</pre></td><td>[FATAL]</td></tr>
<tr class="" id="l118"><td><a href="#l118"><span>118</span></a></td><td><pre>ERROR pkgcore: returned val from gen_metadata was 'False'
</pre></td></tr>
- <tr class="err" id="l119"><td><a href="#l119"><span>119</span></a></td><td><pre>caught exception '%s' while processing '%s'(MetadataException('Metadata Exception: pkg ebuild src: app-editors/scribes-0.4-r954, attr description\nerror: Metadata Exception: pkg ebuild src: app-editors/scribes-0.4-r954, attr data\nerror: False',), &lt;&lt;class 'pkgcore.ebuild.ebuild_src.package'&gt; cpv='app-editors/scribes-0.4-r954' @0x7f961efa8410&gt;)
+ <tr class="err" id="l119"><td><a href="#l119"><span>119</span></a></td><td><pre>caught exception '%s' while processing '%s'(MetadataException('Metadata Exception: pkg ebuild src: app-editors/scribes-0.4-r954, attr description\nerror: Metadata Exception: pkg ebuild src: app-editors/scribes-0.4-r954, attr data\nerror: False',), &lt;&lt;class 'pkgcore.ebuild.ebuild_src.package'&gt; cpv='app-editors/scribes-0.4-r954' @0x7f5593724410&gt;)
</pre></td><td>[FATAL]</td></tr>
<tr class="" id="l120"><td><a href="#l120"><span>120</span></a></td><td><pre>ERROR pkgcore: returned val from gen_metadata was 'False'
</pre></td></tr>
- <tr class="err" id="l121"><td><a href="#l121"><span>121</span></a></td><td><pre>caught exception '%s' while processing '%s'(MetadataException('Metadata Exception: pkg ebuild src: app-editors/scribes-9999, attr description\nerror: Metadata Exception: pkg ebuild src: app-editors/scribes-9999, attr data\nerror: False',), &lt;&lt;class 'pkgcore.ebuild.ebuild_src.package'&gt; cpv='app-editors/scribes-9999' @0x7f961efa82d0&gt;)
+ <tr class="err" id="l121"><td><a href="#l121"><span>121</span></a></td><td><pre>caught exception '%s' while processing '%s'(MetadataException('Metadata Exception: pkg ebuild src: app-editors/scribes-9999, attr description\nerror: Metadata Exception: pkg ebuild src: app-editors/scribes-9999, attr data\nerror: False',), &lt;&lt;class 'pkgcore.ebuild.ebuild_src.package'&gt; cpv='app-editors/scribes-9999' @0x7f55937242d0&gt;)
</pre></td><td>[FATAL]</td></tr>
<tr class="" id="l122"><td><a href="#l122"><span>122</span></a></td><td><pre> * Cache regen failed with 1
</pre></td></tr>
diff --git a/belak.txt b/belak.txt
index bb4c7cc773f5..ac2206ad0d5f 100644
--- a/belak.txt
+++ b/belak.txt
@@ -116,7 +116,7 @@ ERROR pkgcore: returned val from gen_metadata was 'False'
ERROR pkgcore: returned val from gen_metadata was 'False'
!!! caught exception False while processing ebuild src: app-editors/scribes-9999
ERROR pkgcore: returned val from gen_metadata was 'False'
-caught exception '%s' while processing '%s'(MetadataException('Metadata Exception: pkg ebuild src: app-editors/scribes-0.4-r954, attr description\nerror: Metadata Exception: pkg ebuild src: app-editors/scribes-0.4-r954, attr data\nerror: False',), <<class 'pkgcore.ebuild.ebuild_src.package'> cpv='app-editors/scribes-0.4-r954' @0x7f961efa8410>)
+caught exception '%s' while processing '%s'(MetadataException('Metadata Exception: pkg ebuild src: app-editors/scribes-0.4-r954, attr description\nerror: Metadata Exception: pkg ebuild src: app-editors/scribes-0.4-r954, attr data\nerror: False',), <<class 'pkgcore.ebuild.ebuild_src.package'> cpv='app-editors/scribes-0.4-r954' @0x7f5593724410>)
ERROR pkgcore: returned val from gen_metadata was 'False'
-caught exception '%s' while processing '%s'(MetadataException('Metadata Exception: pkg ebuild src: app-editors/scribes-9999, attr description\nerror: Metadata Exception: pkg ebuild src: app-editors/scribes-9999, attr data\nerror: False',), <<class 'pkgcore.ebuild.ebuild_src.package'> cpv='app-editors/scribes-9999' @0x7f961efa82d0>)
+caught exception '%s' while processing '%s'(MetadataException('Metadata Exception: pkg ebuild src: app-editors/scribes-9999, attr description\nerror: Metadata Exception: pkg ebuild src: app-editors/scribes-9999, attr data\nerror: False',), <<class 'pkgcore.ebuild.ebuild_src.package'> cpv='app-editors/scribes-9999' @0x7f55937242d0>)
* Cache regen failed with 1
diff --git a/betelgeuse.html b/betelgeuse.html
index 3e49e4ac4a88..1f0ac538d58d 100644
--- a/betelgeuse.html
+++ b/betelgeuse.html
@@ -248,11 +248,11 @@
</pre></td><td>[FATAL]</td></tr>
<tr class="" id="l119"><td><a href="#l119"><span>119</span></a></td><td><pre>ERROR pkgcore: returned val from gen_metadata was 'False'
</pre></td></tr>
- <tr class="err" id="l120"><td><a href="#l120"><span>120</span></a></td><td><pre>caught exception '%s' while processing '%s'(MetadataException('Metadata Exception: pkg ebuild src: x11-libs/pango-1.14.10, attr description\nerror: Metadata Exception: pkg ebuild src: x11-libs/pango-1.14.10, attr data\nerror: False',), &lt;&lt;class 'pkgcore.ebuild.ebuild_src.package'&gt; cpv='x11-libs/pango-1.14.10' @0x7fde3f630190&gt;)
+ <tr class="err" id="l120"><td><a href="#l120"><span>120</span></a></td><td><pre>caught exception '%s' while processing '%s'(MetadataException('Metadata Exception: pkg ebuild src: x11-libs/pango-1.14.10, attr description\nerror: Metadata Exception: pkg ebuild src: x11-libs/pango-1.14.10, attr data\nerror: False',), &lt;&lt;class 'pkgcore.ebuild.ebuild_src.package'&gt; cpv='x11-libs/pango-1.14.10' @0x7fd34c38b190&gt;)
</pre></td><td>[FATAL]</td></tr>
<tr class="" id="l121"><td><a href="#l121"><span>121</span></a></td><td><pre>ERROR pkgcore: returned val from gen_metadata was 'False'
</pre></td></tr>
- <tr class="err" id="l122"><td><a href="#l122"><span>122</span></a></td><td><pre>caught exception '%s' while processing '%s'(MetadataException('Metadata Exception: pkg ebuild src: x11-libs/pango-1.16.3, attr description\nerror: Metadata Exception: pkg ebuild src: x11-libs/pango-1.16.3, attr data\nerror: False',), &lt;&lt;class 'pkgcore.ebuild.ebuild_src.package'&gt; cpv='x11-libs/pango-1.16.3' @0x7fde3f6302d0&gt;)
+ <tr class="err" id="l122"><td><a href="#l122"><span>122</span></a></td><td><pre>caught exception '%s' while processing '%s'(MetadataException('Metadata Exception: pkg ebuild src: x11-libs/pango-1.16.3, attr description\nerror: Metadata Exception: pkg ebuild src: x11-libs/pango-1.16.3, attr data\nerror: False',), &lt;&lt;class 'pkgcore.ebuild.ebuild_src.package'&gt; cpv='x11-libs/pango-1.16.3' @0x7fd34c38b2d0&gt;)
</pre></td><td>[FATAL]</td></tr>
<tr class="" id="l123"><td><a href="#l123"><span>123</span></a></td><td><pre> * Cache regen failed with 1
</pre></td></tr>
diff --git a/betelgeuse.txt b/betelgeuse.txt
index 86367902c250..e8593894107c 100644
--- a/betelgeuse.txt
+++ b/betelgeuse.txt
@@ -117,7 +117,7 @@ ERROR pkgcore: returned val from gen_metadata was 'False'
ERROR pkgcore: returned val from gen_metadata was 'False'
!!! caught exception False while processing ebuild src: x11-libs/pango-1.16.3
ERROR pkgcore: returned val from gen_metadata was 'False'
-caught exception '%s' while processing '%s'(MetadataException('Metadata Exception: pkg ebuild src: x11-libs/pango-1.14.10, attr description\nerror: Metadata Exception: pkg ebuild src: x11-libs/pango-1.14.10, attr data\nerror: False',), <<class 'pkgcore.ebuild.ebuild_src.package'> cpv='x11-libs/pango-1.14.10' @0x7fde3f630190>)
+caught exception '%s' while processing '%s'(MetadataException('Metadata Exception: pkg ebuild src: x11-libs/pango-1.14.10, attr description\nerror: Metadata Exception: pkg ebuild src: x11-libs/pango-1.14.10, attr data\nerror: False',), <<class 'pkgcore.ebuild.ebuild_src.package'> cpv='x11-libs/pango-1.14.10' @0x7fd34c38b190>)
ERROR pkgcore: returned val from gen_metadata was 'False'
-caught exception '%s' while processing '%s'(MetadataException('Metadata Exception: pkg ebuild src: x11-libs/pango-1.16.3, attr description\nerror: Metadata Exception: pkg ebuild src: x11-libs/pango-1.16.3, attr data\nerror: False',), <<class 'pkgcore.ebuild.ebuild_src.package'> cpv='x11-libs/pango-1.16.3' @0x7fde3f6302d0>)
+caught exception '%s' while processing '%s'(MetadataException('Metadata Exception: pkg ebuild src: x11-libs/pango-1.16.3, attr description\nerror: Metadata Exception: pkg ebuild src: x11-libs/pango-1.16.3, attr data\nerror: False',), <<class 'pkgcore.ebuild.ebuild_src.package'> cpv='x11-libs/pango-1.16.3' @0x7fd34c38b2d0>)
* Cache regen failed with 1
diff --git a/ephemeral.html b/ephemeral.html
index 287d9860e6ac..1eb526b70a6c 100644
--- a/ephemeral.html
+++ b/ephemeral.html
@@ -860,27 +860,27 @@
</pre></td><td>[FATAL]</td></tr>
<tr class="" id="l425"><td><a href="#l425"><span>425</span></a></td><td><pre>ERROR pkgcore: returned val from gen_metadata was 'False'
</pre></td></tr>
- <tr class="err" id="l426"><td><a href="#l426"><span>426</span></a></td><td><pre>caught exception '%s' while processing '%s'(MetadataException('Metadata Exception: pkg ebuild src: app-emulation/virt-v2v-0.8.9-r1, attr description\nerror: Metadata Exception: pkg ebuild src: app-emulation/virt-v2v-0.8.9-r1, attr data\nerror: False',), &lt;&lt;class 'pkgcore.ebuild.ebuild_src.package'&gt; cpv='app-emulation/virt-v2v-0.8.9-r1' @0x7ff6e494a550&gt;)
+ <tr class="err" id="l426"><td><a href="#l426"><span>426</span></a></td><td><pre>caught exception '%s' while processing '%s'(MetadataException('Metadata Exception: pkg ebuild src: app-emulation/virt-v2v-0.8.9-r1, attr description\nerror: Metadata Exception: pkg ebuild src: app-emulation/virt-v2v-0.8.9-r1, attr data\nerror: False',), &lt;&lt;class 'pkgcore.ebuild.ebuild_src.package'&gt; cpv='app-emulation/virt-v2v-0.8.9-r1' @0x7f49cc52c550&gt;)
</pre></td><td>[FATAL]</td></tr>
<tr class="" id="l427"><td><a href="#l427"><span>427</span></a></td><td><pre>ERROR pkgcore: returned val from gen_metadata was 'False'
</pre></td></tr>
- <tr class="err" id="l428"><td><a href="#l428"><span>428</span></a></td><td><pre>caught exception '%s' while processing '%s'(MetadataException('Metadata Exception: pkg ebuild src: app-emulation/virt-v2v-0.9.0, attr description\nerror: Metadata Exception: pkg ebuild src: app-emulation/virt-v2v-0.9.0, attr data\nerror: False',), &lt;&lt;class 'pkgcore.ebuild.ebuild_src.package'&gt; cpv='app-emulation/virt-v2v-0.9.0' @0x7ff6e494a690&gt;)
+ <tr class="err" id="l428"><td><a href="#l428"><span>428</span></a></td><td><pre>caught exception '%s' while processing '%s'(MetadataException('Metadata Exception: pkg ebuild src: app-emulation/virt-v2v-0.9.0, attr description\nerror: Metadata Exception: pkg ebuild src: app-emulation/virt-v2v-0.9.0, attr data\nerror: False',), &lt;&lt;class 'pkgcore.ebuild.ebuild_src.package'&gt; cpv='app-emulation/virt-v2v-0.9.0' @0x7f49cc52c690&gt;)
</pre></td><td>[FATAL]</td></tr>
<tr class="" id="l429"><td><a href="#l429"><span>429</span></a></td><td><pre>ERROR pkgcore: returned val from gen_metadata was 'False'
</pre></td></tr>
- <tr class="err" id="l430"><td><a href="#l430"><span>430</span></a></td><td><pre>caught exception '%s' while processing '%s'(MetadataException('Metadata Exception: pkg ebuild src: dev-perl/Archive-Extract-0.72, attr description\nerror: Metadata Exception: pkg ebuild src: dev-perl/Archive-Extract-0.72, attr data\nerror: False',), &lt;&lt;class 'pkgcore.ebuild.ebuild_src.package'&gt; cpv='dev-perl/Archive-Extract-0.72' @0x7ff6e49597d0&gt;)
+ <tr class="err" id="l430"><td><a href="#l430"><span>430</span></a></td><td><pre>caught exception '%s' while processing '%s'(MetadataException('Metadata Exception: pkg ebuild src: dev-perl/Archive-Extract-0.72, attr description\nerror: Metadata Exception: pkg ebuild src: dev-perl/Archive-Extract-0.72, attr data\nerror: False',), &lt;&lt;class 'pkgcore.ebuild.ebuild_src.package'&gt; cpv='dev-perl/Archive-Extract-0.72' @0x7f49cc53b7d0&gt;)
</pre></td><td>[FATAL]</td></tr>
<tr class="" id="l431"><td><a href="#l431"><span>431</span></a></td><td><pre>ERROR pkgcore: returned val from gen_metadata was 'False'
</pre></td></tr>
- <tr class="err" id="l432"><td><a href="#l432"><span>432</span></a></td><td><pre>caught exception '%s' while processing '%s'(MetadataException('Metadata Exception: pkg ebuild src: dev-perl/DateTime-Format-Epoch-0.13, attr description\nerror: Metadata Exception: pkg ebuild src: dev-perl/DateTime-Format-Epoch-0.13, attr data\nerror: False',), &lt;&lt;class 'pkgcore.ebuild.ebuild_src.package'&gt; cpv='dev-perl/DateTime-Format-Epoch-0.13' @0x7ff6e494a690&gt;)
+ <tr class="err" id="l432"><td><a href="#l432"><span>432</span></a></td><td><pre>caught exception '%s' while processing '%s'(MetadataException('Metadata Exception: pkg ebuild src: dev-perl/DateTime-Format-Epoch-0.13, attr description\nerror: Metadata Exception: pkg ebuild src: dev-perl/DateTime-Format-Epoch-0.13, attr data\nerror: False',), &lt;&lt;class 'pkgcore.ebuild.ebuild_src.package'&gt; cpv='dev-perl/DateTime-Format-Epoch-0.13' @0x7f49cc52c690&gt;)
</pre></td><td>[FATAL]</td></tr>
<tr class="" id="l433"><td><a href="#l433"><span>433</span></a></td><td><pre>ERROR pkgcore: returned val from gen_metadata was 'False'
</pre></td></tr>
- <tr class="err" id="l434"><td><a href="#l434"><span>434</span></a></td><td><pre>caught exception '%s' while processing '%s'(MetadataException('Metadata Exception: pkg ebuild src: dev-perl/Proc-ParallelLoop-0.5, attr description\nerror: Metadata Exception: pkg ebuild src: dev-perl/Proc-ParallelLoop-0.5, attr data\nerror: False',), &lt;&lt;class 'pkgcore.ebuild.ebuild_src.package'&gt; cpv='dev-perl/Proc-ParallelLoop-0.5' @0x7ff6e49597d0&gt;)
+ <tr class="err" id="l434"><td><a href="#l434"><span>434</span></a></td><td><pre>caught exception '%s' while processing '%s'(MetadataException('Metadata Exception: pkg ebuild src: dev-perl/Proc-ParallelLoop-0.5, attr description\nerror: Metadata Exception: pkg ebuild src: dev-perl/Proc-ParallelLoop-0.5, attr data\nerror: False',), &lt;&lt;class 'pkgcore.ebuild.ebuild_src.package'&gt; cpv='dev-perl/Proc-ParallelLoop-0.5' @0x7f49cc53b7d0&gt;)
</pre></td><td>[FATAL]</td></tr>
<tr class="" id="l435"><td><a href="#l435"><span>435</span></a></td><td><pre>ERROR pkgcore: returned val from gen_metadata was 'False'
</pre></td></tr>
- <tr class="err" id="l436"><td><a href="#l436"><span>436</span></a></td><td><pre>caught exception '%s' while processing '%s'(MetadataException('Metadata Exception: pkg ebuild src: dev-perl/Term-Prompt-1.04, attr description\nerror: Metadata Exception: pkg ebuild src: dev-perl/Term-Prompt-1.04, attr data\nerror: False',), &lt;&lt;class 'pkgcore.ebuild.ebuild_src.package'&gt; cpv='dev-perl/Term-Prompt-1.04' @0x7ff6e494a690&gt;)
+ <tr class="err" id="l436"><td><a href="#l436"><span>436</span></a></td><td><pre>caught exception '%s' while processing '%s'(MetadataException('Metadata Exception: pkg ebuild src: dev-perl/Term-Prompt-1.04, attr description\nerror: Metadata Exception: pkg ebuild src: dev-perl/Term-Prompt-1.04, attr data\nerror: False',), &lt;&lt;class 'pkgcore.ebuild.ebuild_src.package'&gt; cpv='dev-perl/Term-Prompt-1.04' @0x7f49cc52c690&gt;)
</pre></td><td>[FATAL]</td></tr>
<tr class="" id="l437"><td><a href="#l437"><span>437</span></a></td><td><pre>ERROR pkgcore: returned val from gen_metadata was 'False'
</pre></td></tr>
@@ -992,15 +992,15 @@
</pre></td></tr>
<tr class="" id="l491"><td><a href="#l491"><span>491</span></a></td><td><pre>
</pre></td></tr>
- <tr class="" id="l492"><td><a href="#l492"><span>492</span></a></td><td><pre>rc.package'&gt; cpv='media-sound/phonoripper-0.10.1-r3' @0x7ff6e4965190&gt;)
+ <tr class="" id="l492"><td><a href="#l492"><span>492</span></a></td><td><pre>rc.package'&gt; cpv='media-sound/phonoripper-0.10.1-r3' @0x7f49cc547190&gt;)
</pre></td></tr>
<tr class="" id="l493"><td><a href="#l493"><span>493</span></a></td><td><pre>ERROR pkgcore: returned val from gen_metadata was 'False'
</pre></td></tr>
- <tr class="err" id="l494"><td><a href="#l494"><span>494</span></a></td><td><pre>caught exception '%s' while processing '%s'(MetadataException('Metadata Exception: pkg ebuild src: dev-libs/libconcord-0.23, attr description\nerror: Metadata Exception: pkg ebuild src: dev-libs/libconcord-0.23, attr data\nerror: False',), &lt;&lt;class 'pkgcore.ebuild.ebuild_src.package'&gt; cpv='dev-libs/libconcord-0.23' @0x7ff6e4965410&gt;)
+ <tr class="err" id="l494"><td><a href="#l494"><span>494</span></a></td><td><pre>caught exception '%s' while processing '%s'(MetadataException('Metadata Exception: pkg ebuild src: dev-libs/libconcord-0.23, attr description\nerror: Metadata Exception: pkg ebuild src: dev-libs/libconcord-0.23, attr data\nerror: False',), &lt;&lt;class 'pkgcore.ebuild.ebuild_src.package'&gt; cpv='dev-libs/libconcord-0.23' @0x7f49cc547410&gt;)
</pre></td><td>[FATAL]</td></tr>
<tr class="" id="l495"><td><a href="#l495"><span>495</span></a></td><td><pre>ERROR pkgcore: returned val from gen_metadata was 'False'
</pre></td></tr>
- <tr class="err" id="l496"><td><a href="#l496"><span>496</span></a></td><td><pre>caught exception '%s' while processing '%s'(MetadataException('Metadata Exception: pkg ebuild src: dev-libs/libconcord-0.24, attr description\nerror: Metadata Exception: pkg ebuild src: dev-libs/libconcord-0.24, attr data\nerror: False',), &lt;&lt;class 'pkgcore.ebuild.ebuild_src.package'&gt; cpv='dev-libs/libconcord-0.24' @0x7ff6e4965190&gt;)
+ <tr class="err" id="l496"><td><a href="#l496"><span>496</span></a></td><td><pre>caught exception '%s' while processing '%s'(MetadataException('Metadata Exception: pkg ebuild src: dev-libs/libconcord-0.24, attr description\nerror: Metadata Exception: pkg ebuild src: dev-libs/libconcord-0.24, attr data\nerror: False',), &lt;&lt;class 'pkgcore.ebuild.ebuild_src.package'&gt; cpv='dev-libs/libconcord-0.24' @0x7f49cc547190&gt;)
</pre></td><td>[FATAL]</td></tr>
<tr class="" id="l497"><td><a href="#l497"><span>497</span></a></td><td><pre> * Cache regen failed with 1
</pre></td></tr>
diff --git a/ephemeral.txt b/ephemeral.txt
index 065ddd3a71fa..996cd3f96876 100644
--- a/ephemeral.txt
+++ b/ephemeral.txt
@@ -423,17 +423,17 @@ ERROR pkgcore: returned val from gen_metadata was 'False'
ERROR pkgcore: returned val from gen_metadata was 'False'
!!! caught exception False while processing ebuild src: dev-libs/libconcord-0.24
ERROR pkgcore: returned val from gen_metadata was 'False'
-caught exception '%s' while processing '%s'(MetadataException('Metadata Exception: pkg ebuild src: app-emulation/virt-v2v-0.8.9-r1, attr description\nerror: Metadata Exception: pkg ebuild src: app-emulation/virt-v2v-0.8.9-r1, attr data\nerror: False',), <<class 'pkgcore.ebuild.ebuild_src.package'> cpv='app-emulation/virt-v2v-0.8.9-r1' @0x7ff6e494a550>)
+caught exception '%s' while processing '%s'(MetadataException('Metadata Exception: pkg ebuild src: app-emulation/virt-v2v-0.8.9-r1, attr description\nerror: Metadata Exception: pkg ebuild src: app-emulation/virt-v2v-0.8.9-r1, attr data\nerror: False',), <<class 'pkgcore.ebuild.ebuild_src.package'> cpv='app-emulation/virt-v2v-0.8.9-r1' @0x7f49cc52c550>)
ERROR pkgcore: returned val from gen_metadata was 'False'
-caught exception '%s' while processing '%s'(MetadataException('Metadata Exception: pkg ebuild src: app-emulation/virt-v2v-0.9.0, attr description\nerror: Metadata Exception: pkg ebuild src: app-emulation/virt-v2v-0.9.0, attr data\nerror: False',), <<class 'pkgcore.ebuild.ebuild_src.package'> cpv='app-emulation/virt-v2v-0.9.0' @0x7ff6e494a690>)
+caught exception '%s' while processing '%s'(MetadataException('Metadata Exception: pkg ebuild src: app-emulation/virt-v2v-0.9.0, attr description\nerror: Metadata Exception: pkg ebuild src: app-emulation/virt-v2v-0.9.0, attr data\nerror: False',), <<class 'pkgcore.ebuild.ebuild_src.package'> cpv='app-emulation/virt-v2v-0.9.0' @0x7f49cc52c690>)
ERROR pkgcore: returned val from gen_metadata was 'False'
-caught exception '%s' while processing '%s'(MetadataException('Metadata Exception: pkg ebuild src: dev-perl/Archive-Extract-0.72, attr description\nerror: Metadata Exception: pkg ebuild src: dev-perl/Archive-Extract-0.72, attr data\nerror: False',), <<class 'pkgcore.ebuild.ebuild_src.package'> cpv='dev-perl/Archive-Extract-0.72' @0x7ff6e49597d0>)
+caught exception '%s' while processing '%s'(MetadataException('Metadata Exception: pkg ebuild src: dev-perl/Archive-Extract-0.72, attr description\nerror: Metadata Exception: pkg ebuild src: dev-perl/Archive-Extract-0.72, attr data\nerror: False',), <<class 'pkgcore.ebuild.ebuild_src.package'> cpv='dev-perl/Archive-Extract-0.72' @0x7f49cc53b7d0>)
ERROR pkgcore: returned val from gen_metadata was 'False'
-caught exception '%s' while processing '%s'(MetadataException('Metadata Exception: pkg ebuild src: dev-perl/DateTime-Format-Epoch-0.13, attr description\nerror: Metadata Exception: pkg ebuild src: dev-perl/DateTime-Format-Epoch-0.13, attr data\nerror: False',), <<class 'pkgcore.ebuild.ebuild_src.package'> cpv='dev-perl/DateTime-Format-Epoch-0.13' @0x7ff6e494a690>)
+caught exception '%s' while processing '%s'(MetadataException('Metadata Exception: pkg ebuild src: dev-perl/DateTime-Format-Epoch-0.13, attr description\nerror: Metadata Exception: pkg ebuild src: dev-perl/DateTime-Format-Epoch-0.13, attr data\nerror: False',), <<class 'pkgcore.ebuild.ebuild_src.package'> cpv='dev-perl/DateTime-Format-Epoch-0.13' @0x7f49cc52c690>)
ERROR pkgcore: returned val from gen_metadata was 'False'
-caught exception '%s' while processing '%s'(MetadataException('Metadata Exception: pkg ebuild src: dev-perl/Proc-ParallelLoop-0.5, attr description\nerror: Metadata Exception: pkg ebuild src: dev-perl/Proc-ParallelLoop-0.5, attr data\nerror: False',), <<class 'pkgcore.ebuild.ebuild_src.package'> cpv='dev-perl/Proc-ParallelLoop-0.5' @0x7ff6e49597d0>)
+caught exception '%s' while processing '%s'(MetadataException('Metadata Exception: pkg ebuild src: dev-perl/Proc-ParallelLoop-0.5, attr description\nerror: Metadata Exception: pkg ebuild src: dev-perl/Proc-ParallelLoop-0.5, attr data\nerror: False',), <<class 'pkgcore.ebuild.ebuild_src.package'> cpv='dev-perl/Proc-ParallelLoop-0.5' @0x7f49cc53b7d0>)
ERROR pkgcore: returned val from gen_metadata was 'False'
-caught exception '%s' while processing '%s'(MetadataException('Metadata Exception: pkg ebuild src: dev-perl/Term-Prompt-1.04, attr description\nerror: Metadata Exception: pkg ebuild src: dev-perl/Term-Prompt-1.04, attr data\nerror: False',), <<class 'pkgcore.ebuild.ebuild_src.package'> cpv='dev-perl/Term-Prompt-1.04' @0x7ff6e494a690>)
+caught exception '%s' while processing '%s'(MetadataException('Metadata Exception: pkg ebuild src: dev-perl/Term-Prompt-1.04, attr description\nerror: Metadata Exception: pkg ebuild src: dev-perl/Term-Prompt-1.04, attr data\nerror: False',), <<class 'pkgcore.ebuild.ebuild_src.package'> cpv='dev-perl/Term-Prompt-1.04' @0x7f49cc52c690>)
ERROR pkgcore: returned val from gen_metadata was 'False'
caught exception '%s' while processing '%s'(MetadataException('Metadata Exception: pkg ebuild src: media-sound/phonoripper-0.10.1-r3, attr description\nerror: Metadata Exception: pkg ebuild src: media-sound/phonoripper-0.10.1-r3, attr data\nerror: False',), <<class 'pkgcore.ebuild.ebuild_s
!!! ERROR: dev-libs/libconcord-0.23 failed.
@@ -489,9 +489,9 @@ caught exception '%s' while processing '%s'(MetadataException('Metadata Exceptio
!!! The die message:
!!! EAPI=4 is not supported by perl-functions.eclass
-rc.package'> cpv='media-sound/phonoripper-0.10.1-r3' @0x7ff6e4965190>)
+rc.package'> cpv='media-sound/phonoripper-0.10.1-r3' @0x7f49cc547190>)
ERROR pkgcore: returned val from gen_metadata was 'False'
-caught exception '%s' while processing '%s'(MetadataException('Metadata Exception: pkg ebuild src: dev-libs/libconcord-0.23, attr description\nerror: Metadata Exception: pkg ebuild src: dev-libs/libconcord-0.23, attr data\nerror: False',), <<class 'pkgcore.ebuild.ebuild_src.package'> cpv='dev-libs/libconcord-0.23' @0x7ff6e4965410>)
+caught exception '%s' while processing '%s'(MetadataException('Metadata Exception: pkg ebuild src: dev-libs/libconcord-0.23, attr description\nerror: Metadata Exception: pkg ebuild src: dev-libs/libconcord-0.23, attr data\nerror: False',), <<class 'pkgcore.ebuild.ebuild_src.package'> cpv='dev-libs/libconcord-0.23' @0x7f49cc547410>)
ERROR pkgcore: returned val from gen_metadata was 'False'
-caught exception '%s' while processing '%s'(MetadataException('Metadata Exception: pkg ebuild src: dev-libs/libconcord-0.24, attr description\nerror: Metadata Exception: pkg ebuild src: dev-libs/libconcord-0.24, attr data\nerror: False',), <<class 'pkgcore.ebuild.ebuild_src.package'> cpv='dev-libs/libconcord-0.24' @0x7ff6e4965190>)
+caught exception '%s' while processing '%s'(MetadataException('Metadata Exception: pkg ebuild src: dev-libs/libconcord-0.24, attr description\nerror: Metadata Exception: pkg ebuild src: dev-libs/libconcord-0.24, attr data\nerror: False',), <<class 'pkgcore.ebuild.ebuild_src.package'> cpv='dev-libs/libconcord-0.24' @0x7f49cc547190>)
* Cache regen failed with 1
diff --git a/fidonet.html b/fidonet.html
index fb2e06369176..023880e7d0ec 100644
--- a/fidonet.html
+++ b/fidonet.html
@@ -62,15 +62,15 @@
</pre></td></tr>
<tr class="" id="l26"><td><a href="#l26"><span>26</span></a></td><td><pre>File list transfer time: 0.000 seconds
</pre></td></tr>
- <tr class="" id="l27"><td><a href="#l27"><span>27</span></a></td><td><pre>Total bytes sent: 111
+ <tr class="" id="l27"><td><a href="#l27"><span>27</span></a></td><td><pre>Total bytes sent: 115
</pre></td></tr>
<tr class="" id="l28"><td><a href="#l28"><span>28</span></a></td><td><pre>Total bytes received: 3.86K
</pre></td></tr>
<tr class="" id="l29"><td><a href="#l29"><span>29</span></a></td><td><pre>
</pre></td></tr>
- <tr class="" id="l30"><td><a href="#l30"><span>30</span></a></td><td><pre>sent 111 bytes received 3.86K bytes 2.65K bytes/sec
+ <tr class="" id="l30"><td><a href="#l30"><span>30</span></a></td><td><pre>sent 115 bytes received 3.86K bytes 2.65K bytes/sec
</pre></td></tr>
- <tr class="" id="l31"><td><a href="#l31"><span>31</span></a></td><td><pre>total size is 139.99K speedup is 35.27
+ <tr class="" id="l31"><td><a href="#l31"><span>31</span></a></td><td><pre>total size is 139.99K speedup is 35.24
</pre></td></tr>
<tr class="" id="l32"><td><a href="#l32"><span>32</span></a></td><td><pre>*** syncing fidonet
</pre></td></tr>
diff --git a/fidonet.txt b/fidonet.txt
index 1d936d30092b..3a4836c87326 100644
--- a/fidonet.txt
+++ b/fidonet.txt
@@ -24,11 +24,11 @@ Matched data: 0 bytes
File list size: 3.80K
File list generation time: 0.001 seconds
File list transfer time: 0.000 seconds
-Total bytes sent: 111
+Total bytes sent: 115
Total bytes received: 3.86K
-sent 111 bytes received 3.86K bytes 2.65K bytes/sec
-total size is 139.99K speedup is 35.27
+sent 115 bytes received 3.86K bytes 2.65K bytes/sec
+total size is 139.99K speedup is 35.24
*** syncing fidonet
*** synced fidonet
* Sync succeeded
diff --git a/gbin.html b/gbin.html
index 5923831081c0..d999c1397fd3 100644
--- a/gbin.html
+++ b/gbin.html
@@ -250,13 +250,13 @@
</pre></td><td>[FATAL]</td></tr>
<tr class="" id="l120"><td><a href="#l120"><span>120</span></a></td><td><pre>ERROR pkgcore: returned val from gen_metadata was 'False'
</pre></td></tr>
- <tr class="err" id="l121"><td><a href="#l121"><span>121</span></a></td><td><pre>caught exception '%s' while processing '%s'(MetadataException('Metadata Exception: pkg ebuild src: media-tv/xmltv-0.5.61, attr description\nerror: Metadata Exception: pkg ebuild src: media-tv/xmltv-0.5.61, attr data\nerror: False',), &lt;&lt;class 'pkgcore.ebuild.ebuild_src.package'&gt; cpv='media-tv/xmltv-0.5.61' @0x7fbfe65caa50&gt;)
+ <tr class="err" id="l121"><td><a href="#l121"><span>121</span></a></td><td><pre>caught exception '%s' while processing '%s'(MetadataException('Metadata Exception: pkg ebuild src: media-tv/xmltv-0.5.61, attr description\nerror: Metadata Exception: pkg ebuild src: media-tv/xmltv-0.5.61, attr data\nerror: False',), &lt;&lt;class 'pkgcore.ebuild.ebuild_src.package'&gt; cpv='media-tv/xmltv-0.5.61' @0x7f436d390a50&gt;)
</pre></td><td>[FATAL]</td></tr>
- <tr class="err" id="l122"><td><a href="#l122"><span>122</span></a></td><td><pre>caught exception '%s' while processing '%s'(MetadataException("Metadata Exception: pkg ebuild src: app-crypt/whitepixel-2, attr description\nerror: Metadata Exception: pkg ebuild src: app-crypt/whitepixel-2, attr data\nerror: Metadata Exception: pkg ebuild src: app-crypt/whitepixel-2, attr eapi\nerror: parsed eapi '0' doesn't match sourced eapi '3'",), &lt;&lt;class 'pkgcore.ebuild.ebuild_src.package'&gt; cpv='app-crypt/whitepixel-2' @0x7fbfe611e7d0&gt;)
+ <tr class="err" id="l122"><td><a href="#l122"><span>122</span></a></td><td><pre>caught exception '%s' while processing '%s'(MetadataException("Metadata Exception: pkg ebuild src: app-crypt/whitepixel-2, attr description\nerror: Metadata Exception: pkg ebuild src: app-crypt/whitepixel-2, attr data\nerror: Metadata Exception: pkg ebuild src: app-crypt/whitepixel-2, attr eapi\nerror: parsed eapi '0' doesn't match sourced eapi '3'",), &lt;&lt;class 'pkgcore.ebuild.ebuild_src.package'&gt; cpv='app-crypt/whitepixel-2' @0x7f436cee47d0&gt;)
</pre></td><td>[FATAL]</td></tr>
<tr class="" id="l123"><td><a href="#l123"><span>123</span></a></td><td><pre>ERROR pkgcore: returned val from gen_metadata was 'False'
</pre></td></tr>
- <tr class="err" id="l124"><td><a href="#l124"><span>124</span></a></td><td><pre>caught exception '%s' while processing '%s'(MetadataException('Metadata Exception: pkg ebuild src: games-board/gogui-1.4.6, attr description\nerror: Metadata Exception: pkg ebuild src: games-board/gogui-1.4.6, attr data\nerror: False',), &lt;&lt;class 'pkgcore.ebuild.ebuild_src.package'&gt; cpv='games-board/gogui-1.4.6' @0x7fbfe611e910&gt;)
+ <tr class="err" id="l124"><td><a href="#l124"><span>124</span></a></td><td><pre>caught exception '%s' while processing '%s'(MetadataException('Metadata Exception: pkg ebuild src: games-board/gogui-1.4.6, attr description\nerror: Metadata Exception: pkg ebuild src: games-board/gogui-1.4.6, attr data\nerror: False',), &lt;&lt;class 'pkgcore.ebuild.ebuild_src.package'&gt; cpv='games-board/gogui-1.4.6' @0x7f436cee4910&gt;)
</pre></td><td>[FATAL]</td></tr>
<tr class="" id="l125"><td><a href="#l125"><span>125</span></a></td><td><pre> * Cache regen failed with 1
</pre></td></tr>
diff --git a/gbin.txt b/gbin.txt
index d1e3341087d2..9711005bf96c 100644
--- a/gbin.txt
+++ b/gbin.txt
@@ -118,8 +118,8 @@ error: parsed eapi '0' doesn't match sourced eapi '3' while processing ebuild sr
ERROR pkgcore: returned val from gen_metadata was 'False'
!!! caught exception False while processing ebuild src: games-board/gogui-1.4.6
ERROR pkgcore: returned val from gen_metadata was 'False'
-caught exception '%s' while processing '%s'(MetadataException('Metadata Exception: pkg ebuild src: media-tv/xmltv-0.5.61, attr description\nerror: Metadata Exception: pkg ebuild src: media-tv/xmltv-0.5.61, attr data\nerror: False',), <<class 'pkgcore.ebuild.ebuild_src.package'> cpv='media-tv/xmltv-0.5.61' @0x7fbfe65caa50>)
-caught exception '%s' while processing '%s'(MetadataException("Metadata Exception: pkg ebuild src: app-crypt/whitepixel-2, attr description\nerror: Metadata Exception: pkg ebuild src: app-crypt/whitepixel-2, attr data\nerror: Metadata Exception: pkg ebuild src: app-crypt/whitepixel-2, attr eapi\nerror: parsed eapi '0' doesn't match sourced eapi '3'",), <<class 'pkgcore.ebuild.ebuild_src.package'> cpv='app-crypt/whitepixel-2' @0x7fbfe611e7d0>)
+caught exception '%s' while processing '%s'(MetadataException('Metadata Exception: pkg ebuild src: media-tv/xmltv-0.5.61, attr description\nerror: Metadata Exception: pkg ebuild src: media-tv/xmltv-0.5.61, attr data\nerror: False',), <<class 'pkgcore.ebuild.ebuild_src.package'> cpv='media-tv/xmltv-0.5.61' @0x7f436d390a50>)
+caught exception '%s' while processing '%s'(MetadataException("Metadata Exception: pkg ebuild src: app-crypt/whitepixel-2, attr description\nerror: Metadata Exception: pkg ebuild src: app-crypt/whitepixel-2, attr data\nerror: Metadata Exception: pkg ebuild src: app-crypt/whitepixel-2, attr eapi\nerror: parsed eapi '0' doesn't match sourced eapi '3'",), <<class 'pkgcore.ebuild.ebuild_src.package'> cpv='app-crypt/whitepixel-2' @0x7f436cee47d0>)
ERROR pkgcore: returned val from gen_metadata was 'False'
-caught exception '%s' while processing '%s'(MetadataException('Metadata Exception: pkg ebuild src: games-board/gogui-1.4.6, attr description\nerror: Metadata Exception: pkg ebuild src: games-board/gogui-1.4.6, attr data\nerror: False',), <<class 'pkgcore.ebuild.ebuild_src.package'> cpv='games-board/gogui-1.4.6' @0x7fbfe611e910>)
+caught exception '%s' while processing '%s'(MetadataException('Metadata Exception: pkg ebuild src: games-board/gogui-1.4.6, attr description\nerror: Metadata Exception: pkg ebuild src: games-board/gogui-1.4.6, attr data\nerror: False',), <<class 'pkgcore.ebuild.ebuild_src.package'> cpv='games-board/gogui-1.4.6' @0x7f436cee4910>)
* Cache regen failed with 1
diff --git a/gentoo-el.html b/gentoo-el.html
index 265375e22973..d7746be54f1f 100644
--- a/gentoo-el.html
+++ b/gentoo-el.html
@@ -530,23 +530,23 @@
</pre></td><td>[FATAL]</td></tr>
<tr class="" id="l260"><td><a href="#l260"><span>260</span></a></td><td><pre>ERROR pkgcore: returned val from gen_metadata was 'False'
</pre></td></tr>
- <tr class="err" id="l261"><td><a href="#l261"><span>261</span></a></td><td><pre>caught exception '%s' while processing '%s'(MetadataException('Metadata Exception: pkg ebuild src: kde-misc/kdiff3-0.9.96, attr description\nerror: Metadata Exception: pkg ebuild src: kde-misc/kdiff3-0.9.96, attr data\nerror: False',), &lt;&lt;class 'pkgcore.ebuild.ebuild_src.package'&gt; cpv='kde-misc/kdiff3-0.9.96' @0x7f757cc137d0&gt;)
+ <tr class="err" id="l261"><td><a href="#l261"><span>261</span></a></td><td><pre>caught exception '%s' while processing '%s'(MetadataException('Metadata Exception: pkg ebuild src: kde-misc/kdiff3-0.9.96, attr description\nerror: Metadata Exception: pkg ebuild src: kde-misc/kdiff3-0.9.96, attr data\nerror: False',), &lt;&lt;class 'pkgcore.ebuild.ebuild_src.package'&gt; cpv='kde-misc/kdiff3-0.9.96' @0x7f2b561397d0&gt;)
</pre></td><td>[FATAL]</td></tr>
<tr class="" id="l262"><td><a href="#l262"><span>262</span></a></td><td><pre>ERROR pkgcore: returned val from gen_metadata was 'False'
</pre></td></tr>
- <tr class="err" id="l263"><td><a href="#l263"><span>263</span></a></td><td><pre>caught exception '%s' while processing '%s'(MetadataException('Metadata Exception: pkg ebuild src: kde-misc/kdiff3-0.9.97, attr description\nerror: Metadata Exception: pkg ebuild src: kde-misc/kdiff3-0.9.97, attr data\nerror: False',), &lt;&lt;class 'pkgcore.ebuild.ebuild_src.package'&gt; cpv='kde-misc/kdiff3-0.9.97' @0x7f757cc13a50&gt;)
+ <tr class="err" id="l263"><td><a href="#l263"><span>263</span></a></td><td><pre>caught exception '%s' while processing '%s'(MetadataException('Metadata Exception: pkg ebuild src: kde-misc/kdiff3-0.9.97, attr description\nerror: Metadata Exception: pkg ebuild src: kde-misc/kdiff3-0.9.97, attr data\nerror: False',), &lt;&lt;class 'pkgcore.ebuild.ebuild_src.package'&gt; cpv='kde-misc/kdiff3-0.9.97' @0x7f2b56139a50&gt;)
</pre></td><td>[FATAL]</td></tr>
<tr class="" id="l264"><td><a href="#l264"><span>264</span></a></td><td><pre>ERROR pkgcore: returned val from gen_metadata was 'False'
</pre></td></tr>
- <tr class="err" id="l265"><td><a href="#l265"><span>265</span></a></td><td><pre>caught exception '%s' while processing '%s'(MetadataException('Metadata Exception: pkg ebuild src: kde-misc/plasma-workflow-0.1.98, attr description\nerror: Metadata Exception: pkg ebuild src: kde-misc/plasma-workflow-0.1.98, attr data\nerror: False',), &lt;&lt;class 'pkgcore.ebuild.ebuild_src.package'&gt; cpv='kde-misc/plasma-workflow-0.1.98' @0x7f757cc137d0&gt;)
+ <tr class="err" id="l265"><td><a href="#l265"><span>265</span></a></td><td><pre>caught exception '%s' while processing '%s'(MetadataException('Metadata Exception: pkg ebuild src: kde-misc/plasma-workflow-0.1.98, attr description\nerror: Metadata Exception: pkg ebuild src: kde-misc/plasma-workflow-0.1.98, attr data\nerror: False',), &lt;&lt;class 'pkgcore.ebuild.ebuild_src.package'&gt; cpv='kde-misc/plasma-workflow-0.1.98' @0x7f2b561397d0&gt;)
</pre></td><td>[FATAL]</td></tr>
<tr class="" id="l266"><td><a href="#l266"><span>266</span></a></td><td><pre>ERROR pkgcore: returned val from gen_metadata was 'False'
</pre></td></tr>
- <tr class="err" id="l267"><td><a href="#l267"><span>267</span></a></td><td><pre>caught exception '%s' while processing '%s'(MetadataException('Metadata Exception: pkg ebuild src: kde-misc/semantik-0.8.2, attr description\nerror: Metadata Exception: pkg ebuild src: kde-misc/semantik-0.8.2, attr data\nerror: False',), &lt;&lt;class 'pkgcore.ebuild.ebuild_src.package'&gt; cpv='kde-misc/semantik-0.8.2' @0x7f757cc13a50&gt;)
+ <tr class="err" id="l267"><td><a href="#l267"><span>267</span></a></td><td><pre>caught exception '%s' while processing '%s'(MetadataException('Metadata Exception: pkg ebuild src: kde-misc/semantik-0.8.2, attr description\nerror: Metadata Exception: pkg ebuild src: kde-misc/semantik-0.8.2, attr data\nerror: False',), &lt;&lt;class 'pkgcore.ebuild.ebuild_src.package'&gt; cpv='kde-misc/semantik-0.8.2' @0x7f2b56139a50&gt;)
</pre></td><td>[FATAL]</td></tr>
<tr class="" id="l268"><td><a href="#l268"><span>268</span></a></td><td><pre>ERROR pkgcore: returned val from gen_metadata was 'False'
</pre></td></tr>
- <tr class="err" id="l269"><td><a href="#l269"><span>269</span></a></td><td><pre>caught exception '%s' while processing '%s'(MetadataException('Metadata Exception: pkg ebuild src: gnome-extra/gnome-globalmenu-9999, attr description\nerror: Metadata Exception: pkg ebuild src: gnome-extra/gnome-globalmenu-9999, attr data\nerror: False',), &lt;&lt;class 'pkgcore.ebuild.ebuild_src.package'&gt; cpv='gnome-extra/gnome-globalmenu-9999' @0x7f757c766690&gt;)
+ <tr class="err" id="l269"><td><a href="#l269"><span>269</span></a></td><td><pre>caught exception '%s' while processing '%s'(MetadataException('Metadata Exception: pkg ebuild src: gnome-extra/gnome-globalmenu-9999, attr description\nerror: Metadata Exception: pkg ebuild src: gnome-extra/gnome-globalmenu-9999, attr data\nerror: False',), &lt;&lt;class 'pkgcore.ebuild.ebuild_src.package'&gt; cpv='gnome-extra/gnome-globalmenu-9999' @0x7f2b55c8c690&gt;)
</pre></td><td>[FATAL]</td></tr>
<tr class="" id="l270"><td><a href="#l270"><span>270</span></a></td><td><pre> * Cache regen failed with 1
</pre></td></tr>
diff --git a/gentoo-el.txt b/gentoo-el.txt
index b555072443ad..79bd047bd814 100644
--- a/gentoo-el.txt
+++ b/gentoo-el.txt
@@ -258,13 +258,13 @@ ERROR pkgcore: returned val from gen_metadata was 'False'
ERROR pkgcore: returned val from gen_metadata was 'False'
!!! caught exception False while processing ebuild src: gnome-extra/gnome-globalmenu-9999
ERROR pkgcore: returned val from gen_metadata was 'False'
-caught exception '%s' while processing '%s'(MetadataException('Metadata Exception: pkg ebuild src: kde-misc/kdiff3-0.9.96, attr description\nerror: Metadata Exception: pkg ebuild src: kde-misc/kdiff3-0.9.96, attr data\nerror: False',), <<class 'pkgcore.ebuild.ebuild_src.package'> cpv='kde-misc/kdiff3-0.9.96' @0x7f757cc137d0>)
+caught exception '%s' while processing '%s'(MetadataException('Metadata Exception: pkg ebuild src: kde-misc/kdiff3-0.9.96, attr description\nerror: Metadata Exception: pkg ebuild src: kde-misc/kdiff3-0.9.96, attr data\nerror: False',), <<class 'pkgcore.ebuild.ebuild_src.package'> cpv='kde-misc/kdiff3-0.9.96' @0x7f2b561397d0>)
ERROR pkgcore: returned val from gen_metadata was 'False'
-caught exception '%s' while processing '%s'(MetadataException('Metadata Exception: pkg ebuild src: kde-misc/kdiff3-0.9.97, attr description\nerror: Metadata Exception: pkg ebuild src: kde-misc/kdiff3-0.9.97, attr data\nerror: False',), <<class 'pkgcore.ebuild.ebuild_src.package'> cpv='kde-misc/kdiff3-0.9.97' @0x7f757cc13a50>)
+caught exception '%s' while processing '%s'(MetadataException('Metadata Exception: pkg ebuild src: kde-misc/kdiff3-0.9.97, attr description\nerror: Metadata Exception: pkg ebuild src: kde-misc/kdiff3-0.9.97, attr data\nerror: False',), <<class 'pkgcore.ebuild.ebuild_src.package'> cpv='kde-misc/kdiff3-0.9.97' @0x7f2b56139a50>)
ERROR pkgcore: returned val from gen_metadata was 'False'
-caught exception '%s' while processing '%s'(MetadataException('Metadata Exception: pkg ebuild src: kde-misc/plasma-workflow-0.1.98, attr description\nerror: Metadata Exception: pkg ebuild src: kde-misc/plasma-workflow-0.1.98, attr data\nerror: False',), <<class 'pkgcore.ebuild.ebuild_src.package'> cpv='kde-misc/plasma-workflow-0.1.98' @0x7f757cc137d0>)
+caught exception '%s' while processing '%s'(MetadataException('Metadata Exception: pkg ebuild src: kde-misc/plasma-workflow-0.1.98, attr description\nerror: Metadata Exception: pkg ebuild src: kde-misc/plasma-workflow-0.1.98, attr data\nerror: False',), <<class 'pkgcore.ebuild.ebuild_src.package'> cpv='kde-misc/plasma-workflow-0.1.98' @0x7f2b561397d0>)
ERROR pkgcore: returned val from gen_metadata was 'False'
-caught exception '%s' while processing '%s'(MetadataException('Metadata Exception: pkg ebuild src: kde-misc/semantik-0.8.2, attr description\nerror: Metadata Exception: pkg ebuild src: kde-misc/semantik-0.8.2, attr data\nerror: False',), <<class 'pkgcore.ebuild.ebuild_src.package'> cpv='kde-misc/semantik-0.8.2' @0x7f757cc13a50>)
+caught exception '%s' while processing '%s'(MetadataException('Metadata Exception: pkg ebuild src: kde-misc/semantik-0.8.2, attr description\nerror: Metadata Exception: pkg ebuild src: kde-misc/semantik-0.8.2, attr data\nerror: False',), <<class 'pkgcore.ebuild.ebuild_src.package'> cpv='kde-misc/semantik-0.8.2' @0x7f2b56139a50>)
ERROR pkgcore: returned val from gen_metadata was 'False'
-caught exception '%s' while processing '%s'(MetadataException('Metadata Exception: pkg ebuild src: gnome-extra/gnome-globalmenu-9999, attr description\nerror: Metadata Exception: pkg ebuild src: gnome-extra/gnome-globalmenu-9999, attr data\nerror: False',), <<class 'pkgcore.ebuild.ebuild_src.package'> cpv='gnome-extra/gnome-globalmenu-9999' @0x7f757c766690>)
+caught exception '%s' while processing '%s'(MetadataException('Metadata Exception: pkg ebuild src: gnome-extra/gnome-globalmenu-9999, attr description\nerror: Metadata Exception: pkg ebuild src: gnome-extra/gnome-globalmenu-9999, attr data\nerror: False',), <<class 'pkgcore.ebuild.ebuild_src.package'> cpv='gnome-extra/gnome-globalmenu-9999' @0x7f2b55c8c690>)
* Cache regen failed with 1
diff --git a/gentoo-guis.html b/gentoo-guis.html
index b047cd7c2a54..c1a094c3fc3c 100644
--- a/gentoo-guis.html
+++ b/gentoo-guis.html
@@ -138,71 +138,73 @@
</pre></td></tr>
<tr class="err" id="l64"><td><a href="#l64"><span>64</span></a></td><td><pre>!!! caught exception False while processing ebuild src: app-portage/kdemerge-9999
</pre></td><td>[FATAL]</td></tr>
- <tr class="" id="l65"><td><a href="#l65"><span>65</span></a></td><td><pre>Traceback (most recent call last):
+ <tr class="err" id="l65"><td><a href="#l65"><span>65</span></a></td><td><pre>!!! caught exception ("Expected command; instead got nothing from ''", None) while processing ebuild src: app-portage/kportagetray-9999
+</pre></td><td>[FATAL]</td></tr>
+ <tr class="" id="l66"><td><a href="#l66"><span>66</span></a></td><td><pre>Traceback (most recent call last):
</pre></td></tr>
- <tr class="" id="l66"><td><a href="#l66"><span>66</span></a></td><td><pre> File "/home/mgorny/pkgcore-venv/bin/pmaint", line 4, in &lt;module&gt;
+ <tr class="" id="l67"><td><a href="#l67"><span>67</span></a></td><td><pre> File "/home/mgorny/pkgcore-venv/bin/pmaint", line 4, in &lt;module&gt;
</pre></td></tr>
- <tr class="" id="l67"><td><a href="#l67"><span>67</span></a></td><td><pre> scripts.main(basename(__file__))
+ <tr class="" id="l68"><td><a href="#l68"><span>68</span></a></td><td><pre> scripts.main(basename(__file__))
</pre></td></tr>
- <tr class="" id="l68"><td><a href="#l68"><span>68</span></a></td><td><pre> File "/home/mgorny/pkgcore-venv/lib/python2.7/site-packages/pkgcore/scripts/__init__.py", line 40, in main
+ <tr class="" id="l69"><td><a href="#l69"><span>69</span></a></td><td><pre> File "/home/mgorny/pkgcore-venv/lib/python2.7/site-packages/pkgcore/scripts/__init__.py", line 40, in main
</pre></td></tr>
- <tr class="" id="l69"><td><a href="#l69"><span>69</span></a></td><td><pre> commandline.main(subcommands)
+ <tr class="" id="l70"><td><a href="#l70"><span>70</span></a></td><td><pre> commandline.main(subcommands)
</pre></td></tr>
- <tr class="" id="l70"><td><a href="#l70"><span>70</span></a></td><td><pre> File "/home/mgorny/pkgcore-venv/lib/python2.7/site-packages/pkgcore/util/commandline.py", line 928, in main
+ <tr class="" id="l71"><td><a href="#l71"><span>71</span></a></td><td><pre> File "/home/mgorny/pkgcore-venv/lib/python2.7/site-packages/pkgcore/util/commandline.py", line 928, in main
</pre></td></tr>
- <tr class="" id="l71"><td><a href="#l71"><span>71</span></a></td><td><pre> exitstatus = main_func(options, out, err)
+ <tr class="" id="l72"><td><a href="#l72"><span>72</span></a></td><td><pre> exitstatus = main_func(options, out, err)
</pre></td></tr>
- <tr class="" id="l72"><td><a href="#l72"><span>72</span></a></td><td><pre> File "/home/mgorny/pkgcore-venv/lib/python2.7/site-packages/pkgcore/scripts/pmaint.py", line 283, in regen_main
+ <tr class="" id="l73"><td><a href="#l73"><span>73</span></a></td><td><pre> File "/home/mgorny/pkgcore-venv/lib/python2.7/site-packages/pkgcore/scripts/pmaint.py", line 283, in regen_main
</pre></td></tr>
- <tr class="" id="l73"><td><a href="#l73"><span>73</span></a></td><td><pre> eclass_caching=(not options.disable_eclass_caching))
+ <tr class="" id="l74"><td><a href="#l74"><span>74</span></a></td><td><pre> eclass_caching=(not options.disable_eclass_caching))
</pre></td></tr>
- <tr class="" id="l74"><td><a href="#l74"><span>74</span></a></td><td><pre> File "/home/mgorny/pkgcore-venv/lib/python2.7/site-packages/pkgcore/operations/__init__.py", line 68, in _recast_exception_decorator
+ <tr class="" id="l75"><td><a href="#l75"><span>75</span></a></td><td><pre> File "/home/mgorny/pkgcore-venv/lib/python2.7/site-packages/pkgcore/operations/__init__.py", line 68, in _recast_exception_decorator
</pre></td></tr>
- <tr class="" id="l75"><td><a href="#l75"><span>75</span></a></td><td><pre> return functor(*args, **kwds)
+ <tr class="" id="l76"><td><a href="#l76"><span>76</span></a></td><td><pre> return functor(*args, **kwds)
</pre></td></tr>
- <tr class="" id="l76"><td><a href="#l76"><span>76</span></a></td><td><pre> File "/home/mgorny/pkgcore-venv/lib/python2.7/site-packages/pkgcore/operations/repo.py", line 247, in _cmd_api_regen_cache
+ <tr class="" id="l77"><td><a href="#l77"><span>77</span></a></td><td><pre> File "/home/mgorny/pkgcore-venv/lib/python2.7/site-packages/pkgcore/operations/repo.py", line 247, in _cmd_api_regen_cache
</pre></td></tr>
- <tr class="" id="l77"><td><a href="#l77"><span>77</span></a></td><td><pre> self._get_observer(observer), threads=threads, **options)
+ <tr class="" id="l78"><td><a href="#l78"><span>78</span></a></td><td><pre> self._get_observer(observer), threads=threads, **options)
</pre></td></tr>
- <tr class="" id="l78"><td><a href="#l78"><span>78</span></a></td><td><pre> File "/home/mgorny/pkgcore-venv/lib/python2.7/site-packages/pkgcore/operations/regen.py", line 37, in regen_repository
+ <tr class="" id="l79"><td><a href="#l79"><span>79</span></a></td><td><pre> File "/home/mgorny/pkgcore-venv/lib/python2.7/site-packages/pkgcore/operations/regen.py", line 37, in regen_repository
</pre></td></tr>
- <tr class="" id="l79"><td><a href="#l79"><span>79</span></a></td><td><pre> regen_iter(iter(repo), _get_repo_helper(), observer)
+ <tr class="" id="l80"><td><a href="#l80"><span>80</span></a></td><td><pre> regen_iter(iter(repo), _get_repo_helper(), observer)
</pre></td></tr>
- <tr class="" id="l80"><td><a href="#l80"><span>80</span></a></td><td><pre> File "/home/mgorny/pkgcore-venv/lib/python2.7/site-packages/pkgcore/operations/regen.py", line 15, in regen_iter
+ <tr class="" id="l81"><td><a href="#l81"><span>81</span></a></td><td><pre> File "/home/mgorny/pkgcore-venv/lib/python2.7/site-packages/pkgcore/operations/regen.py", line 15, in regen_iter
</pre></td></tr>
- <tr class="" id="l81"><td><a href="#l81"><span>81</span></a></td><td><pre> regen_func(x)
+ <tr class="" id="l82"><td><a href="#l82"><span>82</span></a></td><td><pre> regen_func(x)
</pre></td></tr>
- <tr class="" id="l82"><td><a href="#l82"><span>82</span></a></td><td><pre> File "/home/mgorny/pkgcore-venv/lib/python2.7/site-packages/pkgcore/ebuild/repository.py", line 521, in __call__
+ <tr class="" id="l83"><td><a href="#l83"><span>83</span></a></td><td><pre> File "/home/mgorny/pkgcore-venv/lib/python2.7/site-packages/pkgcore/ebuild/repository.py", line 521, in __call__
</pre></td></tr>
- <tr class="" id="l83"><td><a href="#l83"><span>83</span></a></td><td><pre> return pkg._fetch_metadata(ebp=self.ebp, force_regen=self.force)
+ <tr class="" id="l84"><td><a href="#l84"><span>84</span></a></td><td><pre> return pkg._fetch_metadata(ebp=self.ebp, force_regen=self.force)
</pre></td></tr>
- <tr class="" id="l84"><td><a href="#l84"><span>84</span></a></td><td><pre> File "/home/mgorny/pkgcore-venv/lib/python2.7/site-packages/pkgcore/ebuild/ebuild_src.py", line 272, in _fetch_metadata
+ <tr class="" id="l85"><td><a href="#l85"><span>85</span></a></td><td><pre> File "/home/mgorny/pkgcore-venv/lib/python2.7/site-packages/pkgcore/ebuild/ebuild_src.py", line 272, in _fetch_metadata
</pre></td></tr>
- <tr class="" id="l85"><td><a href="#l85"><span>85</span></a></td><td><pre> return self._parent._get_metadata(self, ebp=ebp, force_regen=force_regen)
+ <tr class="" id="l86"><td><a href="#l86"><span>86</span></a></td><td><pre> return self._parent._get_metadata(self, ebp=ebp, force_regen=force_regen)
</pre></td></tr>
- <tr class="" id="l86"><td><a href="#l86"><span>86</span></a></td><td><pre> File "/home/mgorny/pkgcore-venv/lib/python2.7/site-packages/pkgcore/ebuild/ebuild_src.py", line 363, in _get_metadata
+ <tr class="" id="l87"><td><a href="#l87"><span>87</span></a></td><td><pre> File "/home/mgorny/pkgcore-venv/lib/python2.7/site-packages/pkgcore/ebuild/ebuild_src.py", line 363, in _get_metadata
</pre></td></tr>
- <tr class="" id="l87"><td><a href="#l87"><span>87</span></a></td><td><pre> return self._update_metadata(pkg, ebp=ebp)
+ <tr class="" id="l88"><td><a href="#l88"><span>88</span></a></td><td><pre> return self._update_metadata(pkg, ebp=ebp)
</pre></td></tr>
- <tr class="" id="l88"><td><a href="#l88"><span>88</span></a></td><td><pre> File "/home/mgorny/pkgcore-venv/lib/python2.7/site-packages/pkgcore/ebuild/ebuild_src.py", line 371, in _update_metadata
+ <tr class="" id="l89"><td><a href="#l89"><span>89</span></a></td><td><pre> File "/home/mgorny/pkgcore-venv/lib/python2.7/site-packages/pkgcore/ebuild/ebuild_src.py", line 371, in _update_metadata
</pre></td></tr>
- <tr class="" id="l89"><td><a href="#l89"><span>89</span></a></td><td><pre> mydata = my_proc.get_keys(pkg, self._ecache)
+ <tr class="" id="l90"><td><a href="#l90"><span>90</span></a></td><td><pre> mydata = my_proc.get_keys(pkg, self._ecache)
</pre></td></tr>
- <tr class="" id="l90"><td><a href="#l90"><span>90</span></a></td><td><pre> File "/home/mgorny/pkgcore-venv/lib/python2.7/site-packages/pkgcore/ebuild/processor.py", line 826, in get_keys
+ <tr class="" id="l91"><td><a href="#l91"><span>91</span></a></td><td><pre> File "/home/mgorny/pkgcore-venv/lib/python2.7/site-packages/pkgcore/ebuild/processor.py", line 826, in get_keys
</pre></td></tr>
- <tr class="" id="l91"><td><a href="#l91"><span>91</span></a></td><td><pre> {"key": receive_key})
+ <tr class="" id="l92"><td><a href="#l92"><span>92</span></a></td><td><pre> {"key": receive_key})
</pre></td></tr>
- <tr class="" id="l92"><td><a href="#l92"><span>92</span></a></td><td><pre> File "/home/mgorny/pkgcore-venv/lib/python2.7/site-packages/pkgcore/ebuild/processor.py", line 759, in _run_depend_like_phase
+ <tr class="" id="l93"><td><a href="#l93"><span>93</span></a></td><td><pre> File "/home/mgorny/pkgcore-venv/lib/python2.7/site-packages/pkgcore/ebuild/processor.py", line 759, in _run_depend_like_phase
</pre></td></tr>
- <tr class="" id="l93"><td><a href="#l93"><span>93</span></a></td><td><pre> self.write("%s %i\n%s" % (command, len(data), data), append_newline=False)
+ <tr class="" id="l94"><td><a href="#l94"><span>94</span></a></td><td><pre> self.write("%s %i\n%s" % (command, len(data), data), append_newline=False)
</pre></td></tr>
- <tr class="" id="l94"><td><a href="#l94"><span>94</span></a></td><td><pre> File "/home/mgorny/pkgcore-venv/lib/python2.7/site-packages/pkgcore/ebuild/processor.py", line 457, in write
+ <tr class="" id="l95"><td><a href="#l95"><span>95</span></a></td><td><pre> File "/home/mgorny/pkgcore-venv/lib/python2.7/site-packages/pkgcore/ebuild/processor.py", line 457, in write
</pre></td></tr>
- <tr class="" id="l95"><td><a href="#l95"><span>95</span></a></td><td><pre> raise RuntimeError(ie)
+ <tr class="" id="l96"><td><a href="#l96"><span>96</span></a></td><td><pre> raise RuntimeError(ie)
</pre></td></tr>
- <tr class="" id="l96"><td><a href="#l96"><span>96</span></a></td><td><pre>RuntimeError: [Errno 32] Broken pipe
+ <tr class="" id="l97"><td><a href="#l97"><span>97</span></a></td><td><pre>RuntimeError: [Errno 32] Broken pipe
</pre></td></tr>
- <tr class="" id="l97"><td><a href="#l97"><span>97</span></a></td><td><pre> * Cache regen failed with 1
+ <tr class="" id="l98"><td><a href="#l98"><span>98</span></a></td><td><pre> * Cache regen failed with 1
</pre></td></tr>
</table>
diff --git a/gentoo-guis.txt b/gentoo-guis.txt
index 1eefc9b1ce66..247f2b441a3a 100644
--- a/gentoo-guis.txt
+++ b/gentoo-guis.txt
@@ -62,6 +62,7 @@ ERROR pkgcore: returned val from gen_metadata was 'False'
!!! caught exception False while processing ebuild src: app-portage/c-portage-9999
ERROR pkgcore: returned val from gen_metadata was 'False'
!!! caught exception False while processing ebuild src: app-portage/kdemerge-9999
+!!! caught exception ("Expected command; instead got nothing from ''", None) while processing ebuild src: app-portage/kportagetray-9999
Traceback (most recent call last):
File "/home/mgorny/pkgcore-venv/bin/pmaint", line 4, in <module>
scripts.main(basename(__file__))
diff --git a/hacking-gentoo.html b/hacking-gentoo.html
index 0214c6b1a424..5a9eb10311ec 100644
--- a/hacking-gentoo.html
+++ b/hacking-gentoo.html
@@ -52,7 +52,7 @@
</pre></td></tr>
<tr class="" id="l21"><td><a href="#l21"><span>21</span></a></td><td><pre>Matched data: 0 bytes
</pre></td></tr>
- <tr class="" id="l22"><td><a href="#l22"><span>22</span></a></td><td><pre>File list size: 44.56K
+ <tr class="" id="l22"><td><a href="#l22"><span>22</span></a></td><td><pre>File list size: 46.02K
</pre></td></tr>
<tr class="" id="l23"><td><a href="#l23"><span>23</span></a></td><td><pre>File list generation time: 0.001 seconds
</pre></td></tr>
diff --git a/hacking-gentoo.txt b/hacking-gentoo.txt
index ee11a3b1d6e7..10e1c171fc8c 100644
--- a/hacking-gentoo.txt
+++ b/hacking-gentoo.txt
@@ -19,7 +19,7 @@ Total file size: 5.17M bytes
Total transferred file size: 0 bytes
Literal data: 0 bytes
Matched data: 0 bytes
-File list size: 44.56K
+File list size: 46.02K
File list generation time: 0.001 seconds
File list transfer time: 0.000 seconds
Total bytes sent: 384
diff --git a/index.html b/index.html
index 40637a00eb23..aae12a54bcc3 100644
--- a/index.html
+++ b/index.html
@@ -443,7 +443,7 @@
</table>
- <address>Generated based on results from 2015-12-17 03:21:31 UTC</address>
+ <address>Generated based on results from 2015-12-17 03:41:41 UTC</address>
</body>
</html>
\ No newline at end of file
diff --git a/jensp.html b/jensp.html
index 166c9b87ab0c..d1ecf582b07e 100644
--- a/jensp.html
+++ b/jensp.html
@@ -122,13 +122,13 @@
</pre></td></tr>
<tr class="" id="l56"><td><a href="#l56"><span>56</span></a></td><td><pre>
</pre></td></tr>
- <tr class="" id="l57"><td><a href="#l57"><span>57</span></a></td><td><pre>sandbox:stop caught signal 15 in pid 1340
+ <tr class="" id="l57"><td><a href="#l57"><span>57</span></a></td><td><pre>sandbox:stop caught signal 15 in pid 12088
</pre></td></tr>
<tr class="" id="l58"><td><a href="#l58"><span>58</span></a></td><td><pre>Sandboxed process killed by signal: Terminated
</pre></td></tr>
<tr class="err" id="l59"><td><a href="#l59"><span>59</span></a></td><td><pre>!!! caught exception inherit requires an unknown eclass, git cannot be found while processing ebuild src: dev-python/pykickstart-9999
</pre></td><td>[FATAL]</td></tr>
- <tr class="err" id="l60"><td><a href="#l60"><span>60</span></a></td><td><pre>caught exception '%s' while processing '%s'(MetadataException('Metadata Exception: pkg ebuild src: dev-python/pykickstart-9999, attr description\nerror: Metadata Exception: pkg ebuild src: dev-python/pykickstart-9999, attr data\nerror: inherit requires an unknown eclass, git cannot be found',), &lt;&lt;class 'pkgcore.ebuild.ebuild_src.package'&gt; cpv='dev-python/pykickstart-9999' @0x7f4159f1b050&gt;)
+ <tr class="err" id="l60"><td><a href="#l60"><span>60</span></a></td><td><pre>caught exception '%s' while processing '%s'(MetadataException('Metadata Exception: pkg ebuild src: dev-python/pykickstart-9999, attr description\nerror: Metadata Exception: pkg ebuild src: dev-python/pykickstart-9999, attr data\nerror: inherit requires an unknown eclass, git cannot be found',), &lt;&lt;class 'pkgcore.ebuild.ebuild_src.package'&gt; cpv='dev-python/pykickstart-9999' @0x7f87a6ca4050&gt;)
</pre></td><td>[FATAL]</td></tr>
<tr class="" id="l61"><td><a href="#l61"><span>61</span></a></td><td><pre> * Cache regen failed with 1
</pre></td></tr>
diff --git a/jensp.txt b/jensp.txt
index 63474853d559..502e41b57bba 100644
--- a/jensp.txt
+++ b/jensp.txt
@@ -54,8 +54,8 @@ Sandboxed process killed by signal: Broken pipe
!!! The die message:
!!! inherit for git failed
-sandbox:stop caught signal 15 in pid 1340
+sandbox:stop caught signal 15 in pid 12088
Sandboxed process killed by signal: Terminated
!!! caught exception inherit requires an unknown eclass, git cannot be found while processing ebuild src: dev-python/pykickstart-9999
-caught exception '%s' while processing '%s'(MetadataException('Metadata Exception: pkg ebuild src: dev-python/pykickstart-9999, attr description\nerror: Metadata Exception: pkg ebuild src: dev-python/pykickstart-9999, attr data\nerror: inherit requires an unknown eclass, git cannot be found',), <<class 'pkgcore.ebuild.ebuild_src.package'> cpv='dev-python/pykickstart-9999' @0x7f4159f1b050>)
+caught exception '%s' while processing '%s'(MetadataException('Metadata Exception: pkg ebuild src: dev-python/pykickstart-9999, attr description\nerror: Metadata Exception: pkg ebuild src: dev-python/pykickstart-9999, attr data\nerror: inherit requires an unknown eclass, git cannot be found',), <<class 'pkgcore.ebuild.ebuild_src.package'> cpv='dev-python/pykickstart-9999' @0x7f87a6ca4050>)
* Cache regen failed with 1
diff --git a/kormoc.html b/kormoc.html
index 635e1ccedd42..453f5100cc8c 100644
--- a/kormoc.html
+++ b/kormoc.html
@@ -150,73 +150,71 @@
</pre></td></tr>
<tr class="err" id="l70"><td><a href="#l70"><span>70</span></a></td><td><pre>!!! caught exception False while processing ebuild src: www-apache/mod_sed-0.0.1
</pre></td><td>[FATAL]</td></tr>
- <tr class="err" id="l71"><td><a href="#l71"><span>71</span></a></td><td><pre>!!! caught exception ("Expected command; instead got nothing from ''", None) while processing ebuild src: www-apache/mod_spdy-9999
-</pre></td><td>[FATAL]</td></tr>
- <tr class="" id="l72"><td><a href="#l72"><span>72</span></a></td><td><pre>Traceback (most recent call last):
+ <tr class="" id="l71"><td><a href="#l71"><span>71</span></a></td><td><pre>Traceback (most recent call last):
</pre></td></tr>
- <tr class="" id="l73"><td><a href="#l73"><span>73</span></a></td><td><pre> File "/home/mgorny/pkgcore-venv/bin/pmaint", line 4, in &lt;module&gt;
+ <tr class="" id="l72"><td><a href="#l72"><span>72</span></a></td><td><pre> File "/home/mgorny/pkgcore-venv/bin/pmaint", line 4, in &lt;module&gt;
</pre></td></tr>
- <tr class="" id="l74"><td><a href="#l74"><span>74</span></a></td><td><pre> scripts.main(basename(__file__))
+ <tr class="" id="l73"><td><a href="#l73"><span>73</span></a></td><td><pre> scripts.main(basename(__file__))
</pre></td></tr>
- <tr class="" id="l75"><td><a href="#l75"><span>75</span></a></td><td><pre> File "/home/mgorny/pkgcore-venv/lib/python2.7/site-packages/pkgcore/scripts/__init__.py", line 40, in main
+ <tr class="" id="l74"><td><a href="#l74"><span>74</span></a></td><td><pre> File "/home/mgorny/pkgcore-venv/lib/python2.7/site-packages/pkgcore/scripts/__init__.py", line 40, in main
</pre></td></tr>
- <tr class="" id="l76"><td><a href="#l76"><span>76</span></a></td><td><pre> commandline.main(subcommands)
+ <tr class="" id="l75"><td><a href="#l75"><span>75</span></a></td><td><pre> commandline.main(subcommands)
</pre></td></tr>
- <tr class="" id="l77"><td><a href="#l77"><span>77</span></a></td><td><pre> File "/home/mgorny/pkgcore-venv/lib/python2.7/site-packages/pkgcore/util/commandline.py", line 928, in main
+ <tr class="" id="l76"><td><a href="#l76"><span>76</span></a></td><td><pre> File "/home/mgorny/pkgcore-venv/lib/python2.7/site-packages/pkgcore/util/commandline.py", line 928, in main
</pre></td></tr>
- <tr class="" id="l78"><td><a href="#l78"><span>78</span></a></td><td><pre> exitstatus = main_func(options, out, err)
+ <tr class="" id="l77"><td><a href="#l77"><span>77</span></a></td><td><pre> exitstatus = main_func(options, out, err)
</pre></td></tr>
- <tr class="" id="l79"><td><a href="#l79"><span>79</span></a></td><td><pre> File "/home/mgorny/pkgcore-venv/lib/python2.7/site-packages/pkgcore/scripts/pmaint.py", line 283, in regen_main
+ <tr class="" id="l78"><td><a href="#l78"><span>78</span></a></td><td><pre> File "/home/mgorny/pkgcore-venv/lib/python2.7/site-packages/pkgcore/scripts/pmaint.py", line 283, in regen_main
</pre></td></tr>
- <tr class="" id="l80"><td><a href="#l80"><span>80</span></a></td><td><pre> eclass_caching=(not options.disable_eclass_caching))
+ <tr class="" id="l79"><td><a href="#l79"><span>79</span></a></td><td><pre> eclass_caching=(not options.disable_eclass_caching))
</pre></td></tr>
- <tr class="" id="l81"><td><a href="#l81"><span>81</span></a></td><td><pre> File "/home/mgorny/pkgcore-venv/lib/python2.7/site-packages/pkgcore/operations/__init__.py", line 68, in _recast_exception_decorator
+ <tr class="" id="l80"><td><a href="#l80"><span>80</span></a></td><td><pre> File "/home/mgorny/pkgcore-venv/lib/python2.7/site-packages/pkgcore/operations/__init__.py", line 68, in _recast_exception_decorator
</pre></td></tr>
- <tr class="" id="l82"><td><a href="#l82"><span>82</span></a></td><td><pre> return functor(*args, **kwds)
+ <tr class="" id="l81"><td><a href="#l81"><span>81</span></a></td><td><pre> return functor(*args, **kwds)
</pre></td></tr>
- <tr class="" id="l83"><td><a href="#l83"><span>83</span></a></td><td><pre> File "/home/mgorny/pkgcore-venv/lib/python2.7/site-packages/pkgcore/operations/repo.py", line 247, in _cmd_api_regen_cache
+ <tr class="" id="l82"><td><a href="#l82"><span>82</span></a></td><td><pre> File "/home/mgorny/pkgcore-venv/lib/python2.7/site-packages/pkgcore/operations/repo.py", line 247, in _cmd_api_regen_cache
</pre></td></tr>
- <tr class="" id="l84"><td><a href="#l84"><span>84</span></a></td><td><pre> self._get_observer(observer), threads=threads, **options)
+ <tr class="" id="l83"><td><a href="#l83"><span>83</span></a></td><td><pre> self._get_observer(observer), threads=threads, **options)
</pre></td></tr>
- <tr class="" id="l85"><td><a href="#l85"><span>85</span></a></td><td><pre> File "/home/mgorny/pkgcore-venv/lib/python2.7/site-packages/pkgcore/operations/regen.py", line 37, in regen_repository
+ <tr class="" id="l84"><td><a href="#l84"><span>84</span></a></td><td><pre> File "/home/mgorny/pkgcore-venv/lib/python2.7/site-packages/pkgcore/operations/regen.py", line 37, in regen_repository
</pre></td></tr>
- <tr class="" id="l86"><td><a href="#l86"><span>86</span></a></td><td><pre> regen_iter(iter(repo), _get_repo_helper(), observer)
+ <tr class="" id="l85"><td><a href="#l85"><span>85</span></a></td><td><pre> regen_iter(iter(repo), _get_repo_helper(), observer)
</pre></td></tr>
- <tr class="" id="l87"><td><a href="#l87"><span>87</span></a></td><td><pre> File "/home/mgorny/pkgcore-venv/lib/python2.7/site-packages/pkgcore/operations/regen.py", line 15, in regen_iter
+ <tr class="" id="l86"><td><a href="#l86"><span>86</span></a></td><td><pre> File "/home/mgorny/pkgcore-venv/lib/python2.7/site-packages/pkgcore/operations/regen.py", line 15, in regen_iter
</pre></td></tr>
- <tr class="" id="l88"><td><a href="#l88"><span>88</span></a></td><td><pre> regen_func(x)
+ <tr class="" id="l87"><td><a href="#l87"><span>87</span></a></td><td><pre> regen_func(x)
</pre></td></tr>
- <tr class="" id="l89"><td><a href="#l89"><span>89</span></a></td><td><pre> File "/home/mgorny/pkgcore-venv/lib/python2.7/site-packages/pkgcore/ebuild/repository.py", line 521, in __call__
+ <tr class="" id="l88"><td><a href="#l88"><span>88</span></a></td><td><pre> File "/home/mgorny/pkgcore-venv/lib/python2.7/site-packages/pkgcore/ebuild/repository.py", line 521, in __call__
</pre></td></tr>
- <tr class="" id="l90"><td><a href="#l90"><span>90</span></a></td><td><pre> return pkg._fetch_metadata(ebp=self.ebp, force_regen=self.force)
+ <tr class="" id="l89"><td><a href="#l89"><span>89</span></a></td><td><pre> return pkg._fetch_metadata(ebp=self.ebp, force_regen=self.force)
</pre></td></tr>
- <tr class="" id="l91"><td><a href="#l91"><span>91</span></a></td><td><pre> File "/home/mgorny/pkgcore-venv/lib/python2.7/site-packages/pkgcore/ebuild/ebuild_src.py", line 272, in _fetch_metadata
+ <tr class="" id="l90"><td><a href="#l90"><span>90</span></a></td><td><pre> File "/home/mgorny/pkgcore-venv/lib/python2.7/site-packages/pkgcore/ebuild/ebuild_src.py", line 272, in _fetch_metadata
</pre></td></tr>
- <tr class="" id="l92"><td><a href="#l92"><span>92</span></a></td><td><pre> return self._parent._get_metadata(self, ebp=ebp, force_regen=force_regen)
+ <tr class="" id="l91"><td><a href="#l91"><span>91</span></a></td><td><pre> return self._parent._get_metadata(self, ebp=ebp, force_regen=force_regen)
</pre></td></tr>
- <tr class="" id="l93"><td><a href="#l93"><span>93</span></a></td><td><pre> File "/home/mgorny/pkgcore-venv/lib/python2.7/site-packages/pkgcore/ebuild/ebuild_src.py", line 363, in _get_metadata
+ <tr class="" id="l92"><td><a href="#l92"><span>92</span></a></td><td><pre> File "/home/mgorny/pkgcore-venv/lib/python2.7/site-packages/pkgcore/ebuild/ebuild_src.py", line 363, in _get_metadata
</pre></td></tr>
- <tr class="" id="l94"><td><a href="#l94"><span>94</span></a></td><td><pre> return self._update_metadata(pkg, ebp=ebp)
+ <tr class="" id="l93"><td><a href="#l93"><span>93</span></a></td><td><pre> return self._update_metadata(pkg, ebp=ebp)
</pre></td></tr>
- <tr class="" id="l95"><td><a href="#l95"><span>95</span></a></td><td><pre> File "/home/mgorny/pkgcore-venv/lib/python2.7/site-packages/pkgcore/ebuild/ebuild_src.py", line 371, in _update_metadata
+ <tr class="" id="l94"><td><a href="#l94"><span>94</span></a></td><td><pre> File "/home/mgorny/pkgcore-venv/lib/python2.7/site-packages/pkgcore/ebuild/ebuild_src.py", line 371, in _update_metadata
</pre></td></tr>
- <tr class="" id="l96"><td><a href="#l96"><span>96</span></a></td><td><pre> mydata = my_proc.get_keys(pkg, self._ecache)
+ <tr class="" id="l95"><td><a href="#l95"><span>95</span></a></td><td><pre> mydata = my_proc.get_keys(pkg, self._ecache)
</pre></td></tr>
- <tr class="" id="l97"><td><a href="#l97"><span>97</span></a></td><td><pre> File "/home/mgorny/pkgcore-venv/lib/python2.7/site-packages/pkgcore/ebuild/processor.py", line 826, in get_keys
+ <tr class="" id="l96"><td><a href="#l96"><span>96</span></a></td><td><pre> File "/home/mgorny/pkgcore-venv/lib/python2.7/site-packages/pkgcore/ebuild/processor.py", line 826, in get_keys
</pre></td></tr>
- <tr class="" id="l98"><td><a href="#l98"><span>98</span></a></td><td><pre> {"key": receive_key})
+ <tr class="" id="l97"><td><a href="#l97"><span>97</span></a></td><td><pre> {"key": receive_key})
</pre></td></tr>
- <tr class="" id="l99"><td><a href="#l99"><span>99</span></a></td><td><pre> File "/home/mgorny/pkgcore-venv/lib/python2.7/site-packages/pkgcore/ebuild/processor.py", line 759, in _run_depend_like_phase
+ <tr class="" id="l98"><td><a href="#l98"><span>98</span></a></td><td><pre> File "/home/mgorny/pkgcore-venv/lib/python2.7/site-packages/pkgcore/ebuild/processor.py", line 759, in _run_depend_like_phase
</pre></td></tr>
- <tr class="" id="l100"><td><a href="#l100"><span>100</span></a></td><td><pre> self.write("%s %i\n%s" % (command, len(data), data), append_newline=False)
+ <tr class="" id="l99"><td><a href="#l99"><span>99</span></a></td><td><pre> self.write("%s %i\n%s" % (command, len(data), data), append_newline=False)
</pre></td></tr>
- <tr class="" id="l101"><td><a href="#l101"><span>101</span></a></td><td><pre> File "/home/mgorny/pkgcore-venv/lib/python2.7/site-packages/pkgcore/ebuild/processor.py", line 457, in write
+ <tr class="" id="l100"><td><a href="#l100"><span>100</span></a></td><td><pre> File "/home/mgorny/pkgcore-venv/lib/python2.7/site-packages/pkgcore/ebuild/processor.py", line 457, in write
</pre></td></tr>
- <tr class="" id="l102"><td><a href="#l102"><span>102</span></a></td><td><pre> raise RuntimeError(ie)
+ <tr class="" id="l101"><td><a href="#l101"><span>101</span></a></td><td><pre> raise RuntimeError(ie)
</pre></td></tr>
- <tr class="" id="l103"><td><a href="#l103"><span>103</span></a></td><td><pre>RuntimeError: [Errno 32] Broken pipe
+ <tr class="" id="l102"><td><a href="#l102"><span>102</span></a></td><td><pre>RuntimeError: [Errno 32] Broken pipe
</pre></td></tr>
- <tr class="" id="l104"><td><a href="#l104"><span>104</span></a></td><td><pre> * Cache regen failed with 1
+ <tr class="" id="l103"><td><a href="#l103"><span>103</span></a></td><td><pre> * Cache regen failed with 1
</pre></td></tr>
</table>
diff --git a/kormoc.txt b/kormoc.txt
index 673698aa44f4..932546b1262b 100644
--- a/kormoc.txt
+++ b/kormoc.txt
@@ -68,7 +68,6 @@ ERROR pkgcore: returned val from gen_metadata was 'False'
error: parsed eapi '2' doesn't match sourced eapi '3' while processing ebuild src: www-apache/mod_pagespeed-9999-r1
ERROR pkgcore: returned val from gen_metadata was 'False'
!!! caught exception False while processing ebuild src: www-apache/mod_sed-0.0.1
-!!! caught exception ("Expected command; instead got nothing from ''", None) while processing ebuild src: www-apache/mod_spdy-9999
Traceback (most recent call last):
File "/home/mgorny/pkgcore-venv/bin/pmaint", line 4, in <module>
scripts.main(basename(__file__))
diff --git a/loongson.html b/loongson.html
index 7e303dd73217..449c3b8fa0a8 100644
--- a/loongson.html
+++ b/loongson.html
@@ -456,23 +456,23 @@
</pre></td><td>[FATAL]</td></tr>
<tr class="" id="l223"><td><a href="#l223"><span>223</span></a></td><td><pre>ERROR pkgcore: returned val from gen_metadata was 'False'
</pre></td></tr>
- <tr class="err" id="l224"><td><a href="#l224"><span>224</span></a></td><td><pre>caught exception '%s' while processing '%s'(MetadataException('Metadata Exception: pkg ebuild src: net-libs/xulrunner-1.9.2.13-r1, attr description\nerror: Metadata Exception: pkg ebuild src: net-libs/xulrunner-1.9.2.13-r1, attr data\nerror: False',), &lt;&lt;class 'pkgcore.ebuild.ebuild_src.package'&gt; cpv='net-libs/xulrunner-1.9.2.13-r1' @0x7f8ed193e410&gt;)
+ <tr class="err" id="l224"><td><a href="#l224"><span>224</span></a></td><td><pre>caught exception '%s' while processing '%s'(MetadataException('Metadata Exception: pkg ebuild src: net-libs/xulrunner-1.9.2.13-r1, attr description\nerror: Metadata Exception: pkg ebuild src: net-libs/xulrunner-1.9.2.13-r1, attr data\nerror: False',), &lt;&lt;class 'pkgcore.ebuild.ebuild_src.package'&gt; cpv='net-libs/xulrunner-1.9.2.13-r1' @0x7faeb078f410&gt;)
</pre></td><td>[FATAL]</td></tr>
<tr class="" id="l225"><td><a href="#l225"><span>225</span></a></td><td><pre>ERROR pkgcore: returned val from gen_metadata was 'False'
</pre></td></tr>
- <tr class="err" id="l226"><td><a href="#l226"><span>226</span></a></td><td><pre>caught exception '%s' while processing '%s'(MetadataException('Metadata Exception: pkg ebuild src: net-libs/xulrunner-1.9.2.8-r1, attr description\nerror: Metadata Exception: pkg ebuild src: net-libs/xulrunner-1.9.2.8-r1, attr data\nerror: False',), &lt;&lt;class 'pkgcore.ebuild.ebuild_src.package'&gt; cpv='net-libs/xulrunner-1.9.2.8-r1' @0x7f8ed193e550&gt;)
+ <tr class="err" id="l226"><td><a href="#l226"><span>226</span></a></td><td><pre>caught exception '%s' while processing '%s'(MetadataException('Metadata Exception: pkg ebuild src: net-libs/xulrunner-1.9.2.8-r1, attr description\nerror: Metadata Exception: pkg ebuild src: net-libs/xulrunner-1.9.2.8-r1, attr data\nerror: False',), &lt;&lt;class 'pkgcore.ebuild.ebuild_src.package'&gt; cpv='net-libs/xulrunner-1.9.2.8-r1' @0x7faeb078f550&gt;)
</pre></td><td>[FATAL]</td></tr>
<tr class="" id="l227"><td><a href="#l227"><span>227</span></a></td><td><pre>ERROR pkgcore: returned val from gen_metadata was 'False'
</pre></td></tr>
- <tr class="err" id="l228"><td><a href="#l228"><span>228</span></a></td><td><pre>caught exception '%s' while processing '%s'(MetadataException('Metadata Exception: pkg ebuild src: net-libs/xulrunner-2.0_beta5_pre-r2, attr description\nerror: Metadata Exception: pkg ebuild src: net-libs/xulrunner-2.0_beta5_pre-r2, attr data\nerror: False',), &lt;&lt;class 'pkgcore.ebuild.ebuild_src.package'&gt; cpv='net-libs/xulrunner-2.0_beta5_pre-r2' @0x7f8ed193e690&gt;)
+ <tr class="err" id="l228"><td><a href="#l228"><span>228</span></a></td><td><pre>caught exception '%s' while processing '%s'(MetadataException('Metadata Exception: pkg ebuild src: net-libs/xulrunner-2.0_beta5_pre-r2, attr description\nerror: Metadata Exception: pkg ebuild src: net-libs/xulrunner-2.0_beta5_pre-r2, attr data\nerror: False',), &lt;&lt;class 'pkgcore.ebuild.ebuild_src.package'&gt; cpv='net-libs/xulrunner-2.0_beta5_pre-r2' @0x7faeb078f690&gt;)
</pre></td><td>[FATAL]</td></tr>
<tr class="" id="l229"><td><a href="#l229"><span>229</span></a></td><td><pre>ERROR pkgcore: returned val from gen_metadata was 'False'
</pre></td></tr>
- <tr class="err" id="l230"><td><a href="#l230"><span>230</span></a></td><td><pre>caught exception '%s' while processing '%s'(MetadataException('Metadata Exception: pkg ebuild src: www-client/firefox-3.6.13, attr description\nerror: Metadata Exception: pkg ebuild src: www-client/firefox-3.6.13, attr data\nerror: False',), &lt;&lt;class 'pkgcore.ebuild.ebuild_src.package'&gt; cpv='www-client/firefox-3.6.13' @0x7f8ed193e550&gt;)
+ <tr class="err" id="l230"><td><a href="#l230"><span>230</span></a></td><td><pre>caught exception '%s' while processing '%s'(MetadataException('Metadata Exception: pkg ebuild src: www-client/firefox-3.6.13, attr description\nerror: Metadata Exception: pkg ebuild src: www-client/firefox-3.6.13, attr data\nerror: False',), &lt;&lt;class 'pkgcore.ebuild.ebuild_src.package'&gt; cpv='www-client/firefox-3.6.13' @0x7faeb078f550&gt;)
</pre></td><td>[FATAL]</td></tr>
<tr class="" id="l231"><td><a href="#l231"><span>231</span></a></td><td><pre>ERROR pkgcore: returned val from gen_metadata was 'False'
</pre></td></tr>
- <tr class="err" id="l232"><td><a href="#l232"><span>232</span></a></td><td><pre>caught exception '%s' while processing '%s'(MetadataException('Metadata Exception: pkg ebuild src: www-client/firefox-3.6.8, attr description\nerror: Metadata Exception: pkg ebuild src: www-client/firefox-3.6.8, attr data\nerror: False',), &lt;&lt;class 'pkgcore.ebuild.ebuild_src.package'&gt; cpv='www-client/firefox-3.6.8' @0x7f8ed193e690&gt;)
+ <tr class="err" id="l232"><td><a href="#l232"><span>232</span></a></td><td><pre>caught exception '%s' while processing '%s'(MetadataException('Metadata Exception: pkg ebuild src: www-client/firefox-3.6.8, attr description\nerror: Metadata Exception: pkg ebuild src: www-client/firefox-3.6.8, attr data\nerror: False',), &lt;&lt;class 'pkgcore.ebuild.ebuild_src.package'&gt; cpv='www-client/firefox-3.6.8' @0x7faeb078f690&gt;)
</pre></td><td>[FATAL]</td></tr>
<tr class="" id="l233"><td><a href="#l233"><span>233</span></a></td><td><pre> * Cache regen failed with 1
</pre></td></tr>
diff --git a/loongson.txt b/loongson.txt
index 69d761e9dcfa..4e31fecc3eb3 100644
--- a/loongson.txt
+++ b/loongson.txt
@@ -221,13 +221,13 @@ ERROR pkgcore: returned val from gen_metadata was 'False'
ERROR pkgcore: returned val from gen_metadata was 'False'
!!! caught exception False while processing ebuild src: www-client/firefox-3.6.8
ERROR pkgcore: returned val from gen_metadata was 'False'
-caught exception '%s' while processing '%s'(MetadataException('Metadata Exception: pkg ebuild src: net-libs/xulrunner-1.9.2.13-r1, attr description\nerror: Metadata Exception: pkg ebuild src: net-libs/xulrunner-1.9.2.13-r1, attr data\nerror: False',), <<class 'pkgcore.ebuild.ebuild_src.package'> cpv='net-libs/xulrunner-1.9.2.13-r1' @0x7f8ed193e410>)
+caught exception '%s' while processing '%s'(MetadataException('Metadata Exception: pkg ebuild src: net-libs/xulrunner-1.9.2.13-r1, attr description\nerror: Metadata Exception: pkg ebuild src: net-libs/xulrunner-1.9.2.13-r1, attr data\nerror: False',), <<class 'pkgcore.ebuild.ebuild_src.package'> cpv='net-libs/xulrunner-1.9.2.13-r1' @0x7faeb078f410>)
ERROR pkgcore: returned val from gen_metadata was 'False'
-caught exception '%s' while processing '%s'(MetadataException('Metadata Exception: pkg ebuild src: net-libs/xulrunner-1.9.2.8-r1, attr description\nerror: Metadata Exception: pkg ebuild src: net-libs/xulrunner-1.9.2.8-r1, attr data\nerror: False',), <<class 'pkgcore.ebuild.ebuild_src.package'> cpv='net-libs/xulrunner-1.9.2.8-r1' @0x7f8ed193e550>)
+caught exception '%s' while processing '%s'(MetadataException('Metadata Exception: pkg ebuild src: net-libs/xulrunner-1.9.2.8-r1, attr description\nerror: Metadata Exception: pkg ebuild src: net-libs/xulrunner-1.9.2.8-r1, attr data\nerror: False',), <<class 'pkgcore.ebuild.ebuild_src.package'> cpv='net-libs/xulrunner-1.9.2.8-r1' @0x7faeb078f550>)
ERROR pkgcore: returned val from gen_metadata was 'False'
-caught exception '%s' while processing '%s'(MetadataException('Metadata Exception: pkg ebuild src: net-libs/xulrunner-2.0_beta5_pre-r2, attr description\nerror: Metadata Exception: pkg ebuild src: net-libs/xulrunner-2.0_beta5_pre-r2, attr data\nerror: False',), <<class 'pkgcore.ebuild.ebuild_src.package'> cpv='net-libs/xulrunner-2.0_beta5_pre-r2' @0x7f8ed193e690>)
+caught exception '%s' while processing '%s'(MetadataException('Metadata Exception: pkg ebuild src: net-libs/xulrunner-2.0_beta5_pre-r2, attr description\nerror: Metadata Exception: pkg ebuild src: net-libs/xulrunner-2.0_beta5_pre-r2, attr data\nerror: False',), <<class 'pkgcore.ebuild.ebuild_src.package'> cpv='net-libs/xulrunner-2.0_beta5_pre-r2' @0x7faeb078f690>)
ERROR pkgcore: returned val from gen_metadata was 'False'
-caught exception '%s' while processing '%s'(MetadataException('Metadata Exception: pkg ebuild src: www-client/firefox-3.6.13, attr description\nerror: Metadata Exception: pkg ebuild src: www-client/firefox-3.6.13, attr data\nerror: False',), <<class 'pkgcore.ebuild.ebuild_src.package'> cpv='www-client/firefox-3.6.13' @0x7f8ed193e550>)
+caught exception '%s' while processing '%s'(MetadataException('Metadata Exception: pkg ebuild src: www-client/firefox-3.6.13, attr description\nerror: Metadata Exception: pkg ebuild src: www-client/firefox-3.6.13, attr data\nerror: False',), <<class 'pkgcore.ebuild.ebuild_src.package'> cpv='www-client/firefox-3.6.13' @0x7faeb078f550>)
ERROR pkgcore: returned val from gen_metadata was 'False'
-caught exception '%s' while processing '%s'(MetadataException('Metadata Exception: pkg ebuild src: www-client/firefox-3.6.8, attr description\nerror: Metadata Exception: pkg ebuild src: www-client/firefox-3.6.8, attr data\nerror: False',), <<class 'pkgcore.ebuild.ebuild_src.package'> cpv='www-client/firefox-3.6.8' @0x7f8ed193e690>)
+caught exception '%s' while processing '%s'(MetadataException('Metadata Exception: pkg ebuild src: www-client/firefox-3.6.8, attr description\nerror: Metadata Exception: pkg ebuild src: www-client/firefox-3.6.8, attr data\nerror: False',), <<class 'pkgcore.ebuild.ebuild_src.package'> cpv='www-client/firefox-3.6.8' @0x7faeb078f690>)
* Cache regen failed with 1
diff --git a/lordvan.html b/lordvan.html
index 9feaaf16715e..512ae4a94c25 100644
--- a/lordvan.html
+++ b/lordvan.html
@@ -152,7 +152,7 @@
</pre></td><td>[FATAL]</td></tr>
<tr class="" id="l71"><td><a href="#l71"><span>71</span></a></td><td><pre>ERROR pkgcore: returned val from gen_metadata was 'False'
</pre></td></tr>
- <tr class="err" id="l72"><td><a href="#l72"><span>72</span></a></td><td><pre>caught exception '%s' while processing '%s'(MetadataException('Metadata Exception: pkg ebuild src: app-misc/labyrinth-0.4.0, attr description\nerror: Metadata Exception: pkg ebuild src: app-misc/labyrinth-0.4.0, attr data\nerror: False',), &lt;&lt;class 'pkgcore.ebuild.ebuild_src.package'&gt; cpv='app-misc/labyrinth-0.4.0' @0x7fadc4137050&gt;)
+ <tr class="err" id="l72"><td><a href="#l72"><span>72</span></a></td><td><pre>caught exception '%s' while processing '%s'(MetadataException('Metadata Exception: pkg ebuild src: app-misc/labyrinth-0.4.0, attr description\nerror: Metadata Exception: pkg ebuild src: app-misc/labyrinth-0.4.0, attr data\nerror: False',), &lt;&lt;class 'pkgcore.ebuild.ebuild_src.package'&gt; cpv='app-misc/labyrinth-0.4.0' @0x7f1ed2a65050&gt;)
</pre></td><td>[FATAL]</td></tr>
<tr class="" id="l73"><td><a href="#l73"><span>73</span></a></td><td><pre> * Cache regen failed with 1
</pre></td></tr>
diff --git a/lordvan.txt b/lordvan.txt
index 0feb65eab937..a25cf0bde85b 100644
--- a/lordvan.txt
+++ b/lordvan.txt
@@ -69,5 +69,5 @@ WARNING:pkgcore:repository at '/home/mgorny/repos/steveeJ' has unsupported profi
ERROR pkgcore: returned val from gen_metadata was 'False'
!!! caught exception False while processing ebuild src: app-misc/labyrinth-0.4.0
ERROR pkgcore: returned val from gen_metadata was 'False'
-caught exception '%s' while processing '%s'(MetadataException('Metadata Exception: pkg ebuild src: app-misc/labyrinth-0.4.0, attr description\nerror: Metadata Exception: pkg ebuild src: app-misc/labyrinth-0.4.0, attr data\nerror: False',), <<class 'pkgcore.ebuild.ebuild_src.package'> cpv='app-misc/labyrinth-0.4.0' @0x7fadc4137050>)
+caught exception '%s' while processing '%s'(MetadataException('Metadata Exception: pkg ebuild src: app-misc/labyrinth-0.4.0, attr description\nerror: Metadata Exception: pkg ebuild src: app-misc/labyrinth-0.4.0, attr data\nerror: False',), <<class 'pkgcore.ebuild.ebuild_src.package'> cpv='app-misc/labyrinth-0.4.0' @0x7f1ed2a65050>)
* Cache regen failed with 1
diff --git a/luke-jr.html b/luke-jr.html
index 8ab2e6a4b3f6..feae61db168e 100644
--- a/luke-jr.html
+++ b/luke-jr.html
@@ -332,71 +332,73 @@
</pre></td></tr>
<tr class="err" id="l161"><td><a href="#l161"><span>161</span></a></td><td><pre>!!! caught exception False while processing ebuild src: net-im/psi-9999_pre20150515
</pre></td><td>[FATAL]</td></tr>
- <tr class="" id="l162"><td><a href="#l162"><span>162</span></a></td><td><pre>Traceback (most recent call last):
+ <tr class="err" id="l162"><td><a href="#l162"><span>162</span></a></td><td><pre>!!! caught exception ("Expected command; instead got nothing from ''", None) while processing ebuild src: media-libs/glew-1.5.8
+</pre></td><td>[FATAL]</td></tr>
+ <tr class="" id="l163"><td><a href="#l163"><span>163</span></a></td><td><pre>Traceback (most recent call last):
</pre></td></tr>
- <tr class="" id="l163"><td><a href="#l163"><span>163</span></a></td><td><pre> File "/home/mgorny/pkgcore-venv/bin/pmaint", line 4, in &lt;module&gt;
+ <tr class="" id="l164"><td><a href="#l164"><span>164</span></a></td><td><pre> File "/home/mgorny/pkgcore-venv/bin/pmaint", line 4, in &lt;module&gt;
</pre></td></tr>
- <tr class="" id="l164"><td><a href="#l164"><span>164</span></a></td><td><pre> scripts.main(basename(__file__))
+ <tr class="" id="l165"><td><a href="#l165"><span>165</span></a></td><td><pre> scripts.main(basename(__file__))
</pre></td></tr>
- <tr class="" id="l165"><td><a href="#l165"><span>165</span></a></td><td><pre> File "/home/mgorny/pkgcore-venv/lib/python2.7/site-packages/pkgcore/scripts/__init__.py", line 40, in main
+ <tr class="" id="l166"><td><a href="#l166"><span>166</span></a></td><td><pre> File "/home/mgorny/pkgcore-venv/lib/python2.7/site-packages/pkgcore/scripts/__init__.py", line 40, in main
</pre></td></tr>
- <tr class="" id="l166"><td><a href="#l166"><span>166</span></a></td><td><pre> commandline.main(subcommands)
+ <tr class="" id="l167"><td><a href="#l167"><span>167</span></a></td><td><pre> commandline.main(subcommands)
</pre></td></tr>
- <tr class="" id="l167"><td><a href="#l167"><span>167</span></a></td><td><pre> File "/home/mgorny/pkgcore-venv/lib/python2.7/site-packages/pkgcore/util/commandline.py", line 928, in main
+ <tr class="" id="l168"><td><a href="#l168"><span>168</span></a></td><td><pre> File "/home/mgorny/pkgcore-venv/lib/python2.7/site-packages/pkgcore/util/commandline.py", line 928, in main
</pre></td></tr>
- <tr class="" id="l168"><td><a href="#l168"><span>168</span></a></td><td><pre> exitstatus = main_func(options, out, err)
+ <tr class="" id="l169"><td><a href="#l169"><span>169</span></a></td><td><pre> exitstatus = main_func(options, out, err)
</pre></td></tr>
- <tr class="" id="l169"><td><a href="#l169"><span>169</span></a></td><td><pre> File "/home/mgorny/pkgcore-venv/lib/python2.7/site-packages/pkgcore/scripts/pmaint.py", line 283, in regen_main
+ <tr class="" id="l170"><td><a href="#l170"><span>170</span></a></td><td><pre> File "/home/mgorny/pkgcore-venv/lib/python2.7/site-packages/pkgcore/scripts/pmaint.py", line 283, in regen_main
</pre></td></tr>
- <tr class="" id="l170"><td><a href="#l170"><span>170</span></a></td><td><pre> eclass_caching=(not options.disable_eclass_caching))
+ <tr class="" id="l171"><td><a href="#l171"><span>171</span></a></td><td><pre> eclass_caching=(not options.disable_eclass_caching))
</pre></td></tr>
- <tr class="" id="l171"><td><a href="#l171"><span>171</span></a></td><td><pre> File "/home/mgorny/pkgcore-venv/lib/python2.7/site-packages/pkgcore/operations/__init__.py", line 68, in _recast_exception_decorator
+ <tr class="" id="l172"><td><a href="#l172"><span>172</span></a></td><td><pre> File "/home/mgorny/pkgcore-venv/lib/python2.7/site-packages/pkgcore/operations/__init__.py", line 68, in _recast_exception_decorator
</pre></td></tr>
- <tr class="" id="l172"><td><a href="#l172"><span>172</span></a></td><td><pre> return functor(*args, **kwds)
+ <tr class="" id="l173"><td><a href="#l173"><span>173</span></a></td><td><pre> return functor(*args, **kwds)
</pre></td></tr>
- <tr class="" id="l173"><td><a href="#l173"><span>173</span></a></td><td><pre> File "/home/mgorny/pkgcore-venv/lib/python2.7/site-packages/pkgcore/operations/repo.py", line 247, in _cmd_api_regen_cache
+ <tr class="" id="l174"><td><a href="#l174"><span>174</span></a></td><td><pre> File "/home/mgorny/pkgcore-venv/lib/python2.7/site-packages/pkgcore/operations/repo.py", line 247, in _cmd_api_regen_cache
</pre></td></tr>
- <tr class="" id="l174"><td><a href="#l174"><span>174</span></a></td><td><pre> self._get_observer(observer), threads=threads, **options)
+ <tr class="" id="l175"><td><a href="#l175"><span>175</span></a></td><td><pre> self._get_observer(observer), threads=threads, **options)
</pre></td></tr>
- <tr class="" id="l175"><td><a href="#l175"><span>175</span></a></td><td><pre> File "/home/mgorny/pkgcore-venv/lib/python2.7/site-packages/pkgcore/operations/regen.py", line 37, in regen_repository
+ <tr class="" id="l176"><td><a href="#l176"><span>176</span></a></td><td><pre> File "/home/mgorny/pkgcore-venv/lib/python2.7/site-packages/pkgcore/operations/regen.py", line 37, in regen_repository
</pre></td></tr>
- <tr class="" id="l176"><td><a href="#l176"><span>176</span></a></td><td><pre> regen_iter(iter(repo), _get_repo_helper(), observer)
+ <tr class="" id="l177"><td><a href="#l177"><span>177</span></a></td><td><pre> regen_iter(iter(repo), _get_repo_helper(), observer)
</pre></td></tr>
- <tr class="" id="l177"><td><a href="#l177"><span>177</span></a></td><td><pre> File "/home/mgorny/pkgcore-venv/lib/python2.7/site-packages/pkgcore/operations/regen.py", line 15, in regen_iter
+ <tr class="" id="l178"><td><a href="#l178"><span>178</span></a></td><td><pre> File "/home/mgorny/pkgcore-venv/lib/python2.7/site-packages/pkgcore/operations/regen.py", line 15, in regen_iter
</pre></td></tr>
- <tr class="" id="l178"><td><a href="#l178"><span>178</span></a></td><td><pre> regen_func(x)
+ <tr class="" id="l179"><td><a href="#l179"><span>179</span></a></td><td><pre> regen_func(x)
</pre></td></tr>
- <tr class="" id="l179"><td><a href="#l179"><span>179</span></a></td><td><pre> File "/home/mgorny/pkgcore-venv/lib/python2.7/site-packages/pkgcore/ebuild/repository.py", line 521, in __call__
+ <tr class="" id="l180"><td><a href="#l180"><span>180</span></a></td><td><pre> File "/home/mgorny/pkgcore-venv/lib/python2.7/site-packages/pkgcore/ebuild/repository.py", line 521, in __call__
</pre></td></tr>
- <tr class="" id="l180"><td><a href="#l180"><span>180</span></a></td><td><pre> return pkg._fetch_metadata(ebp=self.ebp, force_regen=self.force)
+ <tr class="" id="l181"><td><a href="#l181"><span>181</span></a></td><td><pre> return pkg._fetch_metadata(ebp=self.ebp, force_regen=self.force)
</pre></td></tr>
- <tr class="" id="l181"><td><a href="#l181"><span>181</span></a></td><td><pre> File "/home/mgorny/pkgcore-venv/lib/python2.7/site-packages/pkgcore/ebuild/ebuild_src.py", line 272, in _fetch_metadata
+ <tr class="" id="l182"><td><a href="#l182"><span>182</span></a></td><td><pre> File "/home/mgorny/pkgcore-venv/lib/python2.7/site-packages/pkgcore/ebuild/ebuild_src.py", line 272, in _fetch_metadata
</pre></td></tr>
- <tr class="" id="l182"><td><a href="#l182"><span>182</span></a></td><td><pre> return self._parent._get_metadata(self, ebp=ebp, force_regen=force_regen)
+ <tr class="" id="l183"><td><a href="#l183"><span>183</span></a></td><td><pre> return self._parent._get_metadata(self, ebp=ebp, force_regen=force_regen)
</pre></td></tr>
- <tr class="" id="l183"><td><a href="#l183"><span>183</span></a></td><td><pre> File "/home/mgorny/pkgcore-venv/lib/python2.7/site-packages/pkgcore/ebuild/ebuild_src.py", line 363, in _get_metadata
+ <tr class="" id="l184"><td><a href="#l184"><span>184</span></a></td><td><pre> File "/home/mgorny/pkgcore-venv/lib/python2.7/site-packages/pkgcore/ebuild/ebuild_src.py", line 363, in _get_metadata
</pre></td></tr>
- <tr class="" id="l184"><td><a href="#l184"><span>184</span></a></td><td><pre> return self._update_metadata(pkg, ebp=ebp)
+ <tr class="" id="l185"><td><a href="#l185"><span>185</span></a></td><td><pre> return self._update_metadata(pkg, ebp=ebp)
</pre></td></tr>
- <tr class="" id="l185"><td><a href="#l185"><span>185</span></a></td><td><pre> File "/home/mgorny/pkgcore-venv/lib/python2.7/site-packages/pkgcore/ebuild/ebuild_src.py", line 371, in _update_metadata
+ <tr class="" id="l186"><td><a href="#l186"><span>186</span></a></td><td><pre> File "/home/mgorny/pkgcore-venv/lib/python2.7/site-packages/pkgcore/ebuild/ebuild_src.py", line 371, in _update_metadata
</pre></td></tr>
- <tr class="" id="l186"><td><a href="#l186"><span>186</span></a></td><td><pre> mydata = my_proc.get_keys(pkg, self._ecache)
+ <tr class="" id="l187"><td><a href="#l187"><span>187</span></a></td><td><pre> mydata = my_proc.get_keys(pkg, self._ecache)
</pre></td></tr>
- <tr class="" id="l187"><td><a href="#l187"><span>187</span></a></td><td><pre> File "/home/mgorny/pkgcore-venv/lib/python2.7/site-packages/pkgcore/ebuild/processor.py", line 826, in get_keys
+ <tr class="" id="l188"><td><a href="#l188"><span>188</span></a></td><td><pre> File "/home/mgorny/pkgcore-venv/lib/python2.7/site-packages/pkgcore/ebuild/processor.py", line 826, in get_keys
</pre></td></tr>
- <tr class="" id="l188"><td><a href="#l188"><span>188</span></a></td><td><pre> {"key": receive_key})
+ <tr class="" id="l189"><td><a href="#l189"><span>189</span></a></td><td><pre> {"key": receive_key})
</pre></td></tr>
- <tr class="" id="l189"><td><a href="#l189"><span>189</span></a></td><td><pre> File "/home/mgorny/pkgcore-venv/lib/python2.7/site-packages/pkgcore/ebuild/processor.py", line 759, in _run_depend_like_phase
+ <tr class="" id="l190"><td><a href="#l190"><span>190</span></a></td><td><pre> File "/home/mgorny/pkgcore-venv/lib/python2.7/site-packages/pkgcore/ebuild/processor.py", line 759, in _run_depend_like_phase
</pre></td></tr>
- <tr class="" id="l190"><td><a href="#l190"><span>190</span></a></td><td><pre> self.write("%s %i\n%s" % (command, len(data), data), append_newline=False)
+ <tr class="" id="l191"><td><a href="#l191"><span>191</span></a></td><td><pre> self.write("%s %i\n%s" % (command, len(data), data), append_newline=False)
</pre></td></tr>
- <tr class="" id="l191"><td><a href="#l191"><span>191</span></a></td><td><pre> File "/home/mgorny/pkgcore-venv/lib/python2.7/site-packages/pkgcore/ebuild/processor.py", line 457, in write
+ <tr class="" id="l192"><td><a href="#l192"><span>192</span></a></td><td><pre> File "/home/mgorny/pkgcore-venv/lib/python2.7/site-packages/pkgcore/ebuild/processor.py", line 457, in write
</pre></td></tr>
- <tr class="" id="l192"><td><a href="#l192"><span>192</span></a></td><td><pre> raise RuntimeError(ie)
+ <tr class="" id="l193"><td><a href="#l193"><span>193</span></a></td><td><pre> raise RuntimeError(ie)
</pre></td></tr>
- <tr class="" id="l193"><td><a href="#l193"><span>193</span></a></td><td><pre>RuntimeError: [Errno 32] Broken pipe
+ <tr class="" id="l194"><td><a href="#l194"><span>194</span></a></td><td><pre>RuntimeError: [Errno 32] Broken pipe
</pre></td></tr>
- <tr class="" id="l194"><td><a href="#l194"><span>194</span></a></td><td><pre> * Cache regen failed with 1
+ <tr class="" id="l195"><td><a href="#l195"><span>195</span></a></td><td><pre> * Cache regen failed with 1
</pre></td></tr>
</table>
diff --git a/luke-jr.txt b/luke-jr.txt
index 8b5ccd133f1d..1c6134ebefeb 100644
--- a/luke-jr.txt
+++ b/luke-jr.txt
@@ -159,6 +159,7 @@ ERROR pkgcore: returned val from gen_metadata was 'False'
!!! caught exception False while processing ebuild src: net-im/psi-9999
ERROR pkgcore: returned val from gen_metadata was 'False'
!!! caught exception False while processing ebuild src: net-im/psi-9999_pre20150515
+!!! caught exception ("Expected command; instead got nothing from ''", None) while processing ebuild src: media-libs/glew-1.5.8
Traceback (most recent call last):
File "/home/mgorny/pkgcore-venv/bin/pmaint", line 4, in <module>
scripts.main(basename(__file__))
diff --git a/n4g.html b/n4g.html
index c913fbe6754c..84b9c8e09438 100644
--- a/n4g.html
+++ b/n4g.html
@@ -142,7 +142,7 @@
</pre></td><td>[FATAL]</td></tr>
<tr class="" id="l66"><td><a href="#l66"><span>66</span></a></td><td><pre>ERROR pkgcore: returned val from gen_metadata was 'False'
</pre></td></tr>
- <tr class="err" id="l67"><td><a href="#l67"><span>67</span></a></td><td><pre>caught exception '%s' while processing '%s'(MetadataException('Metadata Exception: pkg ebuild src: app-admin/oessysmon-0.1.7-r1, attr description\nerror: Metadata Exception: pkg ebuild src: app-admin/oessysmon-0.1.7-r1, attr data\nerror: False',), &lt;&lt;class 'pkgcore.ebuild.ebuild_src.package'&gt; cpv='app-admin/oessysmon-0.1.7-r1' @0x7ff0fdf79550&gt;)
+ <tr class="err" id="l67"><td><a href="#l67"><span>67</span></a></td><td><pre>caught exception '%s' while processing '%s'(MetadataException('Metadata Exception: pkg ebuild src: app-admin/oessysmon-0.1.7-r1, attr description\nerror: Metadata Exception: pkg ebuild src: app-admin/oessysmon-0.1.7-r1, attr data\nerror: False',), &lt;&lt;class 'pkgcore.ebuild.ebuild_src.package'&gt; cpv='app-admin/oessysmon-0.1.7-r1' @0x7fcb4d1de550&gt;)
</pre></td><td>[FATAL]</td></tr>
<tr class="" id="l68"><td><a href="#l68"><span>68</span></a></td><td><pre> * Cache regen failed with 1
</pre></td></tr>
diff --git a/n4g.txt b/n4g.txt
index 5861b3af86d2..9092f8e9a6ba 100644
--- a/n4g.txt
+++ b/n4g.txt
@@ -64,5 +64,5 @@ WARNING:pkgcore:repository at '/home/mgorny/repos/steveeJ' has unsupported profi
ERROR pkgcore: returned val from gen_metadata was 'False'
!!! caught exception False while processing ebuild src: app-admin/oessysmon-0.1.7-r1
ERROR pkgcore: returned val from gen_metadata was 'False'
-caught exception '%s' while processing '%s'(MetadataException('Metadata Exception: pkg ebuild src: app-admin/oessysmon-0.1.7-r1, attr description\nerror: Metadata Exception: pkg ebuild src: app-admin/oessysmon-0.1.7-r1, attr data\nerror: False',), <<class 'pkgcore.ebuild.ebuild_src.package'> cpv='app-admin/oessysmon-0.1.7-r1' @0x7ff0fdf79550>)
+caught exception '%s' while processing '%s'(MetadataException('Metadata Exception: pkg ebuild src: app-admin/oessysmon-0.1.7-r1, attr description\nerror: Metadata Exception: pkg ebuild src: app-admin/oessysmon-0.1.7-r1, attr data\nerror: False',), <<class 'pkgcore.ebuild.ebuild_src.package'> cpv='app-admin/oessysmon-0.1.7-r1' @0x7fcb4d1de550>)
* Cache regen failed with 1
diff --git a/n8x0.html b/n8x0.html
index f0e4a52a433d..44dea23a57e7 100644
--- a/n8x0.html
+++ b/n8x0.html
@@ -304,15 +304,15 @@
</pre></td><td>[FATAL]</td></tr>
<tr class="" id="l147"><td><a href="#l147"><span>147</span></a></td><td><pre>ERROR pkgcore: returned val from gen_metadata was 'False'
</pre></td></tr>
- <tr class="err" id="l148"><td><a href="#l148"><span>148</span></a></td><td><pre>caught exception '%s' while processing '%s'(MetadataException('Metadata Exception: pkg ebuild src: app-accessibility/florence-0.5.1, attr description\nerror: Metadata Exception: pkg ebuild src: app-accessibility/florence-0.5.1, attr data\nerror: False',), &lt;&lt;class 'pkgcore.ebuild.ebuild_src.package'&gt; cpv='app-accessibility/florence-0.5.1' @0x7f2edf215190&gt;)
+ <tr class="err" id="l148"><td><a href="#l148"><span>148</span></a></td><td><pre>caught exception '%s' while processing '%s'(MetadataException('Metadata Exception: pkg ebuild src: app-accessibility/florence-0.5.1, attr description\nerror: Metadata Exception: pkg ebuild src: app-accessibility/florence-0.5.1, attr data\nerror: False',), &lt;&lt;class 'pkgcore.ebuild.ebuild_src.package'&gt; cpv='app-accessibility/florence-0.5.1' @0x7fd215c2f190&gt;)
</pre></td><td>[FATAL]</td></tr>
<tr class="" id="l149"><td><a href="#l149"><span>149</span></a></td><td><pre>ERROR pkgcore: returned val from gen_metadata was 'False'
</pre></td></tr>
- <tr class="err" id="l150"><td><a href="#l150"><span>150</span></a></td><td><pre>caught exception '%s' while processing '%s'(MetadataException('Metadata Exception: pkg ebuild src: sys-apps/fb_text2screen-0.1.1, attr description\nerror: Metadata Exception: pkg ebuild src: sys-apps/fb_text2screen-0.1.1, attr data\nerror: False',), &lt;&lt;class 'pkgcore.ebuild.ebuild_src.package'&gt; cpv='sys-apps/fb_text2screen-0.1.1' @0x7f2edf2157d0&gt;)
+ <tr class="err" id="l150"><td><a href="#l150"><span>150</span></a></td><td><pre>caught exception '%s' while processing '%s'(MetadataException('Metadata Exception: pkg ebuild src: sys-apps/fb_text2screen-0.1.1, attr description\nerror: Metadata Exception: pkg ebuild src: sys-apps/fb_text2screen-0.1.1, attr data\nerror: False',), &lt;&lt;class 'pkgcore.ebuild.ebuild_src.package'&gt; cpv='sys-apps/fb_text2screen-0.1.1' @0x7fd215c2f7d0&gt;)
</pre></td><td>[FATAL]</td></tr>
<tr class="" id="l151"><td><a href="#l151"><span>151</span></a></td><td><pre>ERROR pkgcore: returned val from gen_metadata was 'False'
</pre></td></tr>
- <tr class="err" id="l152"><td><a href="#l152"><span>152</span></a></td><td><pre>caught exception '%s' while processing '%s'(MetadataException('Metadata Exception: pkg ebuild src: sys-apps/opendsme-0.2, attr description\nerror: Metadata Exception: pkg ebuild src: sys-apps/opendsme-0.2, attr data\nerror: False',), &lt;&lt;class 'pkgcore.ebuild.ebuild_src.package'&gt; cpv='sys-apps/opendsme-0.2' @0x7f2edf21e190&gt;)
+ <tr class="err" id="l152"><td><a href="#l152"><span>152</span></a></td><td><pre>caught exception '%s' while processing '%s'(MetadataException('Metadata Exception: pkg ebuild src: sys-apps/opendsme-0.2, attr description\nerror: Metadata Exception: pkg ebuild src: sys-apps/opendsme-0.2, attr data\nerror: False',), &lt;&lt;class 'pkgcore.ebuild.ebuild_src.package'&gt; cpv='sys-apps/opendsme-0.2' @0x7fd215c38190&gt;)
</pre></td><td>[FATAL]</td></tr>
<tr class="" id="l153"><td><a href="#l153"><span>153</span></a></td><td><pre> * Cache regen failed with 1
</pre></td></tr>
diff --git a/n8x0.txt b/n8x0.txt
index 6f98fa850865..6a516f565e4c 100644
--- a/n8x0.txt
+++ b/n8x0.txt
@@ -145,9 +145,9 @@ ERROR pkgcore: returned val from gen_metadata was 'False'
ERROR pkgcore: returned val from gen_metadata was 'False'
!!! caught exception False while processing ebuild src: sys-apps/opendsme-0.2
ERROR pkgcore: returned val from gen_metadata was 'False'
-caught exception '%s' while processing '%s'(MetadataException('Metadata Exception: pkg ebuild src: app-accessibility/florence-0.5.1, attr description\nerror: Metadata Exception: pkg ebuild src: app-accessibility/florence-0.5.1, attr data\nerror: False',), <<class 'pkgcore.ebuild.ebuild_src.package'> cpv='app-accessibility/florence-0.5.1' @0x7f2edf215190>)
+caught exception '%s' while processing '%s'(MetadataException('Metadata Exception: pkg ebuild src: app-accessibility/florence-0.5.1, attr description\nerror: Metadata Exception: pkg ebuild src: app-accessibility/florence-0.5.1, attr data\nerror: False',), <<class 'pkgcore.ebuild.ebuild_src.package'> cpv='app-accessibility/florence-0.5.1' @0x7fd215c2f190>)
ERROR pkgcore: returned val from gen_metadata was 'False'
-caught exception '%s' while processing '%s'(MetadataException('Metadata Exception: pkg ebuild src: sys-apps/fb_text2screen-0.1.1, attr description\nerror: Metadata Exception: pkg ebuild src: sys-apps/fb_text2screen-0.1.1, attr data\nerror: False',), <<class 'pkgcore.ebuild.ebuild_src.package'> cpv='sys-apps/fb_text2screen-0.1.1' @0x7f2edf2157d0>)
+caught exception '%s' while processing '%s'(MetadataException('Metadata Exception: pkg ebuild src: sys-apps/fb_text2screen-0.1.1, attr description\nerror: Metadata Exception: pkg ebuild src: sys-apps/fb_text2screen-0.1.1, attr data\nerror: False',), <<class 'pkgcore.ebuild.ebuild_src.package'> cpv='sys-apps/fb_text2screen-0.1.1' @0x7fd215c2f7d0>)
ERROR pkgcore: returned val from gen_metadata was 'False'
-caught exception '%s' while processing '%s'(MetadataException('Metadata Exception: pkg ebuild src: sys-apps/opendsme-0.2, attr description\nerror: Metadata Exception: pkg ebuild src: sys-apps/opendsme-0.2, attr data\nerror: False',), <<class 'pkgcore.ebuild.ebuild_src.package'> cpv='sys-apps/opendsme-0.2' @0x7f2edf21e190>)
+caught exception '%s' while processing '%s'(MetadataException('Metadata Exception: pkg ebuild src: sys-apps/opendsme-0.2, attr description\nerror: Metadata Exception: pkg ebuild src: sys-apps/opendsme-0.2, attr data\nerror: False',), <<class 'pkgcore.ebuild.ebuild_src.package'> cpv='sys-apps/opendsme-0.2' @0x7fd215c38190>)
* Cache regen failed with 1
diff --git a/o11c.html b/o11c.html
index a2e3982d4828..9a41bdfad125 100644
--- a/o11c.html
+++ b/o11c.html
@@ -148,7 +148,7 @@
</pre></td><td>[FATAL]</td></tr>
<tr class="" id="l69"><td><a href="#l69"><span>69</span></a></td><td><pre>ERROR pkgcore: returned val from gen_metadata was 'False'
</pre></td></tr>
- <tr class="err" id="l70"><td><a href="#l70"><span>70</span></a></td><td><pre>caught exception '%s' while processing '%s'(MetadataException('Metadata Exception: pkg ebuild src: dev-python/attoconf-9999, attr description\nerror: Metadata Exception: pkg ebuild src: dev-python/attoconf-9999, attr data\nerror: False',), &lt;&lt;class 'pkgcore.ebuild.ebuild_src.package'&gt; cpv='dev-python/attoconf-9999' @0x7effce352b90&gt;)
+ <tr class="err" id="l70"><td><a href="#l70"><span>70</span></a></td><td><pre>caught exception '%s' while processing '%s'(MetadataException('Metadata Exception: pkg ebuild src: dev-python/attoconf-9999, attr description\nerror: Metadata Exception: pkg ebuild src: dev-python/attoconf-9999, attr data\nerror: False',), &lt;&lt;class 'pkgcore.ebuild.ebuild_src.package'&gt; cpv='dev-python/attoconf-9999' @0x7f90ce65eb90&gt;)
</pre></td><td>[FATAL]</td></tr>
<tr class="" id="l71"><td><a href="#l71"><span>71</span></a></td><td><pre> * Cache regen failed with 1
</pre></td></tr>
diff --git a/o11c.txt b/o11c.txt
index 0dad6375a9d6..b11f878c153e 100644
--- a/o11c.txt
+++ b/o11c.txt
@@ -67,5 +67,5 @@ WARNING:pkgcore:repository at '/home/mgorny/repos/steveeJ' has unsupported profi
ERROR pkgcore: returned val from gen_metadata was 'False'
!!! caught exception False while processing ebuild src: dev-python/attoconf-9999
ERROR pkgcore: returned val from gen_metadata was 'False'
-caught exception '%s' while processing '%s'(MetadataException('Metadata Exception: pkg ebuild src: dev-python/attoconf-9999, attr description\nerror: Metadata Exception: pkg ebuild src: dev-python/attoconf-9999, attr data\nerror: False',), <<class 'pkgcore.ebuild.ebuild_src.package'> cpv='dev-python/attoconf-9999' @0x7effce352b90>)
+caught exception '%s' while processing '%s'(MetadataException('Metadata Exception: pkg ebuild src: dev-python/attoconf-9999, attr description\nerror: Metadata Exception: pkg ebuild src: dev-python/attoconf-9999, attr data\nerror: False',), <<class 'pkgcore.ebuild.ebuild_src.package'> cpv='dev-python/attoconf-9999' @0x7f90ce65eb90>)
* Cache regen failed with 1
diff --git a/pentoo.html b/pentoo.html
index d5c2b7df8569..de9d18cc0395 100644
--- a/pentoo.html
+++ b/pentoo.html
@@ -38,21 +38,33 @@
</pre></td></tr>
<tr class="" id="l14"><td><a href="#l14"><span>14</span></a></td><td><pre>WARNING:pkgcore:repository at '/home/mgorny/sync/steveeJ' has unsupported profile format(s): 'profile-set'
</pre></td></tr>
- <tr class="" id="l15"><td><a href="#l15"><span>15</span></a></td><td><pre>Already up-to-date.
+ <tr class="" id="l15"><td><a href="#l15"><span>15</span></a></td><td><pre>From git://github.com/pentoo/pentoo-overlay
</pre></td></tr>
- <tr class="" id="l16"><td><a href="#l16"><span>16</span></a></td><td><pre>*** syncing pentoo
+ <tr class="" id="l16"><td><a href="#l16"><span>16</span></a></td><td><pre> 38c7f28..b57c04a master -&gt; origin/master
</pre></td></tr>
- <tr class="" id="l17"><td><a href="#l17"><span>17</span></a></td><td><pre>*** synced pentoo
+ <tr class="" id="l17"><td><a href="#l17"><span>17</span></a></td><td><pre>Updating 38c7f28..b57c04a
</pre></td></tr>
- <tr class="" id="l18"><td><a href="#l18"><span>18</span></a></td><td><pre> * Sync succeeded
+ <tr class="" id="l18"><td><a href="#l18"><span>18</span></a></td><td><pre>Fast-forward
</pre></td></tr>
- <tr class="" id="l19"><td><a href="#l19"><span>19</span></a></td><td><pre>$ pmaint regen --use-local-desc --pkg-desc-index -t 1 pentoo
+ <tr class="" id="l19"><td><a href="#l19"><span>19</span></a></td><td><pre> profiles/pentoo/base/package.mask | 3 +++
</pre></td></tr>
- <tr class="" id="l20"><td><a href="#l20"><span>20</span></a></td><td><pre>WARNING:pkgcore:repository at '/home/mgorny/repos/steveeJ' has unsupported profile format(s): 'profile-set'
+ <tr class="" id="l20"><td><a href="#l20"><span>20</span></a></td><td><pre> profiles/pentoo/base/package.use/sys-fs | 5 ++---
</pre></td></tr>
- <tr class="" id="l21"><td><a href="#l21"><span>21</span></a></td><td><pre>WARNING:pkgcore:repository at '/home/mgorny/repos/steveeJ' has unsupported profile format(s): 'profile-set'
+ <tr class="" id="l21"><td><a href="#l21"><span>21</span></a></td><td><pre> 2 files changed, 5 insertions(+), 3 deletions(-)
</pre></td></tr>
- <tr class="" id="l22"><td><a href="#l22"><span>22</span></a></td><td><pre> * Cache regenerated successfully
+ <tr class="" id="l22"><td><a href="#l22"><span>22</span></a></td><td><pre>*** syncing pentoo
+</pre></td></tr>
+ <tr class="" id="l23"><td><a href="#l23"><span>23</span></a></td><td><pre>*** synced pentoo
+</pre></td></tr>
+ <tr class="" id="l24"><td><a href="#l24"><span>24</span></a></td><td><pre> * Sync succeeded
+</pre></td></tr>
+ <tr class="" id="l25"><td><a href="#l25"><span>25</span></a></td><td><pre>$ pmaint regen --use-local-desc --pkg-desc-index -t 1 pentoo
+</pre></td></tr>
+ <tr class="" id="l26"><td><a href="#l26"><span>26</span></a></td><td><pre>WARNING:pkgcore:repository at '/home/mgorny/repos/steveeJ' has unsupported profile format(s): 'profile-set'
+</pre></td></tr>
+ <tr class="" id="l27"><td><a href="#l27"><span>27</span></a></td><td><pre>WARNING:pkgcore:repository at '/home/mgorny/repos/steveeJ' has unsupported profile format(s): 'profile-set'
+</pre></td></tr>
+ <tr class="" id="l28"><td><a href="#l28"><span>28</span></a></td><td><pre> * Cache regenerated successfully
</pre></td></tr>
</table>
diff --git a/pentoo.txt b/pentoo.txt
index 8afddfe27924..2e17c8a70e82 100644
--- a/pentoo.txt
+++ b/pentoo.txt
@@ -12,7 +12,13 @@
'status': 'unofficial'}
$ pmaint sync pentoo
WARNING:pkgcore:repository at '/home/mgorny/sync/steveeJ' has unsupported profile format(s): 'profile-set'
-Already up-to-date.
+From git://github.com/pentoo/pentoo-overlay
+ 38c7f28..b57c04a master -> origin/master
+Updating 38c7f28..b57c04a
+Fast-forward
+ profiles/pentoo/base/package.mask | 3 +++
+ profiles/pentoo/base/package.use/sys-fs | 5 ++---
+ 2 files changed, 5 insertions(+), 3 deletions(-)
*** syncing pentoo
*** synced pentoo
* Sync succeeded
diff --git a/quantumsummers.html b/quantumsummers.html
index fd364f77f4ac..abbb32272e15 100644
--- a/quantumsummers.html
+++ b/quantumsummers.html
@@ -128,13 +128,13 @@
</pre></td></tr>
<tr class="" id="l59"><td><a href="#l59"><span>59</span></a></td><td><pre>
</pre></td></tr>
- <tr class="" id="l60"><td><a href="#l60"><span>60</span></a></td><td><pre>sandbox:stop caught signal 15 in pid 9279
+ <tr class="" id="l60"><td><a href="#l60"><span>60</span></a></td><td><pre>sandbox:stop caught signal 15 in pid 19779
</pre></td></tr>
<tr class="" id="l61"><td><a href="#l61"><span>61</span></a></td><td><pre>Sandboxed process killed by signal: Terminated
</pre></td></tr>
<tr class="err" id="l62"><td><a href="#l62"><span>62</span></a></td><td><pre>!!! caught exception inherit requires an unknown eclass, git cannot be found while processing ebuild src: dev-python/starcluster-9999
</pre></td><td>[FATAL]</td></tr>
- <tr class="err" id="l63"><td><a href="#l63"><span>63</span></a></td><td><pre>caught exception '%s' while processing '%s'(MetadataException('Metadata Exception: pkg ebuild src: dev-python/starcluster-9999, attr description\nerror: Metadata Exception: pkg ebuild src: dev-python/starcluster-9999, attr data\nerror: inherit requires an unknown eclass, git cannot be found',), &lt;&lt;class 'pkgcore.ebuild.ebuild_src.package'&gt; cpv='dev-python/starcluster-9999' @0x7faa12f6f690&gt;)
+ <tr class="err" id="l63"><td><a href="#l63"><span>63</span></a></td><td><pre>caught exception '%s' while processing '%s'(MetadataException('Metadata Exception: pkg ebuild src: dev-python/starcluster-9999, attr description\nerror: Metadata Exception: pkg ebuild src: dev-python/starcluster-9999, attr data\nerror: inherit requires an unknown eclass, git cannot be found',), &lt;&lt;class 'pkgcore.ebuild.ebuild_src.package'&gt; cpv='dev-python/starcluster-9999' @0x7f6fc8ee1690&gt;)
</pre></td><td>[FATAL]</td></tr>
<tr class="" id="l64"><td><a href="#l64"><span>64</span></a></td><td><pre> * Cache regen failed with 1
</pre></td></tr>
diff --git a/quantumsummers.txt b/quantumsummers.txt
index 522727fe99f8..3b2e61ec029c 100644
--- a/quantumsummers.txt
+++ b/quantumsummers.txt
@@ -57,8 +57,8 @@ Sandboxed process killed by signal: Broken pipe
!!! The die message:
!!! inherit for git failed
-sandbox:stop caught signal 15 in pid 9279
+sandbox:stop caught signal 15 in pid 19779
Sandboxed process killed by signal: Terminated
!!! caught exception inherit requires an unknown eclass, git cannot be found while processing ebuild src: dev-python/starcluster-9999
-caught exception '%s' while processing '%s'(MetadataException('Metadata Exception: pkg ebuild src: dev-python/starcluster-9999, attr description\nerror: Metadata Exception: pkg ebuild src: dev-python/starcluster-9999, attr data\nerror: inherit requires an unknown eclass, git cannot be found',), <<class 'pkgcore.ebuild.ebuild_src.package'> cpv='dev-python/starcluster-9999' @0x7faa12f6f690>)
+caught exception '%s' while processing '%s'(MetadataException('Metadata Exception: pkg ebuild src: dev-python/starcluster-9999, attr description\nerror: Metadata Exception: pkg ebuild src: dev-python/starcluster-9999, attr data\nerror: inherit requires an unknown eclass, git cannot be found',), <<class 'pkgcore.ebuild.ebuild_src.package'> cpv='dev-python/starcluster-9999' @0x7f6fc8ee1690>)
* Cache regen failed with 1
diff --git a/rainyday.html b/rainyday.html
index 522830fc4e8f..2e5e9ae28af5 100644
--- a/rainyday.html
+++ b/rainyday.html
@@ -1232,7 +1232,7 @@
</pre></td><td>[FATAL]</td></tr>
<tr class="" id="l611"><td><a href="#l611"><span>611</span></a></td><td><pre>ERROR pkgcore: returned val from gen_metadata was 'False'
</pre></td></tr>
- <tr class="err" id="l612"><td><a href="#l612"><span>612</span></a></td><td><pre>caught exception '%s' while processing '%s'(MetadataException('Metadata Exception: pkg ebuild src: x11-libs/compizconfig-backend-kconfig4-0.8.4, attr description\nerror: Metadata Exception: pkg ebuild src: x11-libs/compizconfig-backend-kconfig4-0.8.4, attr data\nerror: False',), &lt;&lt;class 'pkgcore.ebuild.ebuild_src.package'&gt; cpv='x11-libs/compizconfig-backend-kconfig4-0.8.4' @0x7f216a74f190&gt;)
+ <tr class="err" id="l612"><td><a href="#l612"><span>612</span></a></td><td><pre>caught exception '%s' while processing '%s'(MetadataException('Metadata Exception: pkg ebuild src: x11-libs/compizconfig-backend-kconfig4-0.8.4, attr description\nerror: Metadata Exception: pkg ebuild src: x11-libs/compizconfig-backend-kconfig4-0.8.4, attr data\nerror: False',), &lt;&lt;class 'pkgcore.ebuild.ebuild_src.package'&gt; cpv='x11-libs/compizconfig-backend-kconfig4-0.8.4' @0x7f0317c23190&gt;)
</pre></td><td>[FATAL]</td></tr>
<tr class="" id="l613"><td><a href="#l613"><span>613</span></a></td><td><pre>ERROR pkgcore: returned val from gen_metadata was 'False'
</pre></td></tr>
@@ -1672,43 +1672,43 @@
</pre></td></tr>
<tr class="" id="l831"><td><a href="#l831"><span>831</span></a></td><td><pre>
</pre></td></tr>
- <tr class="" id="l832"><td><a href="#l832"><span>832</span></a></td><td><pre>ass 'pkgcore.ebuild.ebuild_src.package'&gt; cpv='x11-libs/compizconfig-backend-kconfig4-0.8.8' @0x7f216a74fe10&gt;)
+ <tr class="" id="l832"><td><a href="#l832"><span>832</span></a></td><td><pre>ass 'pkgcore.ebuild.ebuild_src.package'&gt; cpv='x11-libs/compizconfig-backend-kconfig4-0.8.8' @0x7f0317c23e10&gt;)
</pre></td></tr>
<tr class="" id="l833"><td><a href="#l833"><span>833</span></a></td><td><pre>ERROR pkgcore: returned val from gen_metadata was 'False'
</pre></td></tr>
- <tr class="err" id="l834"><td><a href="#l834"><span>834</span></a></td><td><pre>caught exception '%s' while processing '%s'(MetadataException('Metadata Exception: pkg ebuild src: app-pda/libopensync-plugin-kdepim-0.35, attr description\nerror: Metadata Exception: pkg ebuild src: app-pda/libopensync-plugin-kdepim-0.35, attr data\nerror: False',), &lt;&lt;class 'pkgcore.ebuild.ebuild_src.package'&gt; cpv='app-pda/libopensync-plugin-kdepim-0.35' @0x7f2169de0910&gt;)
+ <tr class="err" id="l834"><td><a href="#l834"><span>834</span></a></td><td><pre>caught exception '%s' while processing '%s'(MetadataException('Metadata Exception: pkg ebuild src: app-pda/libopensync-plugin-kdepim-0.35, attr description\nerror: Metadata Exception: pkg ebuild src: app-pda/libopensync-plugin-kdepim-0.35, attr data\nerror: False',), &lt;&lt;class 'pkgcore.ebuild.ebuild_src.package'&gt; cpv='app-pda/libopensync-plugin-kdepim-0.35' @0x7f03172b4910&gt;)
</pre></td><td>[FATAL]</td></tr>
<tr class="" id="l835"><td><a href="#l835"><span>835</span></a></td><td><pre>ERROR pkgcore: returned val from gen_metadata was 'False'
</pre></td></tr>
- <tr class="err" id="l836"><td><a href="#l836"><span>836</span></a></td><td><pre>caught exception '%s' while processing '%s'(MetadataException('Metadata Exception: pkg ebuild src: app-pda/libopensync-plugin-kdepim-0.36, attr description\nerror: Metadata Exception: pkg ebuild src: app-pda/libopensync-plugin-kdepim-0.36, attr data\nerror: False',), &lt;&lt;class 'pkgcore.ebuild.ebuild_src.package'&gt; cpv='app-pda/libopensync-plugin-kdepim-0.36' @0x7f216a74fe10&gt;)
+ <tr class="err" id="l836"><td><a href="#l836"><span>836</span></a></td><td><pre>caught exception '%s' while processing '%s'(MetadataException('Metadata Exception: pkg ebuild src: app-pda/libopensync-plugin-kdepim-0.36, attr description\nerror: Metadata Exception: pkg ebuild src: app-pda/libopensync-plugin-kdepim-0.36, attr data\nerror: False',), &lt;&lt;class 'pkgcore.ebuild.ebuild_src.package'&gt; cpv='app-pda/libopensync-plugin-kdepim-0.36' @0x7f0317c23e10&gt;)
</pre></td><td>[FATAL]</td></tr>
<tr class="" id="l837"><td><a href="#l837"><span>837</span></a></td><td><pre>ERROR pkgcore: returned val from gen_metadata was 'False'
</pre></td></tr>
- <tr class="err" id="l838"><td><a href="#l838"><span>838</span></a></td><td><pre>caught exception '%s' while processing '%s'(MetadataException('Metadata Exception: pkg ebuild src: app-pda/libopensync-plugin-kdepim-9999, attr description\nerror: Metadata Exception: pkg ebuild src: app-pda/libopensync-plugin-kdepim-9999, attr data\nerror: False',), &lt;&lt;class 'pkgcore.ebuild.ebuild_src.package'&gt; cpv='app-pda/libopensync-plugin-kdepim-9999' @0x7f2169de0910&gt;)
+ <tr class="err" id="l838"><td><a href="#l838"><span>838</span></a></td><td><pre>caught exception '%s' while processing '%s'(MetadataException('Metadata Exception: pkg ebuild src: app-pda/libopensync-plugin-kdepim-9999, attr description\nerror: Metadata Exception: pkg ebuild src: app-pda/libopensync-plugin-kdepim-9999, attr data\nerror: False',), &lt;&lt;class 'pkgcore.ebuild.ebuild_src.package'&gt; cpv='app-pda/libopensync-plugin-kdepim-9999' @0x7f03172b4910&gt;)
</pre></td><td>[FATAL]</td></tr>
<tr class="" id="l839"><td><a href="#l839"><span>839</span></a></td><td><pre>ERROR pkgcore: returned val from gen_metadata was 'False'
</pre></td></tr>
- <tr class="err" id="l840"><td><a href="#l840"><span>840</span></a></td><td><pre>caught exception '%s' while processing '%s'(MetadataException('Metadata Exception: pkg ebuild src: x11-wm/metacity-2.30.3, attr description\nerror: Metadata Exception: pkg ebuild src: x11-wm/metacity-2.30.3, attr data\nerror: False',), &lt;&lt;class 'pkgcore.ebuild.ebuild_src.package'&gt; cpv='x11-wm/metacity-2.30.3' @0x7f2169ccc2d0&gt;)
+ <tr class="err" id="l840"><td><a href="#l840"><span>840</span></a></td><td><pre>caught exception '%s' while processing '%s'(MetadataException('Metadata Exception: pkg ebuild src: x11-wm/metacity-2.30.3, attr description\nerror: Metadata Exception: pkg ebuild src: x11-wm/metacity-2.30.3, attr data\nerror: False',), &lt;&lt;class 'pkgcore.ebuild.ebuild_src.package'&gt; cpv='x11-wm/metacity-2.30.3' @0x7f03171a02d0&gt;)
</pre></td><td>[FATAL]</td></tr>
<tr class="" id="l841"><td><a href="#l841"><span>841</span></a></td><td><pre>ERROR pkgcore: returned val from gen_metadata was 'False'
</pre></td></tr>
- <tr class="err" id="l842"><td><a href="#l842"><span>842</span></a></td><td><pre>caught exception '%s' while processing '%s'(MetadataException('Metadata Exception: pkg ebuild src: dev-perl/DCOP-Amarok-Player-0.036, attr description\nerror: Metadata Exception: pkg ebuild src: dev-perl/DCOP-Amarok-Player-0.036, attr data\nerror: False',), &lt;&lt;class 'pkgcore.ebuild.ebuild_src.package'&gt; cpv='dev-perl/DCOP-Amarok-Player-0.036' @0x7f2169c63e10&gt;)
+ <tr class="err" id="l842"><td><a href="#l842"><span>842</span></a></td><td><pre>caught exception '%s' while processing '%s'(MetadataException('Metadata Exception: pkg ebuild src: dev-perl/DCOP-Amarok-Player-0.036, attr description\nerror: Metadata Exception: pkg ebuild src: dev-perl/DCOP-Amarok-Player-0.036, attr data\nerror: False',), &lt;&lt;class 'pkgcore.ebuild.ebuild_src.package'&gt; cpv='dev-perl/DCOP-Amarok-Player-0.036' @0x7f0317137e10&gt;)
</pre></td><td>[FATAL]</td></tr>
<tr class="" id="l843"><td><a href="#l843"><span>843</span></a></td><td><pre>ERROR pkgcore: returned val from gen_metadata was 'False'
</pre></td></tr>
- <tr class="err" id="l844"><td><a href="#l844"><span>844</span></a></td><td><pre>caught exception '%s' while processing '%s'(MetadataException('Metadata Exception: pkg ebuild src: dev-perl/DCOP-Amarok-Player-0.037, attr description\nerror: Metadata Exception: pkg ebuild src: dev-perl/DCOP-Amarok-Player-0.037, attr data\nerror: False',), &lt;&lt;class 'pkgcore.ebuild.ebuild_src.package'&gt; cpv='dev-perl/DCOP-Amarok-Player-0.037' @0x7f2169ccc2d0&gt;)
+ <tr class="err" id="l844"><td><a href="#l844"><span>844</span></a></td><td><pre>caught exception '%s' while processing '%s'(MetadataException('Metadata Exception: pkg ebuild src: dev-perl/DCOP-Amarok-Player-0.037, attr description\nerror: Metadata Exception: pkg ebuild src: dev-perl/DCOP-Amarok-Player-0.037, attr data\nerror: False',), &lt;&lt;class 'pkgcore.ebuild.ebuild_src.package'&gt; cpv='dev-perl/DCOP-Amarok-Player-0.037' @0x7f03171a02d0&gt;)
</pre></td><td>[FATAL]</td></tr>
<tr class="" id="l845"><td><a href="#l845"><span>845</span></a></td><td><pre>ERROR pkgcore: returned val from gen_metadata was 'False'
</pre></td></tr>
- <tr class="err" id="l846"><td><a href="#l846"><span>846</span></a></td><td><pre>caught exception '%s' while processing '%s'(MetadataException('Metadata Exception: pkg ebuild src: dev-perl/DCOP-Amarok-0.035, attr description\nerror: Metadata Exception: pkg ebuild src: dev-perl/DCOP-Amarok-0.035, attr data\nerror: False',), &lt;&lt;class 'pkgcore.ebuild.ebuild_src.package'&gt; cpv='dev-perl/DCOP-Amarok-0.035' @0x7f2169c63e10&gt;)
+ <tr class="err" id="l846"><td><a href="#l846"><span>846</span></a></td><td><pre>caught exception '%s' while processing '%s'(MetadataException('Metadata Exception: pkg ebuild src: dev-perl/DCOP-Amarok-0.035, attr description\nerror: Metadata Exception: pkg ebuild src: dev-perl/DCOP-Amarok-0.035, attr data\nerror: False',), &lt;&lt;class 'pkgcore.ebuild.ebuild_src.package'&gt; cpv='dev-perl/DCOP-Amarok-0.035' @0x7f0317137e10&gt;)
</pre></td><td>[FATAL]</td></tr>
<tr class="" id="l847"><td><a href="#l847"><span>847</span></a></td><td><pre>ERROR pkgcore: returned val from gen_metadata was 'False'
</pre></td></tr>
- <tr class="err" id="l848"><td><a href="#l848"><span>848</span></a></td><td><pre>caught exception '%s' while processing '%s'(MetadataException('Metadata Exception: pkg ebuild src: dev-perl/DCOP-Amarok-0.036, attr description\nerror: Metadata Exception: pkg ebuild src: dev-perl/DCOP-Amarok-0.036, attr data\nerror: False',), &lt;&lt;class 'pkgcore.ebuild.ebuild_src.package'&gt; cpv='dev-perl/DCOP-Amarok-0.036' @0x7f2169ccc2d0&gt;)
+ <tr class="err" id="l848"><td><a href="#l848"><span>848</span></a></td><td><pre>caught exception '%s' while processing '%s'(MetadataException('Metadata Exception: pkg ebuild src: dev-perl/DCOP-Amarok-0.036, attr description\nerror: Metadata Exception: pkg ebuild src: dev-perl/DCOP-Amarok-0.036, attr data\nerror: False',), &lt;&lt;class 'pkgcore.ebuild.ebuild_src.package'&gt; cpv='dev-perl/DCOP-Amarok-0.036' @0x7f03171a02d0&gt;)
</pre></td><td>[FATAL]</td></tr>
<tr class="" id="l849"><td><a href="#l849"><span>849</span></a></td><td><pre>ERROR pkgcore: returned val from gen_metadata was 'False'
</pre></td></tr>
- <tr class="err" id="l850"><td><a href="#l850"><span>850</span></a></td><td><pre>caught exception '%s' while processing '%s'(MetadataException('Metadata Exception: pkg ebuild src: dev-perl/DCOP-0.036, attr description\nerror: Metadata Exception: pkg ebuild src: dev-perl/DCOP-0.036, attr data\nerror: False',), &lt;&lt;class 'pkgcore.ebuild.ebuild_src.package'&gt; cpv='dev-perl/DCOP-0.036' @0x7f2169c63e10&gt;)
+ <tr class="err" id="l850"><td><a href="#l850"><span>850</span></a></td><td><pre>caught exception '%s' while processing '%s'(MetadataException('Metadata Exception: pkg ebuild src: dev-perl/DCOP-0.036, attr description\nerror: Metadata Exception: pkg ebuild src: dev-perl/DCOP-0.036, attr data\nerror: False',), &lt;&lt;class 'pkgcore.ebuild.ebuild_src.package'&gt; cpv='dev-perl/DCOP-0.036' @0x7f0317137e10&gt;)
</pre></td><td>[FATAL]</td></tr>
<tr class="" id="l851"><td><a href="#l851"><span>851</span></a></td><td><pre>ERROR pkgcore: returned val from gen_metadata was 'False'
</pre></td></tr>
@@ -2186,51 +2186,51 @@
</pre></td></tr>
<tr class="" id="l1088"><td><a href="#l1088"><span>1088</span></a></td><td><pre>
</pre></td></tr>
- <tr class="" id="l1089"><td><a href="#l1089"><span>1089</span></a></td><td><pre> &lt;&lt;class 'pkgcore.ebuild.ebuild_src.package'&gt; cpv='dev-perl/DCOP-0.038' @0x7f2169ccc2d0&gt;)
+ <tr class="" id="l1089"><td><a href="#l1089"><span>1089</span></a></td><td><pre> &lt;&lt;class 'pkgcore.ebuild.ebuild_src.package'&gt; cpv='dev-perl/DCOP-0.038' @0x7f03171a02d0&gt;)
</pre></td></tr>
<tr class="" id="l1090"><td><a href="#l1090"><span>1090</span></a></td><td><pre>ERROR pkgcore: returned val from gen_metadata was 'False'
</pre></td></tr>
- <tr class="err" id="l1091"><td><a href="#l1091"><span>1091</span></a></td><td><pre>caught exception '%s' while processing '%s'(MetadataException('Metadata Exception: pkg ebuild src: dev-perl/PerlQt-3.009_beta2, attr description\nerror: Metadata Exception: pkg ebuild src: dev-perl/PerlQt-3.009_beta2, attr data\nerror: False',), &lt;&lt;class 'pkgcore.ebuild.ebuild_src.package'&gt; cpv='dev-perl/PerlQt-3.009_beta2' @0x7f2169c63e10&gt;)
+ <tr class="err" id="l1091"><td><a href="#l1091"><span>1091</span></a></td><td><pre>caught exception '%s' while processing '%s'(MetadataException('Metadata Exception: pkg ebuild src: dev-perl/PerlQt-3.009_beta2, attr description\nerror: Metadata Exception: pkg ebuild src: dev-perl/PerlQt-3.009_beta2, attr data\nerror: False',), &lt;&lt;class 'pkgcore.ebuild.ebuild_src.package'&gt; cpv='dev-perl/PerlQt-3.009_beta2' @0x7f0317137e10&gt;)
</pre></td><td>[FATAL]</td></tr>
<tr class="" id="l1092"><td><a href="#l1092"><span>1092</span></a></td><td><pre>ERROR pkgcore: returned val from gen_metadata was 'False'
</pre></td></tr>
- <tr class="err" id="l1093"><td><a href="#l1093"><span>1093</span></a></td><td><pre>caught exception '%s' while processing '%s'(MetadataException('Metadata Exception: pkg ebuild src: x11-themes/gtk-engines-qt-0.8-r4, attr description\nerror: Metadata Exception: pkg ebuild src: x11-themes/gtk-engines-qt-0.8-r4, attr data\nerror: False',), &lt;&lt;class 'pkgcore.ebuild.ebuild_src.package'&gt; cpv='x11-themes/gtk-engines-qt-0.8-r4' @0x7f2169c18a50&gt;)
+ <tr class="err" id="l1093"><td><a href="#l1093"><span>1093</span></a></td><td><pre>caught exception '%s' while processing '%s'(MetadataException('Metadata Exception: pkg ebuild src: x11-themes/gtk-engines-qt-0.8-r4, attr description\nerror: Metadata Exception: pkg ebuild src: x11-themes/gtk-engines-qt-0.8-r4, attr data\nerror: False',), &lt;&lt;class 'pkgcore.ebuild.ebuild_src.package'&gt; cpv='x11-themes/gtk-engines-qt-0.8-r4' @0x7f03170eca50&gt;)
</pre></td><td>[FATAL]</td></tr>
<tr class="" id="l1094"><td><a href="#l1094"><span>1094</span></a></td><td><pre>ERROR pkgcore: returned val from gen_metadata was 'False'
</pre></td></tr>
- <tr class="err" id="l1095"><td><a href="#l1095"><span>1095</span></a></td><td><pre>caught exception '%s' while processing '%s'(MetadataException('Metadata Exception: pkg ebuild src: x11-themes/qtcurve-0.59.2, attr description\nerror: Metadata Exception: pkg ebuild src: x11-themes/qtcurve-0.59.2, attr data\nerror: False',), &lt;&lt;class 'pkgcore.ebuild.ebuild_src.package'&gt; cpv='x11-themes/qtcurve-0.59.2' @0x7f2169ba22d0&gt;)
+ <tr class="err" id="l1095"><td><a href="#l1095"><span>1095</span></a></td><td><pre>caught exception '%s' while processing '%s'(MetadataException('Metadata Exception: pkg ebuild src: x11-themes/qtcurve-0.59.2, attr description\nerror: Metadata Exception: pkg ebuild src: x11-themes/qtcurve-0.59.2, attr data\nerror: False',), &lt;&lt;class 'pkgcore.ebuild.ebuild_src.package'&gt; cpv='x11-themes/qtcurve-0.59.2' @0x7f03170762d0&gt;)
</pre></td><td>[FATAL]</td></tr>
<tr class="" id="l1096"><td><a href="#l1096"><span>1096</span></a></td><td><pre>ERROR pkgcore: returned val from gen_metadata was 'False'
</pre></td></tr>
- <tr class="err" id="l1097"><td><a href="#l1097"><span>1097</span></a></td><td><pre>caught exception '%s' while processing '%s'(MetadataException('Metadata Exception: pkg ebuild src: x11-themes/qtcurve-0.59.5, attr description\nerror: Metadata Exception: pkg ebuild src: x11-themes/qtcurve-0.59.5, attr data\nerror: False',), &lt;&lt;class 'pkgcore.ebuild.ebuild_src.package'&gt; cpv='x11-themes/qtcurve-0.59.5' @0x7f2169c18a50&gt;)
+ <tr class="err" id="l1097"><td><a href="#l1097"><span>1097</span></a></td><td><pre>caught exception '%s' while processing '%s'(MetadataException('Metadata Exception: pkg ebuild src: x11-themes/qtcurve-0.59.5, attr description\nerror: Metadata Exception: pkg ebuild src: x11-themes/qtcurve-0.59.5, attr data\nerror: False',), &lt;&lt;class 'pkgcore.ebuild.ebuild_src.package'&gt; cpv='x11-themes/qtcurve-0.59.5' @0x7f03170eca50&gt;)
</pre></td><td>[FATAL]</td></tr>
<tr class="" id="l1098"><td><a href="#l1098"><span>1098</span></a></td><td><pre>ERROR pkgcore: returned val from gen_metadata was 'False'
</pre></td></tr>
- <tr class="err" id="l1099"><td><a href="#l1099"><span>1099</span></a></td><td><pre>caught exception '%s' while processing '%s'(MetadataException('Metadata Exception: pkg ebuild src: x11-themes/qtcurve-0.65.2, attr description\nerror: Metadata Exception: pkg ebuild src: x11-themes/qtcurve-0.65.2, attr data\nerror: False',), &lt;&lt;class 'pkgcore.ebuild.ebuild_src.package'&gt; cpv='x11-themes/qtcurve-0.65.2' @0x7f2169ba22d0&gt;)
+ <tr class="err" id="l1099"><td><a href="#l1099"><span>1099</span></a></td><td><pre>caught exception '%s' while processing '%s'(MetadataException('Metadata Exception: pkg ebuild src: x11-themes/qtcurve-0.65.2, attr description\nerror: Metadata Exception: pkg ebuild src: x11-themes/qtcurve-0.65.2, attr data\nerror: False',), &lt;&lt;class 'pkgcore.ebuild.ebuild_src.package'&gt; cpv='x11-themes/qtcurve-0.65.2' @0x7f03170762d0&gt;)
</pre></td><td>[FATAL]</td></tr>
<tr class="" id="l1100"><td><a href="#l1100"><span>1100</span></a></td><td><pre>ERROR pkgcore: returned val from gen_metadata was 'False'
</pre></td></tr>
- <tr class="err" id="l1101"><td><a href="#l1101"><span>1101</span></a></td><td><pre>caught exception '%s' while processing '%s'(MetadataException('Metadata Exception: pkg ebuild src: x11-themes/qtcurve-0.68.1, attr description\nerror: Metadata Exception: pkg ebuild src: x11-themes/qtcurve-0.68.1, attr data\nerror: False',), &lt;&lt;class 'pkgcore.ebuild.ebuild_src.package'&gt; cpv='x11-themes/qtcurve-0.68.1' @0x7f2169c18a50&gt;)
+ <tr class="err" id="l1101"><td><a href="#l1101"><span>1101</span></a></td><td><pre>caught exception '%s' while processing '%s'(MetadataException('Metadata Exception: pkg ebuild src: x11-themes/qtcurve-0.68.1, attr description\nerror: Metadata Exception: pkg ebuild src: x11-themes/qtcurve-0.68.1, attr data\nerror: False',), &lt;&lt;class 'pkgcore.ebuild.ebuild_src.package'&gt; cpv='x11-themes/qtcurve-0.68.1' @0x7f03170eca50&gt;)
</pre></td><td>[FATAL]</td></tr>
<tr class="" id="l1102"><td><a href="#l1102"><span>1102</span></a></td><td><pre>ERROR pkgcore: returned val from gen_metadata was 'False'
</pre></td></tr>
- <tr class="err" id="l1103"><td><a href="#l1103"><span>1103</span></a></td><td><pre>caught exception '%s' while processing '%s'(MetadataException('Metadata Exception: pkg ebuild src: x11-themes/qtcurve-0.69.1, attr description\nerror: Metadata Exception: pkg ebuild src: x11-themes/qtcurve-0.69.1, attr data\nerror: False',), &lt;&lt;class 'pkgcore.ebuild.ebuild_src.package'&gt; cpv='x11-themes/qtcurve-0.69.1' @0x7f2169ba22d0&gt;)
+ <tr class="err" id="l1103"><td><a href="#l1103"><span>1103</span></a></td><td><pre>caught exception '%s' while processing '%s'(MetadataException('Metadata Exception: pkg ebuild src: x11-themes/qtcurve-0.69.1, attr description\nerror: Metadata Exception: pkg ebuild src: x11-themes/qtcurve-0.69.1, attr data\nerror: False',), &lt;&lt;class 'pkgcore.ebuild.ebuild_src.package'&gt; cpv='x11-themes/qtcurve-0.69.1' @0x7f03170762d0&gt;)
</pre></td><td>[FATAL]</td></tr>
<tr class="" id="l1104"><td><a href="#l1104"><span>1104</span></a></td><td><pre>ERROR pkgcore: returned val from gen_metadata was 'False'
</pre></td></tr>
- <tr class="err" id="l1105"><td><a href="#l1105"><span>1105</span></a></td><td><pre>caught exception '%s' while processing '%s'(MetadataException('Metadata Exception: pkg ebuild src: net-misc/gwget-1.0.4-r1, attr description\nerror: Metadata Exception: pkg ebuild src: net-misc/gwget-1.0.4-r1, attr data\nerror: False',), &lt;&lt;class 'pkgcore.ebuild.ebuild_src.package'&gt; cpv='net-misc/gwget-1.0.4-r1' @0x7f2169bd0050&gt;)
+ <tr class="err" id="l1105"><td><a href="#l1105"><span>1105</span></a></td><td><pre>caught exception '%s' while processing '%s'(MetadataException('Metadata Exception: pkg ebuild src: net-misc/gwget-1.0.4-r1, attr description\nerror: Metadata Exception: pkg ebuild src: net-misc/gwget-1.0.4-r1, attr data\nerror: False',), &lt;&lt;class 'pkgcore.ebuild.ebuild_src.package'&gt; cpv='net-misc/gwget-1.0.4-r1' @0x7f03170a4050&gt;)
</pre></td><td>[FATAL]</td></tr>
<tr class="" id="l1106"><td><a href="#l1106"><span>1106</span></a></td><td><pre>ERROR pkgcore: returned val from gen_metadata was 'False'
</pre></td></tr>
- <tr class="err" id="l1107"><td><a href="#l1107"><span>1107</span></a></td><td><pre>caught exception '%s' while processing '%s'(MetadataException('Metadata Exception: pkg ebuild src: media-video/asdf-0.4, attr description\nerror: Metadata Exception: pkg ebuild src: media-video/asdf-0.4, attr data\nerror: False',), &lt;&lt;class 'pkgcore.ebuild.ebuild_src.package'&gt; cpv='media-video/asdf-0.4' @0x7f2169b5f550&gt;)
+ <tr class="err" id="l1107"><td><a href="#l1107"><span>1107</span></a></td><td><pre>caught exception '%s' while processing '%s'(MetadataException('Metadata Exception: pkg ebuild src: media-video/asdf-0.4, attr description\nerror: Metadata Exception: pkg ebuild src: media-video/asdf-0.4, attr data\nerror: False',), &lt;&lt;class 'pkgcore.ebuild.ebuild_src.package'&gt; cpv='media-video/asdf-0.4' @0x7f0317033550&gt;)
</pre></td><td>[FATAL]</td></tr>
<tr class="" id="l1108"><td><a href="#l1108"><span>1108</span></a></td><td><pre>ERROR pkgcore: returned val from gen_metadata was 'False'
</pre></td></tr>
- <tr class="err" id="l1109"><td><a href="#l1109"><span>1109</span></a></td><td><pre>caught exception '%s' while processing '%s'(MetadataException('Metadata Exception: pkg ebuild src: media-video/dpencoder-0.6c, attr description\nerror: Metadata Exception: pkg ebuild src: media-video/dpencoder-0.6c, attr data\nerror: False',), &lt;&lt;class 'pkgcore.ebuild.ebuild_src.package'&gt; cpv='media-video/dpencoder-0.6c' @0x7f2169b5fa50&gt;)
+ <tr class="err" id="l1109"><td><a href="#l1109"><span>1109</span></a></td><td><pre>caught exception '%s' while processing '%s'(MetadataException('Metadata Exception: pkg ebuild src: media-video/dpencoder-0.6c, attr description\nerror: Metadata Exception: pkg ebuild src: media-video/dpencoder-0.6c, attr data\nerror: False',), &lt;&lt;class 'pkgcore.ebuild.ebuild_src.package'&gt; cpv='media-video/dpencoder-0.6c' @0x7f0317033a50&gt;)
</pre></td><td>[FATAL]</td></tr>
<tr class="" id="l1110"><td><a href="#l1110"><span>1110</span></a></td><td><pre>ERROR pkgcore: returned val from gen_metadata was 'False'
</pre></td></tr>
- <tr class="err" id="l1111"><td><a href="#l1111"><span>1111</span></a></td><td><pre>caught exception '%s' while processing '%s'(MetadataException('Metadata Exception: pkg ebuild src: kde-base/dcopperl-3.5.10, attr description\nerror: Metadata Exception: pkg ebuild src: kde-base/dcopperl-3.5.10, attr data\nerror: False',), &lt;&lt;class 'pkgcore.ebuild.ebuild_src.package'&gt; cpv='kde-base/dcopperl-3.5.10' @0x7f2169b84e10&gt;)
+ <tr class="err" id="l1111"><td><a href="#l1111"><span>1111</span></a></td><td><pre>caught exception '%s' while processing '%s'(MetadataException('Metadata Exception: pkg ebuild src: kde-base/dcopperl-3.5.10, attr description\nerror: Metadata Exception: pkg ebuild src: kde-base/dcopperl-3.5.10, attr data\nerror: False',), &lt;&lt;class 'pkgcore.ebuild.ebuild_src.package'&gt; cpv='kde-base/dcopperl-3.5.10' @0x7f0317058e10&gt;)
</pre></td><td>[FATAL]</td></tr>
<tr class="" id="l1112"><td><a href="#l1112"><span>1112</span></a></td><td><pre> * Cache regen failed with 1
</pre></td></tr>
diff --git a/rainyday.txt b/rainyday.txt
index 69fdbdf3415d..fdb95a1ba9dc 100644
--- a/rainyday.txt
+++ b/rainyday.txt
@@ -609,7 +609,7 @@ ERROR pkgcore: returned val from gen_metadata was 'False'
ERROR pkgcore: returned val from gen_metadata was 'False'
!!! caught exception False while processing ebuild src: kde-base/dcopperl-3.5.10
ERROR pkgcore: returned val from gen_metadata was 'False'
-caught exception '%s' while processing '%s'(MetadataException('Metadata Exception: pkg ebuild src: x11-libs/compizconfig-backend-kconfig4-0.8.4, attr description\nerror: Metadata Exception: pkg ebuild src: x11-libs/compizconfig-backend-kconfig4-0.8.4, attr data\nerror: False',), <<class 'pkgcore.ebuild.ebuild_src.package'> cpv='x11-libs/compizconfig-backend-kconfig4-0.8.4' @0x7f216a74f190>)
+caught exception '%s' while processing '%s'(MetadataException('Metadata Exception: pkg ebuild src: x11-libs/compizconfig-backend-kconfig4-0.8.4, attr description\nerror: Metadata Exception: pkg ebuild src: x11-libs/compizconfig-backend-kconfig4-0.8.4, attr data\nerror: False',), <<class 'pkgcore.ebuild.ebuild_src.package'> cpv='x11-libs/compizconfig-backend-kconfig4-0.8.4' @0x7f0317c23190>)
ERROR pkgcore: returned val from gen_metadata was 'False'
caught exception '%s' while processing '%s'(MetadataException('Metadata Exception: pkg ebuild src: x11-libs/compizconfig-backend-kconfig4-0.8.8, attr description\nerror: Metadata Exception: pkg ebuild src: x11-libs/compizconfig-backend-kconfig4-0.8.8, attr data\nerror: False',), <<cl
!!! ERROR: app-pda/libopensync-plugin-kdepim-0.35 failed.
@@ -829,25 +829,25 @@ caught exception '%s' while processing '%s'(MetadataException('Metadata Exceptio
!!! The die message:
!!! EAPI= is not supported by perl-functions.eclass
-ass 'pkgcore.ebuild.ebuild_src.package'> cpv='x11-libs/compizconfig-backend-kconfig4-0.8.8' @0x7f216a74fe10>)
+ass 'pkgcore.ebuild.ebuild_src.package'> cpv='x11-libs/compizconfig-backend-kconfig4-0.8.8' @0x7f0317c23e10>)
ERROR pkgcore: returned val from gen_metadata was 'False'
-caught exception '%s' while processing '%s'(MetadataException('Metadata Exception: pkg ebuild src: app-pda/libopensync-plugin-kdepim-0.35, attr description\nerror: Metadata Exception: pkg ebuild src: app-pda/libopensync-plugin-kdepim-0.35, attr data\nerror: False',), <<class 'pkgcore.ebuild.ebuild_src.package'> cpv='app-pda/libopensync-plugin-kdepim-0.35' @0x7f2169de0910>)
+caught exception '%s' while processing '%s'(MetadataException('Metadata Exception: pkg ebuild src: app-pda/libopensync-plugin-kdepim-0.35, attr description\nerror: Metadata Exception: pkg ebuild src: app-pda/libopensync-plugin-kdepim-0.35, attr data\nerror: False',), <<class 'pkgcore.ebuild.ebuild_src.package'> cpv='app-pda/libopensync-plugin-kdepim-0.35' @0x7f03172b4910>)
ERROR pkgcore: returned val from gen_metadata was 'False'
-caught exception '%s' while processing '%s'(MetadataException('Metadata Exception: pkg ebuild src: app-pda/libopensync-plugin-kdepim-0.36, attr description\nerror: Metadata Exception: pkg ebuild src: app-pda/libopensync-plugin-kdepim-0.36, attr data\nerror: False',), <<class 'pkgcore.ebuild.ebuild_src.package'> cpv='app-pda/libopensync-plugin-kdepim-0.36' @0x7f216a74fe10>)
+caught exception '%s' while processing '%s'(MetadataException('Metadata Exception: pkg ebuild src: app-pda/libopensync-plugin-kdepim-0.36, attr description\nerror: Metadata Exception: pkg ebuild src: app-pda/libopensync-plugin-kdepim-0.36, attr data\nerror: False',), <<class 'pkgcore.ebuild.ebuild_src.package'> cpv='app-pda/libopensync-plugin-kdepim-0.36' @0x7f0317c23e10>)
ERROR pkgcore: returned val from gen_metadata was 'False'
-caught exception '%s' while processing '%s'(MetadataException('Metadata Exception: pkg ebuild src: app-pda/libopensync-plugin-kdepim-9999, attr description\nerror: Metadata Exception: pkg ebuild src: app-pda/libopensync-plugin-kdepim-9999, attr data\nerror: False',), <<class 'pkgcore.ebuild.ebuild_src.package'> cpv='app-pda/libopensync-plugin-kdepim-9999' @0x7f2169de0910>)
+caught exception '%s' while processing '%s'(MetadataException('Metadata Exception: pkg ebuild src: app-pda/libopensync-plugin-kdepim-9999, attr description\nerror: Metadata Exception: pkg ebuild src: app-pda/libopensync-plugin-kdepim-9999, attr data\nerror: False',), <<class 'pkgcore.ebuild.ebuild_src.package'> cpv='app-pda/libopensync-plugin-kdepim-9999' @0x7f03172b4910>)
ERROR pkgcore: returned val from gen_metadata was 'False'
-caught exception '%s' while processing '%s'(MetadataException('Metadata Exception: pkg ebuild src: x11-wm/metacity-2.30.3, attr description\nerror: Metadata Exception: pkg ebuild src: x11-wm/metacity-2.30.3, attr data\nerror: False',), <<class 'pkgcore.ebuild.ebuild_src.package'> cpv='x11-wm/metacity-2.30.3' @0x7f2169ccc2d0>)
+caught exception '%s' while processing '%s'(MetadataException('Metadata Exception: pkg ebuild src: x11-wm/metacity-2.30.3, attr description\nerror: Metadata Exception: pkg ebuild src: x11-wm/metacity-2.30.3, attr data\nerror: False',), <<class 'pkgcore.ebuild.ebuild_src.package'> cpv='x11-wm/metacity-2.30.3' @0x7f03171a02d0>)
ERROR pkgcore: returned val from gen_metadata was 'False'
-caught exception '%s' while processing '%s'(MetadataException('Metadata Exception: pkg ebuild src: dev-perl/DCOP-Amarok-Player-0.036, attr description\nerror: Metadata Exception: pkg ebuild src: dev-perl/DCOP-Amarok-Player-0.036, attr data\nerror: False',), <<class 'pkgcore.ebuild.ebuild_src.package'> cpv='dev-perl/DCOP-Amarok-Player-0.036' @0x7f2169c63e10>)
+caught exception '%s' while processing '%s'(MetadataException('Metadata Exception: pkg ebuild src: dev-perl/DCOP-Amarok-Player-0.036, attr description\nerror: Metadata Exception: pkg ebuild src: dev-perl/DCOP-Amarok-Player-0.036, attr data\nerror: False',), <<class 'pkgcore.ebuild.ebuild_src.package'> cpv='dev-perl/DCOP-Amarok-Player-0.036' @0x7f0317137e10>)
ERROR pkgcore: returned val from gen_metadata was 'False'
-caught exception '%s' while processing '%s'(MetadataException('Metadata Exception: pkg ebuild src: dev-perl/DCOP-Amarok-Player-0.037, attr description\nerror: Metadata Exception: pkg ebuild src: dev-perl/DCOP-Amarok-Player-0.037, attr data\nerror: False',), <<class 'pkgcore.ebuild.ebuild_src.package'> cpv='dev-perl/DCOP-Amarok-Player-0.037' @0x7f2169ccc2d0>)
+caught exception '%s' while processing '%s'(MetadataException('Metadata Exception: pkg ebuild src: dev-perl/DCOP-Amarok-Player-0.037, attr description\nerror: Metadata Exception: pkg ebuild src: dev-perl/DCOP-Amarok-Player-0.037, attr data\nerror: False',), <<class 'pkgcore.ebuild.ebuild_src.package'> cpv='dev-perl/DCOP-Amarok-Player-0.037' @0x7f03171a02d0>)
ERROR pkgcore: returned val from gen_metadata was 'False'
-caught exception '%s' while processing '%s'(MetadataException('Metadata Exception: pkg ebuild src: dev-perl/DCOP-Amarok-0.035, attr description\nerror: Metadata Exception: pkg ebuild src: dev-perl/DCOP-Amarok-0.035, attr data\nerror: False',), <<class 'pkgcore.ebuild.ebuild_src.package'> cpv='dev-perl/DCOP-Amarok-0.035' @0x7f2169c63e10>)
+caught exception '%s' while processing '%s'(MetadataException('Metadata Exception: pkg ebuild src: dev-perl/DCOP-Amarok-0.035, attr description\nerror: Metadata Exception: pkg ebuild src: dev-perl/DCOP-Amarok-0.035, attr data\nerror: False',), <<class 'pkgcore.ebuild.ebuild_src.package'> cpv='dev-perl/DCOP-Amarok-0.035' @0x7f0317137e10>)
ERROR pkgcore: returned val from gen_metadata was 'False'
-caught exception '%s' while processing '%s'(MetadataException('Metadata Exception: pkg ebuild src: dev-perl/DCOP-Amarok-0.036, attr description\nerror: Metadata Exception: pkg ebuild src: dev-perl/DCOP-Amarok-0.036, attr data\nerror: False',), <<class 'pkgcore.ebuild.ebuild_src.package'> cpv='dev-perl/DCOP-Amarok-0.036' @0x7f2169ccc2d0>)
+caught exception '%s' while processing '%s'(MetadataException('Metadata Exception: pkg ebuild src: dev-perl/DCOP-Amarok-0.036, attr description\nerror: Metadata Exception: pkg ebuild src: dev-perl/DCOP-Amarok-0.036, attr data\nerror: False',), <<class 'pkgcore.ebuild.ebuild_src.package'> cpv='dev-perl/DCOP-Amarok-0.036' @0x7f03171a02d0>)
ERROR pkgcore: returned val from gen_metadata was 'False'
-caught exception '%s' while processing '%s'(MetadataException('Metadata Exception: pkg ebuild src: dev-perl/DCOP-0.036, attr description\nerror: Metadata Exception: pkg ebuild src: dev-perl/DCOP-0.036, attr data\nerror: False',), <<class 'pkgcore.ebuild.ebuild_src.package'> cpv='dev-perl/DCOP-0.036' @0x7f2169c63e10>)
+caught exception '%s' while processing '%s'(MetadataException('Metadata Exception: pkg ebuild src: dev-perl/DCOP-0.036, attr description\nerror: Metadata Exception: pkg ebuild src: dev-perl/DCOP-0.036, attr data\nerror: False',), <<class 'pkgcore.ebuild.ebuild_src.package'> cpv='dev-perl/DCOP-0.036' @0x7f0317137e10>)
ERROR pkgcore: returned val from gen_metadata was 'False'
caught exception '%s' while processing '%s'(MetadataException('Metadata Exception: pkg ebuild src: dev-perl/DCOP-0.038, attr description\nerror: Metadata Exception: pkg ebuild src: dev-perl/DCOP-0.038, attr data\nerror: False',),
!!! ERROR: dev-perl/PerlQt-3.009_beta2 failed.
@@ -1086,27 +1086,27 @@ caught exception '%s' while processing '%s'(MetadataException('Metadata Exceptio
!!! The die message:
!!! EAPI=1 is not supported by perl-functions.eclass
- <<class 'pkgcore.ebuild.ebuild_src.package'> cpv='dev-perl/DCOP-0.038' @0x7f2169ccc2d0>)
+ <<class 'pkgcore.ebuild.ebuild_src.package'> cpv='dev-perl/DCOP-0.038' @0x7f03171a02d0>)
ERROR pkgcore: returned val from gen_metadata was 'False'
-caught exception '%s' while processing '%s'(MetadataException('Metadata Exception: pkg ebuild src: dev-perl/PerlQt-3.009_beta2, attr description\nerror: Metadata Exception: pkg ebuild src: dev-perl/PerlQt-3.009_beta2, attr data\nerror: False',), <<class 'pkgcore.ebuild.ebuild_src.package'> cpv='dev-perl/PerlQt-3.009_beta2' @0x7f2169c63e10>)
+caught exception '%s' while processing '%s'(MetadataException('Metadata Exception: pkg ebuild src: dev-perl/PerlQt-3.009_beta2, attr description\nerror: Metadata Exception: pkg ebuild src: dev-perl/PerlQt-3.009_beta2, attr data\nerror: False',), <<class 'pkgcore.ebuild.ebuild_src.package'> cpv='dev-perl/PerlQt-3.009_beta2' @0x7f0317137e10>)
ERROR pkgcore: returned val from gen_metadata was 'False'
-caught exception '%s' while processing '%s'(MetadataException('Metadata Exception: pkg ebuild src: x11-themes/gtk-engines-qt-0.8-r4, attr description\nerror: Metadata Exception: pkg ebuild src: x11-themes/gtk-engines-qt-0.8-r4, attr data\nerror: False',), <<class 'pkgcore.ebuild.ebuild_src.package'> cpv='x11-themes/gtk-engines-qt-0.8-r4' @0x7f2169c18a50>)
+caught exception '%s' while processing '%s'(MetadataException('Metadata Exception: pkg ebuild src: x11-themes/gtk-engines-qt-0.8-r4, attr description\nerror: Metadata Exception: pkg ebuild src: x11-themes/gtk-engines-qt-0.8-r4, attr data\nerror: False',), <<class 'pkgcore.ebuild.ebuild_src.package'> cpv='x11-themes/gtk-engines-qt-0.8-r4' @0x7f03170eca50>)
ERROR pkgcore: returned val from gen_metadata was 'False'
-caught exception '%s' while processing '%s'(MetadataException('Metadata Exception: pkg ebuild src: x11-themes/qtcurve-0.59.2, attr description\nerror: Metadata Exception: pkg ebuild src: x11-themes/qtcurve-0.59.2, attr data\nerror: False',), <<class 'pkgcore.ebuild.ebuild_src.package'> cpv='x11-themes/qtcurve-0.59.2' @0x7f2169ba22d0>)
+caught exception '%s' while processing '%s'(MetadataException('Metadata Exception: pkg ebuild src: x11-themes/qtcurve-0.59.2, attr description\nerror: Metadata Exception: pkg ebuild src: x11-themes/qtcurve-0.59.2, attr data\nerror: False',), <<class 'pkgcore.ebuild.ebuild_src.package'> cpv='x11-themes/qtcurve-0.59.2' @0x7f03170762d0>)
ERROR pkgcore: returned val from gen_metadata was 'False'
-caught exception '%s' while processing '%s'(MetadataException('Metadata Exception: pkg ebuild src: x11-themes/qtcurve-0.59.5, attr description\nerror: Metadata Exception: pkg ebuild src: x11-themes/qtcurve-0.59.5, attr data\nerror: False',), <<class 'pkgcore.ebuild.ebuild_src.package'> cpv='x11-themes/qtcurve-0.59.5' @0x7f2169c18a50>)
+caught exception '%s' while processing '%s'(MetadataException('Metadata Exception: pkg ebuild src: x11-themes/qtcurve-0.59.5, attr description\nerror: Metadata Exception: pkg ebuild src: x11-themes/qtcurve-0.59.5, attr data\nerror: False',), <<class 'pkgcore.ebuild.ebuild_src.package'> cpv='x11-themes/qtcurve-0.59.5' @0x7f03170eca50>)
ERROR pkgcore: returned val from gen_metadata was 'False'
-caught exception '%s' while processing '%s'(MetadataException('Metadata Exception: pkg ebuild src: x11-themes/qtcurve-0.65.2, attr description\nerror: Metadata Exception: pkg ebuild src: x11-themes/qtcurve-0.65.2, attr data\nerror: False',), <<class 'pkgcore.ebuild.ebuild_src.package'> cpv='x11-themes/qtcurve-0.65.2' @0x7f2169ba22d0>)
+caught exception '%s' while processing '%s'(MetadataException('Metadata Exception: pkg ebuild src: x11-themes/qtcurve-0.65.2, attr description\nerror: Metadata Exception: pkg ebuild src: x11-themes/qtcurve-0.65.2, attr data\nerror: False',), <<class 'pkgcore.ebuild.ebuild_src.package'> cpv='x11-themes/qtcurve-0.65.2' @0x7f03170762d0>)
ERROR pkgcore: returned val from gen_metadata was 'False'
-caught exception '%s' while processing '%s'(MetadataException('Metadata Exception: pkg ebuild src: x11-themes/qtcurve-0.68.1, attr description\nerror: Metadata Exception: pkg ebuild src: x11-themes/qtcurve-0.68.1, attr data\nerror: False',), <<class 'pkgcore.ebuild.ebuild_src.package'> cpv='x11-themes/qtcurve-0.68.1' @0x7f2169c18a50>)
+caught exception '%s' while processing '%s'(MetadataException('Metadata Exception: pkg ebuild src: x11-themes/qtcurve-0.68.1, attr description\nerror: Metadata Exception: pkg ebuild src: x11-themes/qtcurve-0.68.1, attr data\nerror: False',), <<class 'pkgcore.ebuild.ebuild_src.package'> cpv='x11-themes/qtcurve-0.68.1' @0x7f03170eca50>)
ERROR pkgcore: returned val from gen_metadata was 'False'
-caught exception '%s' while processing '%s'(MetadataException('Metadata Exception: pkg ebuild src: x11-themes/qtcurve-0.69.1, attr description\nerror: Metadata Exception: pkg ebuild src: x11-themes/qtcurve-0.69.1, attr data\nerror: False',), <<class 'pkgcore.ebuild.ebuild_src.package'> cpv='x11-themes/qtcurve-0.69.1' @0x7f2169ba22d0>)
+caught exception '%s' while processing '%s'(MetadataException('Metadata Exception: pkg ebuild src: x11-themes/qtcurve-0.69.1, attr description\nerror: Metadata Exception: pkg ebuild src: x11-themes/qtcurve-0.69.1, attr data\nerror: False',), <<class 'pkgcore.ebuild.ebuild_src.package'> cpv='x11-themes/qtcurve-0.69.1' @0x7f03170762d0>)
ERROR pkgcore: returned val from gen_metadata was 'False'
-caught exception '%s' while processing '%s'(MetadataException('Metadata Exception: pkg ebuild src: net-misc/gwget-1.0.4-r1, attr description\nerror: Metadata Exception: pkg ebuild src: net-misc/gwget-1.0.4-r1, attr data\nerror: False',), <<class 'pkgcore.ebuild.ebuild_src.package'> cpv='net-misc/gwget-1.0.4-r1' @0x7f2169bd0050>)
+caught exception '%s' while processing '%s'(MetadataException('Metadata Exception: pkg ebuild src: net-misc/gwget-1.0.4-r1, attr description\nerror: Metadata Exception: pkg ebuild src: net-misc/gwget-1.0.4-r1, attr data\nerror: False',), <<class 'pkgcore.ebuild.ebuild_src.package'> cpv='net-misc/gwget-1.0.4-r1' @0x7f03170a4050>)
ERROR pkgcore: returned val from gen_metadata was 'False'
-caught exception '%s' while processing '%s'(MetadataException('Metadata Exception: pkg ebuild src: media-video/asdf-0.4, attr description\nerror: Metadata Exception: pkg ebuild src: media-video/asdf-0.4, attr data\nerror: False',), <<class 'pkgcore.ebuild.ebuild_src.package'> cpv='media-video/asdf-0.4' @0x7f2169b5f550>)
+caught exception '%s' while processing '%s'(MetadataException('Metadata Exception: pkg ebuild src: media-video/asdf-0.4, attr description\nerror: Metadata Exception: pkg ebuild src: media-video/asdf-0.4, attr data\nerror: False',), <<class 'pkgcore.ebuild.ebuild_src.package'> cpv='media-video/asdf-0.4' @0x7f0317033550>)
ERROR pkgcore: returned val from gen_metadata was 'False'
-caught exception '%s' while processing '%s'(MetadataException('Metadata Exception: pkg ebuild src: media-video/dpencoder-0.6c, attr description\nerror: Metadata Exception: pkg ebuild src: media-video/dpencoder-0.6c, attr data\nerror: False',), <<class 'pkgcore.ebuild.ebuild_src.package'> cpv='media-video/dpencoder-0.6c' @0x7f2169b5fa50>)
+caught exception '%s' while processing '%s'(MetadataException('Metadata Exception: pkg ebuild src: media-video/dpencoder-0.6c, attr description\nerror: Metadata Exception: pkg ebuild src: media-video/dpencoder-0.6c, attr data\nerror: False',), <<class 'pkgcore.ebuild.ebuild_src.package'> cpv='media-video/dpencoder-0.6c' @0x7f0317033a50>)
ERROR pkgcore: returned val from gen_metadata was 'False'
-caught exception '%s' while processing '%s'(MetadataException('Metadata Exception: pkg ebuild src: kde-base/dcopperl-3.5.10, attr description\nerror: Metadata Exception: pkg ebuild src: kde-base/dcopperl-3.5.10, attr data\nerror: False',), <<class 'pkgcore.ebuild.ebuild_src.package'> cpv='kde-base/dcopperl-3.5.10' @0x7f2169b84e10>)
+caught exception '%s' while processing '%s'(MetadataException('Metadata Exception: pkg ebuild src: kde-base/dcopperl-3.5.10, attr description\nerror: Metadata Exception: pkg ebuild src: kde-base/dcopperl-3.5.10, attr data\nerror: False',), <<class 'pkgcore.ebuild.ebuild_src.package'> cpv='kde-base/dcopperl-3.5.10' @0x7f0317058e10>)
* Cache regen failed with 1
diff --git a/raw.html b/raw.html
index 733d12197612..20f379b059e3 100644
--- a/raw.html
+++ b/raw.html
@@ -120,13 +120,13 @@
</pre></td></tr>
<tr class="" id="l55"><td><a href="#l55"><span>55</span></a></td><td><pre>
</pre></td></tr>
- <tr class="" id="l56"><td><a href="#l56"><span>56</span></a></td><td><pre>sandbox:stop caught signal 15 in pid 10054
+ <tr class="" id="l56"><td><a href="#l56"><span>56</span></a></td><td><pre>sandbox:stop caught signal 15 in pid 20528
</pre></td></tr>
<tr class="" id="l57"><td><a href="#l57"><span>57</span></a></td><td><pre>Sandboxed process killed by signal: Terminated
</pre></td></tr>
<tr class="err" id="l58"><td><a href="#l58"><span>58</span></a></td><td><pre>!!! caught exception inherit requires an unknown eclass, git cannot be found while processing ebuild src: sys-cluster/kerrighed-9999-r1
</pre></td><td>[FATAL]</td></tr>
- <tr class="err" id="l59"><td><a href="#l59"><span>59</span></a></td><td><pre>caught exception '%s' while processing '%s'(MetadataException('Metadata Exception: pkg ebuild src: sys-cluster/kerrighed-9999-r1, attr description\nerror: Metadata Exception: pkg ebuild src: sys-cluster/kerrighed-9999-r1, attr data\nerror: inherit requires an unknown eclass, git cannot be found',), &lt;&lt;class 'pkgcore.ebuild.ebuild_src.package'&gt; cpv='sys-cluster/kerrighed-9999-r1' @0x7fef379df7d0&gt;)
+ <tr class="err" id="l59"><td><a href="#l59"><span>59</span></a></td><td><pre>caught exception '%s' while processing '%s'(MetadataException('Metadata Exception: pkg ebuild src: sys-cluster/kerrighed-9999-r1, attr description\nerror: Metadata Exception: pkg ebuild src: sys-cluster/kerrighed-9999-r1, attr data\nerror: inherit requires an unknown eclass, git cannot be found',), &lt;&lt;class 'pkgcore.ebuild.ebuild_src.package'&gt; cpv='sys-cluster/kerrighed-9999-r1' @0x7f6079e2d7d0&gt;)
</pre></td><td>[FATAL]</td></tr>
<tr class="" id="l60"><td><a href="#l60"><span>60</span></a></td><td><pre> * Cache regen failed with 1
</pre></td></tr>
diff --git a/raw.txt b/raw.txt
index 09bca5c37a00..edcff2b51a98 100644
--- a/raw.txt
+++ b/raw.txt
@@ -53,8 +53,8 @@ Sandboxed process killed by signal: Broken pipe
!!! The die message:
!!! inherit for git failed
-sandbox:stop caught signal 15 in pid 10054
+sandbox:stop caught signal 15 in pid 20528
Sandboxed process killed by signal: Terminated
!!! caught exception inherit requires an unknown eclass, git cannot be found while processing ebuild src: sys-cluster/kerrighed-9999-r1
-caught exception '%s' while processing '%s'(MetadataException('Metadata Exception: pkg ebuild src: sys-cluster/kerrighed-9999-r1, attr description\nerror: Metadata Exception: pkg ebuild src: sys-cluster/kerrighed-9999-r1, attr data\nerror: inherit requires an unknown eclass, git cannot be found',), <<class 'pkgcore.ebuild.ebuild_src.package'> cpv='sys-cluster/kerrighed-9999-r1' @0x7fef379df7d0>)
+caught exception '%s' while processing '%s'(MetadataException('Metadata Exception: pkg ebuild src: sys-cluster/kerrighed-9999-r1, attr description\nerror: Metadata Exception: pkg ebuild src: sys-cluster/kerrighed-9999-r1, attr data\nerror: inherit requires an unknown eclass, git cannot be found',), <<class 'pkgcore.ebuild.ebuild_src.package'> cpv='sys-cluster/kerrighed-9999-r1' @0x7f6079e2d7d0>)
* Cache regen failed with 1
diff --git a/rebel.html b/rebel.html
index 6d2e4b053923..577a18db38bb 100644
--- a/rebel.html
+++ b/rebel.html
@@ -146,7 +146,7 @@
</pre></td><td>[FATAL]</td></tr>
<tr class="" id="l68"><td><a href="#l68"><span>68</span></a></td><td><pre>ERROR pkgcore: returned val from gen_metadata was 'False'
</pre></td></tr>
- <tr class="err" id="l69"><td><a href="#l69"><span>69</span></a></td><td><pre>caught exception '%s' while processing '%s'(MetadataException('Metadata Exception: pkg ebuild src: kde-misc/adjustableclock-9999, attr description\nerror: Metadata Exception: pkg ebuild src: kde-misc/adjustableclock-9999, attr data\nerror: False',), &lt;&lt;class 'pkgcore.ebuild.ebuild_src.package'&gt; cpv='kde-misc/adjustableclock-9999' @0x7f69e70cd190&gt;)
+ <tr class="err" id="l69"><td><a href="#l69"><span>69</span></a></td><td><pre>caught exception '%s' while processing '%s'(MetadataException('Metadata Exception: pkg ebuild src: kde-misc/adjustableclock-9999, attr description\nerror: Metadata Exception: pkg ebuild src: kde-misc/adjustableclock-9999, attr data\nerror: False',), &lt;&lt;class 'pkgcore.ebuild.ebuild_src.package'&gt; cpv='kde-misc/adjustableclock-9999' @0x7f7ff93eb190&gt;)
</pre></td><td>[FATAL]</td></tr>
<tr class="" id="l70"><td><a href="#l70"><span>70</span></a></td><td><pre> * Cache regen failed with 1
</pre></td></tr>
diff --git a/rebel.txt b/rebel.txt
index 635af7dab098..67b7e101312a 100644
--- a/rebel.txt
+++ b/rebel.txt
@@ -66,5 +66,5 @@ WARNING:pkgcore:repository at '/home/mgorny/repos/steveeJ' has unsupported profi
ERROR pkgcore: returned val from gen_metadata was 'False'
!!! caught exception False while processing ebuild src: kde-misc/adjustableclock-9999
ERROR pkgcore: returned val from gen_metadata was 'False'
-caught exception '%s' while processing '%s'(MetadataException('Metadata Exception: pkg ebuild src: kde-misc/adjustableclock-9999, attr description\nerror: Metadata Exception: pkg ebuild src: kde-misc/adjustableclock-9999, attr data\nerror: False',), <<class 'pkgcore.ebuild.ebuild_src.package'> cpv='kde-misc/adjustableclock-9999' @0x7f69e70cd190>)
+caught exception '%s' while processing '%s'(MetadataException('Metadata Exception: pkg ebuild src: kde-misc/adjustableclock-9999, attr description\nerror: Metadata Exception: pkg ebuild src: kde-misc/adjustableclock-9999, attr data\nerror: False',), <<class 'pkgcore.ebuild.ebuild_src.package'> cpv='kde-misc/adjustableclock-9999' @0x7f7ff93eb190>)
* Cache regen failed with 1
diff --git a/sigrok.html b/sigrok.html
index ddc30712e4fa..d2e0f7797d5e 100644
--- a/sigrok.html
+++ b/sigrok.html
@@ -530,27 +530,27 @@
</pre></td><td>[FATAL]</td></tr>
<tr class="" id="l260"><td><a href="#l260"><span>260</span></a></td><td><pre>ERROR pkgcore: returned val from gen_metadata was 'False'
</pre></td></tr>
- <tr class="err" id="l261"><td><a href="#l261"><span>261</span></a></td><td><pre>caught exception '%s' while processing '%s'(MetadataException('Metadata Exception: pkg ebuild src: sci-electronics/pulseview-0.2.0, attr description\nerror: Metadata Exception: pkg ebuild src: sci-electronics/pulseview-0.2.0, attr data\nerror: False',), &lt;&lt;class 'pkgcore.ebuild.ebuild_src.package'&gt; cpv='sci-electronics/pulseview-0.2.0' @0x7fb3723fae10&gt;)
+ <tr class="err" id="l261"><td><a href="#l261"><span>261</span></a></td><td><pre>caught exception '%s' while processing '%s'(MetadataException('Metadata Exception: pkg ebuild src: sci-electronics/pulseview-0.2.0, attr description\nerror: Metadata Exception: pkg ebuild src: sci-electronics/pulseview-0.2.0, attr data\nerror: False',), &lt;&lt;class 'pkgcore.ebuild.ebuild_src.package'&gt; cpv='sci-electronics/pulseview-0.2.0' @0x7fc2eab1de10&gt;)
</pre></td><td>[FATAL]</td></tr>
<tr class="" id="l262"><td><a href="#l262"><span>262</span></a></td><td><pre>ERROR pkgcore: returned val from gen_metadata was 'False'
</pre></td></tr>
- <tr class="err" id="l263"><td><a href="#l263"><span>263</span></a></td><td><pre>caught exception '%s' while processing '%s'(MetadataException('Metadata Exception: pkg ebuild src: sci-electronics/pulseview-0.1.0, attr description\nerror: Metadata Exception: pkg ebuild src: sci-electronics/pulseview-0.1.0, attr data\nerror: False',), &lt;&lt;class 'pkgcore.ebuild.ebuild_src.package'&gt; cpv='sci-electronics/pulseview-0.1.0' @0x7fb371f4b050&gt;)
+ <tr class="err" id="l263"><td><a href="#l263"><span>263</span></a></td><td><pre>caught exception '%s' while processing '%s'(MetadataException('Metadata Exception: pkg ebuild src: sci-electronics/pulseview-0.1.0, attr description\nerror: Metadata Exception: pkg ebuild src: sci-electronics/pulseview-0.1.0, attr data\nerror: False',), &lt;&lt;class 'pkgcore.ebuild.ebuild_src.package'&gt; cpv='sci-electronics/pulseview-0.1.0' @0x7fc2ea66e050&gt;)
</pre></td><td>[FATAL]</td></tr>
<tr class="" id="l264"><td><a href="#l264"><span>264</span></a></td><td><pre>ERROR pkgcore: returned val from gen_metadata was 'False'
</pre></td></tr>
- <tr class="err" id="l265"><td><a href="#l265"><span>265</span></a></td><td><pre>caught exception '%s' while processing '%s'(MetadataException('Metadata Exception: pkg ebuild src: sci-electronics/pulseview-9999, attr description\nerror: Metadata Exception: pkg ebuild src: sci-electronics/pulseview-9999, attr data\nerror: False',), &lt;&lt;class 'pkgcore.ebuild.ebuild_src.package'&gt; cpv='sci-electronics/pulseview-9999' @0x7fb3723fae10&gt;)
+ <tr class="err" id="l265"><td><a href="#l265"><span>265</span></a></td><td><pre>caught exception '%s' while processing '%s'(MetadataException('Metadata Exception: pkg ebuild src: sci-electronics/pulseview-9999, attr description\nerror: Metadata Exception: pkg ebuild src: sci-electronics/pulseview-9999, attr data\nerror: False',), &lt;&lt;class 'pkgcore.ebuild.ebuild_src.package'&gt; cpv='sci-electronics/pulseview-9999' @0x7fc2eab1de10&gt;)
</pre></td><td>[FATAL]</td></tr>
<tr class="" id="l266"><td><a href="#l266"><span>266</span></a></td><td><pre>ERROR pkgcore: returned val from gen_metadata was 'False'
</pre></td></tr>
- <tr class="err" id="l267"><td><a href="#l267"><span>267</span></a></td><td><pre>caught exception '%s' while processing '%s'(MetadataException('Metadata Exception: pkg ebuild src: sci-electronics/sigrok-cli-0.5.0, attr description\nerror: Metadata Exception: pkg ebuild src: sci-electronics/sigrok-cli-0.5.0, attr data\nerror: False',), &lt;&lt;class 'pkgcore.ebuild.ebuild_src.package'&gt; cpv='sci-electronics/sigrok-cli-0.5.0' @0x7fb371f4b050&gt;)
+ <tr class="err" id="l267"><td><a href="#l267"><span>267</span></a></td><td><pre>caught exception '%s' while processing '%s'(MetadataException('Metadata Exception: pkg ebuild src: sci-electronics/sigrok-cli-0.5.0, attr description\nerror: Metadata Exception: pkg ebuild src: sci-electronics/sigrok-cli-0.5.0, attr data\nerror: False',), &lt;&lt;class 'pkgcore.ebuild.ebuild_src.package'&gt; cpv='sci-electronics/sigrok-cli-0.5.0' @0x7fc2ea66e050&gt;)
</pre></td><td>[FATAL]</td></tr>
<tr class="" id="l268"><td><a href="#l268"><span>268</span></a></td><td><pre>ERROR pkgcore: returned val from gen_metadata was 'False'
</pre></td></tr>
- <tr class="err" id="l269"><td><a href="#l269"><span>269</span></a></td><td><pre>caught exception '%s' while processing '%s'(MetadataException('Metadata Exception: pkg ebuild src: sci-electronics/sigrok-cli-0.4.0, attr description\nerror: Metadata Exception: pkg ebuild src: sci-electronics/sigrok-cli-0.4.0, attr data\nerror: False',), &lt;&lt;class 'pkgcore.ebuild.ebuild_src.package'&gt; cpv='sci-electronics/sigrok-cli-0.4.0' @0x7fb3723fae10&gt;)
+ <tr class="err" id="l269"><td><a href="#l269"><span>269</span></a></td><td><pre>caught exception '%s' while processing '%s'(MetadataException('Metadata Exception: pkg ebuild src: sci-electronics/sigrok-cli-0.4.0, attr description\nerror: Metadata Exception: pkg ebuild src: sci-electronics/sigrok-cli-0.4.0, attr data\nerror: False',), &lt;&lt;class 'pkgcore.ebuild.ebuild_src.package'&gt; cpv='sci-electronics/sigrok-cli-0.4.0' @0x7fc2eab1de10&gt;)
</pre></td><td>[FATAL]</td></tr>
<tr class="" id="l270"><td><a href="#l270"><span>270</span></a></td><td><pre>ERROR pkgcore: returned val from gen_metadata was 'False'
</pre></td></tr>
- <tr class="err" id="l271"><td><a href="#l271"><span>271</span></a></td><td><pre>caught exception '%s' while processing '%s'(MetadataException('Metadata Exception: pkg ebuild src: sci-electronics/sigrok-cli-9999, attr description\nerror: Metadata Exception: pkg ebuild src: sci-electronics/sigrok-cli-9999, attr data\nerror: False',), &lt;&lt;class 'pkgcore.ebuild.ebuild_src.package'&gt; cpv='sci-electronics/sigrok-cli-9999' @0x7fb371f4b050&gt;)
+ <tr class="err" id="l271"><td><a href="#l271"><span>271</span></a></td><td><pre>caught exception '%s' while processing '%s'(MetadataException('Metadata Exception: pkg ebuild src: sci-electronics/sigrok-cli-9999, attr description\nerror: Metadata Exception: pkg ebuild src: sci-electronics/sigrok-cli-9999, attr data\nerror: False',), &lt;&lt;class 'pkgcore.ebuild.ebuild_src.package'&gt; cpv='sci-electronics/sigrok-cli-9999' @0x7fc2ea66e050&gt;)
</pre></td><td>[FATAL]</td></tr>
<tr class="" id="l272"><td><a href="#l272"><span>272</span></a></td><td><pre> * Cache regen failed with 1
</pre></td></tr>
diff --git a/sigrok.txt b/sigrok.txt
index ff20fe595241..12b4074d3026 100644
--- a/sigrok.txt
+++ b/sigrok.txt
@@ -258,15 +258,15 @@ ERROR pkgcore: returned val from gen_metadata was 'False'
ERROR pkgcore: returned val from gen_metadata was 'False'
!!! caught exception False while processing ebuild src: sci-electronics/sigrok-cli-9999
ERROR pkgcore: returned val from gen_metadata was 'False'
-caught exception '%s' while processing '%s'(MetadataException('Metadata Exception: pkg ebuild src: sci-electronics/pulseview-0.2.0, attr description\nerror: Metadata Exception: pkg ebuild src: sci-electronics/pulseview-0.2.0, attr data\nerror: False',), <<class 'pkgcore.ebuild.ebuild_src.package'> cpv='sci-electronics/pulseview-0.2.0' @0x7fb3723fae10>)
+caught exception '%s' while processing '%s'(MetadataException('Metadata Exception: pkg ebuild src: sci-electronics/pulseview-0.2.0, attr description\nerror: Metadata Exception: pkg ebuild src: sci-electronics/pulseview-0.2.0, attr data\nerror: False',), <<class 'pkgcore.ebuild.ebuild_src.package'> cpv='sci-electronics/pulseview-0.2.0' @0x7fc2eab1de10>)
ERROR pkgcore: returned val from gen_metadata was 'False'
-caught exception '%s' while processing '%s'(MetadataException('Metadata Exception: pkg ebuild src: sci-electronics/pulseview-0.1.0, attr description\nerror: Metadata Exception: pkg ebuild src: sci-electronics/pulseview-0.1.0, attr data\nerror: False',), <<class 'pkgcore.ebuild.ebuild_src.package'> cpv='sci-electronics/pulseview-0.1.0' @0x7fb371f4b050>)
+caught exception '%s' while processing '%s'(MetadataException('Metadata Exception: pkg ebuild src: sci-electronics/pulseview-0.1.0, attr description\nerror: Metadata Exception: pkg ebuild src: sci-electronics/pulseview-0.1.0, attr data\nerror: False',), <<class 'pkgcore.ebuild.ebuild_src.package'> cpv='sci-electronics/pulseview-0.1.0' @0x7fc2ea66e050>)
ERROR pkgcore: returned val from gen_metadata was 'False'
-caught exception '%s' while processing '%s'(MetadataException('Metadata Exception: pkg ebuild src: sci-electronics/pulseview-9999, attr description\nerror: Metadata Exception: pkg ebuild src: sci-electronics/pulseview-9999, attr data\nerror: False',), <<class 'pkgcore.ebuild.ebuild_src.package'> cpv='sci-electronics/pulseview-9999' @0x7fb3723fae10>)
+caught exception '%s' while processing '%s'(MetadataException('Metadata Exception: pkg ebuild src: sci-electronics/pulseview-9999, attr description\nerror: Metadata Exception: pkg ebuild src: sci-electronics/pulseview-9999, attr data\nerror: False',), <<class 'pkgcore.ebuild.ebuild_src.package'> cpv='sci-electronics/pulseview-9999' @0x7fc2eab1de10>)
ERROR pkgcore: returned val from gen_metadata was 'False'
-caught exception '%s' while processing '%s'(MetadataException('Metadata Exception: pkg ebuild src: sci-electronics/sigrok-cli-0.5.0, attr description\nerror: Metadata Exception: pkg ebuild src: sci-electronics/sigrok-cli-0.5.0, attr data\nerror: False',), <<class 'pkgcore.ebuild.ebuild_src.package'> cpv='sci-electronics/sigrok-cli-0.5.0' @0x7fb371f4b050>)
+caught exception '%s' while processing '%s'(MetadataException('Metadata Exception: pkg ebuild src: sci-electronics/sigrok-cli-0.5.0, attr description\nerror: Metadata Exception: pkg ebuild src: sci-electronics/sigrok-cli-0.5.0, attr data\nerror: False',), <<class 'pkgcore.ebuild.ebuild_src.package'> cpv='sci-electronics/sigrok-cli-0.5.0' @0x7fc2ea66e050>)
ERROR pkgcore: returned val from gen_metadata was 'False'
-caught exception '%s' while processing '%s'(MetadataException('Metadata Exception: pkg ebuild src: sci-electronics/sigrok-cli-0.4.0, attr description\nerror: Metadata Exception: pkg ebuild src: sci-electronics/sigrok-cli-0.4.0, attr data\nerror: False',), <<class 'pkgcore.ebuild.ebuild_src.package'> cpv='sci-electronics/sigrok-cli-0.4.0' @0x7fb3723fae10>)
+caught exception '%s' while processing '%s'(MetadataException('Metadata Exception: pkg ebuild src: sci-electronics/sigrok-cli-0.4.0, attr description\nerror: Metadata Exception: pkg ebuild src: sci-electronics/sigrok-cli-0.4.0, attr data\nerror: False',), <<class 'pkgcore.ebuild.ebuild_src.package'> cpv='sci-electronics/sigrok-cli-0.4.0' @0x7fc2eab1de10>)
ERROR pkgcore: returned val from gen_metadata was 'False'
-caught exception '%s' while processing '%s'(MetadataException('Metadata Exception: pkg ebuild src: sci-electronics/sigrok-cli-9999, attr description\nerror: Metadata Exception: pkg ebuild src: sci-electronics/sigrok-cli-9999, attr data\nerror: False',), <<class 'pkgcore.ebuild.ebuild_src.package'> cpv='sci-electronics/sigrok-cli-9999' @0x7fb371f4b050>)
+caught exception '%s' while processing '%s'(MetadataException('Metadata Exception: pkg ebuild src: sci-electronics/sigrok-cli-9999, attr description\nerror: Metadata Exception: pkg ebuild src: sci-electronics/sigrok-cli-9999, attr data\nerror: False',), <<class 'pkgcore.ebuild.ebuild_src.package'> cpv='sci-electronics/sigrok-cli-9999' @0x7fc2ea66e050>)
* Cache regen failed with 1
diff --git a/sunrise.html b/sunrise.html
index 2d40701517af..62d2d8490ea7 100644
--- a/sunrise.html
+++ b/sunrise.html
@@ -216,11 +216,11 @@
</pre></td><td>[FATAL]</td></tr>
<tr class="" id="l103"><td><a href="#l103"><span>103</span></a></td><td><pre>ERROR pkgcore: returned val from gen_metadata was 'False'
</pre></td></tr>
- <tr class="err" id="l104"><td><a href="#l104"><span>104</span></a></td><td><pre>caught exception '%s' while processing '%s'(MetadataException('Metadata Exception: pkg ebuild src: games-rpg/lipsofsuna-0.5.0, attr description\nerror: Metadata Exception: pkg ebuild src: games-rpg/lipsofsuna-0.5.0, attr data\nerror: False',), &lt;&lt;class 'pkgcore.ebuild.ebuild_src.package'&gt; cpv='games-rpg/lipsofsuna-0.5.0' @0x7f190da1f410&gt;)
+ <tr class="err" id="l104"><td><a href="#l104"><span>104</span></a></td><td><pre>caught exception '%s' while processing '%s'(MetadataException('Metadata Exception: pkg ebuild src: games-rpg/lipsofsuna-0.5.0, attr description\nerror: Metadata Exception: pkg ebuild src: games-rpg/lipsofsuna-0.5.0, attr data\nerror: False',), &lt;&lt;class 'pkgcore.ebuild.ebuild_src.package'&gt; cpv='games-rpg/lipsofsuna-0.5.0' @0x7f7109cfe410&gt;)
</pre></td><td>[FATAL]</td></tr>
<tr class="" id="l105"><td><a href="#l105"><span>105</span></a></td><td><pre>ERROR pkgcore: returned val from gen_metadata was 'False'
</pre></td></tr>
- <tr class="err" id="l106"><td><a href="#l106"><span>106</span></a></td><td><pre>caught exception '%s' while processing '%s'(MetadataException('Metadata Exception: pkg ebuild src: games-rpg/lipsofsuna-9999, attr description\nerror: Metadata Exception: pkg ebuild src: games-rpg/lipsofsuna-9999, attr data\nerror: False',), &lt;&lt;class 'pkgcore.ebuild.ebuild_src.package'&gt; cpv='games-rpg/lipsofsuna-9999' @0x7f190da1f550&gt;)
+ <tr class="err" id="l106"><td><a href="#l106"><span>106</span></a></td><td><pre>caught exception '%s' while processing '%s'(MetadataException('Metadata Exception: pkg ebuild src: games-rpg/lipsofsuna-9999, attr description\nerror: Metadata Exception: pkg ebuild src: games-rpg/lipsofsuna-9999, attr data\nerror: False',), &lt;&lt;class 'pkgcore.ebuild.ebuild_src.package'&gt; cpv='games-rpg/lipsofsuna-9999' @0x7f7109cfe550&gt;)
</pre></td><td>[FATAL]</td></tr>
<tr class="" id="l107"><td><a href="#l107"><span>107</span></a></td><td><pre> * Cache regen failed with 1
</pre></td></tr>
diff --git a/sunrise.txt b/sunrise.txt
index 98fe420fc0a6..e614b56ae237 100644
--- a/sunrise.txt
+++ b/sunrise.txt
@@ -101,7 +101,7 @@ ERROR pkgcore: returned val from gen_metadata was 'False'
ERROR pkgcore: returned val from gen_metadata was 'False'
!!! caught exception False while processing ebuild src: games-rpg/lipsofsuna-9999
ERROR pkgcore: returned val from gen_metadata was 'False'
-caught exception '%s' while processing '%s'(MetadataException('Metadata Exception: pkg ebuild src: games-rpg/lipsofsuna-0.5.0, attr description\nerror: Metadata Exception: pkg ebuild src: games-rpg/lipsofsuna-0.5.0, attr data\nerror: False',), <<class 'pkgcore.ebuild.ebuild_src.package'> cpv='games-rpg/lipsofsuna-0.5.0' @0x7f190da1f410>)
+caught exception '%s' while processing '%s'(MetadataException('Metadata Exception: pkg ebuild src: games-rpg/lipsofsuna-0.5.0, attr description\nerror: Metadata Exception: pkg ebuild src: games-rpg/lipsofsuna-0.5.0, attr data\nerror: False',), <<class 'pkgcore.ebuild.ebuild_src.package'> cpv='games-rpg/lipsofsuna-0.5.0' @0x7f7109cfe410>)
ERROR pkgcore: returned val from gen_metadata was 'False'
-caught exception '%s' while processing '%s'(MetadataException('Metadata Exception: pkg ebuild src: games-rpg/lipsofsuna-9999, attr description\nerror: Metadata Exception: pkg ebuild src: games-rpg/lipsofsuna-9999, attr data\nerror: False',), <<class 'pkgcore.ebuild.ebuild_src.package'> cpv='games-rpg/lipsofsuna-9999' @0x7f190da1f550>)
+caught exception '%s' while processing '%s'(MetadataException('Metadata Exception: pkg ebuild src: games-rpg/lipsofsuna-9999, attr description\nerror: Metadata Exception: pkg ebuild src: games-rpg/lipsofsuna-9999, attr data\nerror: False',), <<class 'pkgcore.ebuild.ebuild_src.package'> cpv='games-rpg/lipsofsuna-9999' @0x7f7109cfe550>)
* Cache regen failed with 1
diff --git a/swegener.html b/swegener.html
index 0c37a27d2639..19db11521d0e 100644
--- a/swegener.html
+++ b/swegener.html
@@ -92,7 +92,7 @@
</pre></td></tr>
<tr class="" id="l41"><td><a href="#l41"><span>41</span></a></td><td><pre>
</pre></td></tr>
- <tr class="" id="l42"><td><a href="#l42"><span>42</span></a></td><td><pre>sent 239 bytes received 26.13K bytes 10.55K bytes/sec
+ <tr class="" id="l42"><td><a href="#l42"><span>42</span></a></td><td><pre>sent 239 bytes received 26.13K bytes 17.58K bytes/sec
</pre></td></tr>
<tr class="" id="l43"><td><a href="#l43"><span>43</span></a></td><td><pre>total size is 1.23M speedup is 46.75
</pre></td></tr>
@@ -206,7 +206,7 @@
</pre></td><td>[FATAL]</td></tr>
<tr class="" id="l98"><td><a href="#l98"><span>98</span></a></td><td><pre>ERROR pkgcore: returned val from gen_metadata was 'False'
</pre></td></tr>
- <tr class="err" id="l99"><td><a href="#l99"><span>99</span></a></td><td><pre>caught exception '%s' while processing '%s'(MetadataException('Metadata Exception: pkg ebuild src: gnome-extra/brightside-1.4.0, attr description\nerror: Metadata Exception: pkg ebuild src: gnome-extra/brightside-1.4.0, attr data\nerror: False',), &lt;&lt;class 'pkgcore.ebuild.ebuild_src.package'&gt; cpv='gnome-extra/brightside-1.4.0' @0x7fd38d426a50&gt;)
+ <tr class="err" id="l99"><td><a href="#l99"><span>99</span></a></td><td><pre>caught exception '%s' while processing '%s'(MetadataException('Metadata Exception: pkg ebuild src: gnome-extra/brightside-1.4.0, attr description\nerror: Metadata Exception: pkg ebuild src: gnome-extra/brightside-1.4.0, attr data\nerror: False',), &lt;&lt;class 'pkgcore.ebuild.ebuild_src.package'&gt; cpv='gnome-extra/brightside-1.4.0' @0x7f54d59e2a50&gt;)
</pre></td><td>[FATAL]</td></tr>
<tr class="" id="l100"><td><a href="#l100"><span>100</span></a></td><td><pre> * Cache regen failed with 1
</pre></td></tr>
diff --git a/swegener.txt b/swegener.txt
index a624409b598a..fc1da608e4b1 100644
--- a/swegener.txt
+++ b/swegener.txt
@@ -39,7 +39,7 @@ File list transfer time: 0.000 seconds
Total bytes sent: 239
Total bytes received: 26.13K
-sent 239 bytes received 26.13K bytes 10.55K bytes/sec
+sent 239 bytes received 26.13K bytes 17.58K bytes/sec
total size is 1.23M speedup is 46.75
*** syncing swegener
*** synced swegener
@@ -96,5 +96,5 @@ WARNING:pkgcore:repository at '/home/mgorny/repos/steveeJ' has unsupported profi
ERROR pkgcore: returned val from gen_metadata was 'False'
!!! caught exception False while processing ebuild src: gnome-extra/brightside-1.4.0
ERROR pkgcore: returned val from gen_metadata was 'False'
-caught exception '%s' while processing '%s'(MetadataException('Metadata Exception: pkg ebuild src: gnome-extra/brightside-1.4.0, attr description\nerror: Metadata Exception: pkg ebuild src: gnome-extra/brightside-1.4.0, attr data\nerror: False',), <<class 'pkgcore.ebuild.ebuild_src.package'> cpv='gnome-extra/brightside-1.4.0' @0x7fd38d426a50>)
+caught exception '%s' while processing '%s'(MetadataException('Metadata Exception: pkg ebuild src: gnome-extra/brightside-1.4.0, attr description\nerror: Metadata Exception: pkg ebuild src: gnome-extra/brightside-1.4.0, attr data\nerror: False',), <<class 'pkgcore.ebuild.ebuild_src.package'> cpv='gnome-extra/brightside-1.4.0' @0x7f54d59e2a50>)
* Cache regen failed with 1
diff --git a/triquetra.html b/triquetra.html
index bd28e68a2988..de48456aaf73 100644
--- a/triquetra.html
+++ b/triquetra.html
@@ -172,7 +172,7 @@
</pre></td><td>[FATAL]</td></tr>
<tr class="" id="l81"><td><a href="#l81"><span>81</span></a></td><td><pre>ERROR pkgcore: returned val from gen_metadata was 'False'
</pre></td></tr>
- <tr class="err" id="l82"><td><a href="#l82"><span>82</span></a></td><td><pre>caught exception '%s' while processing '%s'(MetadataException('Metadata Exception: pkg ebuild src: media-gfx/gscan2pdf-1.0.4, attr description\nerror: Metadata Exception: pkg ebuild src: media-gfx/gscan2pdf-1.0.4, attr data\nerror: False',), &lt;&lt;class 'pkgcore.ebuild.ebuild_src.package'&gt; cpv='media-gfx/gscan2pdf-1.0.4' @0x7f068798b410&gt;)
+ <tr class="err" id="l82"><td><a href="#l82"><span>82</span></a></td><td><pre>caught exception '%s' while processing '%s'(MetadataException('Metadata Exception: pkg ebuild src: media-gfx/gscan2pdf-1.0.4, attr description\nerror: Metadata Exception: pkg ebuild src: media-gfx/gscan2pdf-1.0.4, attr data\nerror: False',), &lt;&lt;class 'pkgcore.ebuild.ebuild_src.package'&gt; cpv='media-gfx/gscan2pdf-1.0.4' @0x7fe788e8b410&gt;)
</pre></td><td>[FATAL]</td></tr>
<tr class="" id="l83"><td><a href="#l83"><span>83</span></a></td><td><pre> * Cache regen failed with 1
</pre></td></tr>
diff --git a/triquetra.txt b/triquetra.txt
index 9668c0d0292e..02a99c5ee334 100644
--- a/triquetra.txt
+++ b/triquetra.txt
@@ -79,5 +79,5 @@ WARNING:pkgcore:repository at '/home/mgorny/repos/steveeJ' has unsupported profi
ERROR pkgcore: returned val from gen_metadata was 'False'
!!! caught exception False while processing ebuild src: media-gfx/gscan2pdf-1.0.4
ERROR pkgcore: returned val from gen_metadata was 'False'
-caught exception '%s' while processing '%s'(MetadataException('Metadata Exception: pkg ebuild src: media-gfx/gscan2pdf-1.0.4, attr description\nerror: Metadata Exception: pkg ebuild src: media-gfx/gscan2pdf-1.0.4, attr data\nerror: False',), <<class 'pkgcore.ebuild.ebuild_src.package'> cpv='media-gfx/gscan2pdf-1.0.4' @0x7f068798b410>)
+caught exception '%s' while processing '%s'(MetadataException('Metadata Exception: pkg ebuild src: media-gfx/gscan2pdf-1.0.4, attr description\nerror: Metadata Exception: pkg ebuild src: media-gfx/gscan2pdf-1.0.4, attr data\nerror: False',), <<class 'pkgcore.ebuild.ebuild_src.package'> cpv='media-gfx/gscan2pdf-1.0.4' @0x7fe788e8b410>)
* Cache regen failed with 1
diff --git a/underlay.html b/underlay.html
index 0575fbca1300..497183d96873 100644
--- a/underlay.html
+++ b/underlay.html
@@ -138,73 +138,71 @@
</pre></td></tr>
<tr class="err" id="l64"><td><a href="#l64"><span>64</span></a></td><td><pre>!!! caught exception False while processing ebuild src: media-tv/linuxtv-dvb-firmware-2009.07.06-r1
</pre></td><td>[FATAL]</td></tr>
- <tr class="err" id="l65"><td><a href="#l65"><span>65</span></a></td><td><pre>!!! caught exception ("Expected command; instead got nothing from ''", None) while processing ebuild src: media-tv/linuxtv-dvb-firmware-2009.09.19-r2
-</pre></td><td>[FATAL]</td></tr>
- <tr class="" id="l66"><td><a href="#l66"><span>66</span></a></td><td><pre>Traceback (most recent call last):
+ <tr class="" id="l65"><td><a href="#l65"><span>65</span></a></td><td><pre>Traceback (most recent call last):
</pre></td></tr>
- <tr class="" id="l67"><td><a href="#l67"><span>67</span></a></td><td><pre> File "/home/mgorny/pkgcore-venv/bin/pmaint", line 4, in &lt;module&gt;
+ <tr class="" id="l66"><td><a href="#l66"><span>66</span></a></td><td><pre> File "/home/mgorny/pkgcore-venv/bin/pmaint", line 4, in &lt;module&gt;
</pre></td></tr>
- <tr class="" id="l68"><td><a href="#l68"><span>68</span></a></td><td><pre> scripts.main(basename(__file__))
+ <tr class="" id="l67"><td><a href="#l67"><span>67</span></a></td><td><pre> scripts.main(basename(__file__))
</pre></td></tr>
- <tr class="" id="l69"><td><a href="#l69"><span>69</span></a></td><td><pre> File "/home/mgorny/pkgcore-venv/lib/python2.7/site-packages/pkgcore/scripts/__init__.py", line 40, in main
+ <tr class="" id="l68"><td><a href="#l68"><span>68</span></a></td><td><pre> File "/home/mgorny/pkgcore-venv/lib/python2.7/site-packages/pkgcore/scripts/__init__.py", line 40, in main
</pre></td></tr>
- <tr class="" id="l70"><td><a href="#l70"><span>70</span></a></td><td><pre> commandline.main(subcommands)
+ <tr class="" id="l69"><td><a href="#l69"><span>69</span></a></td><td><pre> commandline.main(subcommands)
</pre></td></tr>
- <tr class="" id="l71"><td><a href="#l71"><span>71</span></a></td><td><pre> File "/home/mgorny/pkgcore-venv/lib/python2.7/site-packages/pkgcore/util/commandline.py", line 928, in main
+ <tr class="" id="l70"><td><a href="#l70"><span>70</span></a></td><td><pre> File "/home/mgorny/pkgcore-venv/lib/python2.7/site-packages/pkgcore/util/commandline.py", line 928, in main
</pre></td></tr>
- <tr class="" id="l72"><td><a href="#l72"><span>72</span></a></td><td><pre> exitstatus = main_func(options, out, err)
+ <tr class="" id="l71"><td><a href="#l71"><span>71</span></a></td><td><pre> exitstatus = main_func(options, out, err)
</pre></td></tr>
- <tr class="" id="l73"><td><a href="#l73"><span>73</span></a></td><td><pre> File "/home/mgorny/pkgcore-venv/lib/python2.7/site-packages/pkgcore/scripts/pmaint.py", line 283, in regen_main
+ <tr class="" id="l72"><td><a href="#l72"><span>72</span></a></td><td><pre> File "/home/mgorny/pkgcore-venv/lib/python2.7/site-packages/pkgcore/scripts/pmaint.py", line 283, in regen_main
</pre></td></tr>
- <tr class="" id="l74"><td><a href="#l74"><span>74</span></a></td><td><pre> eclass_caching=(not options.disable_eclass_caching))
+ <tr class="" id="l73"><td><a href="#l73"><span>73</span></a></td><td><pre> eclass_caching=(not options.disable_eclass_caching))
</pre></td></tr>
- <tr class="" id="l75"><td><a href="#l75"><span>75</span></a></td><td><pre> File "/home/mgorny/pkgcore-venv/lib/python2.7/site-packages/pkgcore/operations/__init__.py", line 68, in _recast_exception_decorator
+ <tr class="" id="l74"><td><a href="#l74"><span>74</span></a></td><td><pre> File "/home/mgorny/pkgcore-venv/lib/python2.7/site-packages/pkgcore/operations/__init__.py", line 68, in _recast_exception_decorator
</pre></td></tr>
- <tr class="" id="l76"><td><a href="#l76"><span>76</span></a></td><td><pre> return functor(*args, **kwds)
+ <tr class="" id="l75"><td><a href="#l75"><span>75</span></a></td><td><pre> return functor(*args, **kwds)
</pre></td></tr>
- <tr class="" id="l77"><td><a href="#l77"><span>77</span></a></td><td><pre> File "/home/mgorny/pkgcore-venv/lib/python2.7/site-packages/pkgcore/operations/repo.py", line 247, in _cmd_api_regen_cache
+ <tr class="" id="l76"><td><a href="#l76"><span>76</span></a></td><td><pre> File "/home/mgorny/pkgcore-venv/lib/python2.7/site-packages/pkgcore/operations/repo.py", line 247, in _cmd_api_regen_cache
</pre></td></tr>
- <tr class="" id="l78"><td><a href="#l78"><span>78</span></a></td><td><pre> self._get_observer(observer), threads=threads, **options)
+ <tr class="" id="l77"><td><a href="#l77"><span>77</span></a></td><td><pre> self._get_observer(observer), threads=threads, **options)
</pre></td></tr>
- <tr class="" id="l79"><td><a href="#l79"><span>79</span></a></td><td><pre> File "/home/mgorny/pkgcore-venv/lib/python2.7/site-packages/pkgcore/operations/regen.py", line 37, in regen_repository
+ <tr class="" id="l78"><td><a href="#l78"><span>78</span></a></td><td><pre> File "/home/mgorny/pkgcore-venv/lib/python2.7/site-packages/pkgcore/operations/regen.py", line 37, in regen_repository
</pre></td></tr>
- <tr class="" id="l80"><td><a href="#l80"><span>80</span></a></td><td><pre> regen_iter(iter(repo), _get_repo_helper(), observer)
+ <tr class="" id="l79"><td><a href="#l79"><span>79</span></a></td><td><pre> regen_iter(iter(repo), _get_repo_helper(), observer)
</pre></td></tr>
- <tr class="" id="l81"><td><a href="#l81"><span>81</span></a></td><td><pre> File "/home/mgorny/pkgcore-venv/lib/python2.7/site-packages/pkgcore/operations/regen.py", line 15, in regen_iter
+ <tr class="" id="l80"><td><a href="#l80"><span>80</span></a></td><td><pre> File "/home/mgorny/pkgcore-venv/lib/python2.7/site-packages/pkgcore/operations/regen.py", line 15, in regen_iter
</pre></td></tr>
- <tr class="" id="l82"><td><a href="#l82"><span>82</span></a></td><td><pre> regen_func(x)
+ <tr class="" id="l81"><td><a href="#l81"><span>81</span></a></td><td><pre> regen_func(x)
</pre></td></tr>
- <tr class="" id="l83"><td><a href="#l83"><span>83</span></a></td><td><pre> File "/home/mgorny/pkgcore-venv/lib/python2.7/site-packages/pkgcore/ebuild/repository.py", line 521, in __call__
+ <tr class="" id="l82"><td><a href="#l82"><span>82</span></a></td><td><pre> File "/home/mgorny/pkgcore-venv/lib/python2.7/site-packages/pkgcore/ebuild/repository.py", line 521, in __call__
</pre></td></tr>
- <tr class="" id="l84"><td><a href="#l84"><span>84</span></a></td><td><pre> return pkg._fetch_metadata(ebp=self.ebp, force_regen=self.force)
+ <tr class="" id="l83"><td><a href="#l83"><span>83</span></a></td><td><pre> return pkg._fetch_metadata(ebp=self.ebp, force_regen=self.force)
</pre></td></tr>
- <tr class="" id="l85"><td><a href="#l85"><span>85</span></a></td><td><pre> File "/home/mgorny/pkgcore-venv/lib/python2.7/site-packages/pkgcore/ebuild/ebuild_src.py", line 272, in _fetch_metadata
+ <tr class="" id="l84"><td><a href="#l84"><span>84</span></a></td><td><pre> File "/home/mgorny/pkgcore-venv/lib/python2.7/site-packages/pkgcore/ebuild/ebuild_src.py", line 272, in _fetch_metadata
</pre></td></tr>
- <tr class="" id="l86"><td><a href="#l86"><span>86</span></a></td><td><pre> return self._parent._get_metadata(self, ebp=ebp, force_regen=force_regen)
+ <tr class="" id="l85"><td><a href="#l85"><span>85</span></a></td><td><pre> return self._parent._get_metadata(self, ebp=ebp, force_regen=force_regen)
</pre></td></tr>
- <tr class="" id="l87"><td><a href="#l87"><span>87</span></a></td><td><pre> File "/home/mgorny/pkgcore-venv/lib/python2.7/site-packages/pkgcore/ebuild/ebuild_src.py", line 363, in _get_metadata
+ <tr class="" id="l86"><td><a href="#l86"><span>86</span></a></td><td><pre> File "/home/mgorny/pkgcore-venv/lib/python2.7/site-packages/pkgcore/ebuild/ebuild_src.py", line 363, in _get_metadata
</pre></td></tr>
- <tr class="" id="l88"><td><a href="#l88"><span>88</span></a></td><td><pre> return self._update_metadata(pkg, ebp=ebp)
+ <tr class="" id="l87"><td><a href="#l87"><span>87</span></a></td><td><pre> return self._update_metadata(pkg, ebp=ebp)
</pre></td></tr>
- <tr class="" id="l89"><td><a href="#l89"><span>89</span></a></td><td><pre> File "/home/mgorny/pkgcore-venv/lib/python2.7/site-packages/pkgcore/ebuild/ebuild_src.py", line 371, in _update_metadata
+ <tr class="" id="l88"><td><a href="#l88"><span>88</span></a></td><td><pre> File "/home/mgorny/pkgcore-venv/lib/python2.7/site-packages/pkgcore/ebuild/ebuild_src.py", line 371, in _update_metadata
</pre></td></tr>
- <tr class="" id="l90"><td><a href="#l90"><span>90</span></a></td><td><pre> mydata = my_proc.get_keys(pkg, self._ecache)
+ <tr class="" id="l89"><td><a href="#l89"><span>89</span></a></td><td><pre> mydata = my_proc.get_keys(pkg, self._ecache)
</pre></td></tr>
- <tr class="" id="l91"><td><a href="#l91"><span>91</span></a></td><td><pre> File "/home/mgorny/pkgcore-venv/lib/python2.7/site-packages/pkgcore/ebuild/processor.py", line 826, in get_keys
+ <tr class="" id="l90"><td><a href="#l90"><span>90</span></a></td><td><pre> File "/home/mgorny/pkgcore-venv/lib/python2.7/site-packages/pkgcore/ebuild/processor.py", line 826, in get_keys
</pre></td></tr>
- <tr class="" id="l92"><td><a href="#l92"><span>92</span></a></td><td><pre> {"key": receive_key})
+ <tr class="" id="l91"><td><a href="#l91"><span>91</span></a></td><td><pre> {"key": receive_key})
</pre></td></tr>
- <tr class="" id="l93"><td><a href="#l93"><span>93</span></a></td><td><pre> File "/home/mgorny/pkgcore-venv/lib/python2.7/site-packages/pkgcore/ebuild/processor.py", line 759, in _run_depend_like_phase
+ <tr class="" id="l92"><td><a href="#l92"><span>92</span></a></td><td><pre> File "/home/mgorny/pkgcore-venv/lib/python2.7/site-packages/pkgcore/ebuild/processor.py", line 759, in _run_depend_like_phase
</pre></td></tr>
- <tr class="" id="l94"><td><a href="#l94"><span>94</span></a></td><td><pre> self.write("%s %i\n%s" % (command, len(data), data), append_newline=False)
+ <tr class="" id="l93"><td><a href="#l93"><span>93</span></a></td><td><pre> self.write("%s %i\n%s" % (command, len(data), data), append_newline=False)
</pre></td></tr>
- <tr class="" id="l95"><td><a href="#l95"><span>95</span></a></td><td><pre> File "/home/mgorny/pkgcore-venv/lib/python2.7/site-packages/pkgcore/ebuild/processor.py", line 457, in write
+ <tr class="" id="l94"><td><a href="#l94"><span>94</span></a></td><td><pre> File "/home/mgorny/pkgcore-venv/lib/python2.7/site-packages/pkgcore/ebuild/processor.py", line 457, in write
</pre></td></tr>
- <tr class="" id="l96"><td><a href="#l96"><span>96</span></a></td><td><pre> raise RuntimeError(ie)
+ <tr class="" id="l95"><td><a href="#l95"><span>95</span></a></td><td><pre> raise RuntimeError(ie)
</pre></td></tr>
- <tr class="" id="l97"><td><a href="#l97"><span>97</span></a></td><td><pre>RuntimeError: [Errno 32] Broken pipe
+ <tr class="" id="l96"><td><a href="#l96"><span>96</span></a></td><td><pre>RuntimeError: [Errno 32] Broken pipe
</pre></td></tr>
- <tr class="" id="l98"><td><a href="#l98"><span>98</span></a></td><td><pre> * Cache regen failed with 1
+ <tr class="" id="l97"><td><a href="#l97"><span>97</span></a></td><td><pre> * Cache regen failed with 1
</pre></td></tr>
</table>
diff --git a/underlay.txt b/underlay.txt
index 1e66c0c6c678..4750e921a082 100644
--- a/underlay.txt
+++ b/underlay.txt
@@ -62,7 +62,6 @@ ERROR pkgcore: returned val from gen_metadata was 'False'
!!! caught exception False while processing ebuild src: app-admin/gentool-0.2.9
ERROR pkgcore: returned val from gen_metadata was 'False'
!!! caught exception False while processing ebuild src: media-tv/linuxtv-dvb-firmware-2009.07.06-r1
-!!! caught exception ("Expected command; instead got nothing from ''", None) while processing ebuild src: media-tv/linuxtv-dvb-firmware-2009.09.19-r2
Traceback (most recent call last):
File "/home/mgorny/pkgcore-venv/bin/pmaint", line 4, in <module>
scripts.main(basename(__file__))
diff --git a/vdr-testing.html b/vdr-testing.html
index a686348ad784..763fec595c77 100644
--- a/vdr-testing.html
+++ b/vdr-testing.html
@@ -62,9 +62,9 @@
</pre></td><td>[FATAL]</td></tr>
<tr class="" id="l26"><td><a href="#l26"><span>26</span></a></td><td><pre>error: parsed eapi '0' doesn't match sourced eapi '2' while processing ebuild src: media-tv/s2-liplianin-0.1
</pre></td></tr>
- <tr class="err" id="l27"><td><a href="#l27"><span>27</span></a></td><td><pre>caught exception '%s' while processing '%s'(MetadataException("Metadata Exception: pkg ebuild src: media-tv/mantis-v4l-dvb-hg-0.1, attr description\nerror: Metadata Exception: pkg ebuild src: media-tv/mantis-v4l-dvb-hg-0.1, attr data\nerror: Metadata Exception: pkg ebuild src: media-tv/mantis-v4l-dvb-hg-0.1, attr eapi\nerror: parsed eapi '0' doesn't match sourced eapi '2'",), &lt;&lt;class 'pkgcore.ebuild.ebuild_src.package'&gt; cpv='media-tv/mantis-v4l-dvb-hg-0.1' @0x7fe281cba550&gt;)
+ <tr class="err" id="l27"><td><a href="#l27"><span>27</span></a></td><td><pre>caught exception '%s' while processing '%s'(MetadataException("Metadata Exception: pkg ebuild src: media-tv/mantis-v4l-dvb-hg-0.1, attr description\nerror: Metadata Exception: pkg ebuild src: media-tv/mantis-v4l-dvb-hg-0.1, attr data\nerror: Metadata Exception: pkg ebuild src: media-tv/mantis-v4l-dvb-hg-0.1, attr eapi\nerror: parsed eapi '0' doesn't match sourced eapi '2'",), &lt;&lt;class 'pkgcore.ebuild.ebuild_src.package'&gt; cpv='media-tv/mantis-v4l-dvb-hg-0.1' @0x7f80c73d3550&gt;)
</pre></td><td>[FATAL]</td></tr>
- <tr class="err" id="l28"><td><a href="#l28"><span>28</span></a></td><td><pre>caught exception '%s' while processing '%s'(MetadataException("Metadata Exception: pkg ebuild src: media-tv/s2-liplianin-0.1, attr description\nerror: Metadata Exception: pkg ebuild src: media-tv/s2-liplianin-0.1, attr data\nerror: Metadata Exception: pkg ebuild src: media-tv/s2-liplianin-0.1, attr eapi\nerror: parsed eapi '0' doesn't match sourced eapi '2'",), &lt;&lt;class 'pkgcore.ebuild.ebuild_src.package'&gt; cpv='media-tv/s2-liplianin-0.1' @0x7fe281cba690&gt;)
+ <tr class="err" id="l28"><td><a href="#l28"><span>28</span></a></td><td><pre>caught exception '%s' while processing '%s'(MetadataException("Metadata Exception: pkg ebuild src: media-tv/s2-liplianin-0.1, attr description\nerror: Metadata Exception: pkg ebuild src: media-tv/s2-liplianin-0.1, attr data\nerror: Metadata Exception: pkg ebuild src: media-tv/s2-liplianin-0.1, attr eapi\nerror: parsed eapi '0' doesn't match sourced eapi '2'",), &lt;&lt;class 'pkgcore.ebuild.ebuild_src.package'&gt; cpv='media-tv/s2-liplianin-0.1' @0x7f80c73d3690&gt;)
</pre></td><td>[FATAL]</td></tr>
<tr class="" id="l29"><td><a href="#l29"><span>29</span></a></td><td><pre> * Cache regen failed with 1
</pre></td></tr>
diff --git a/vdr-testing.txt b/vdr-testing.txt
index c684a8369838..e2f0f6bd87c1 100644
--- a/vdr-testing.txt
+++ b/vdr-testing.txt
@@ -24,6 +24,6 @@ WARNING:pkgcore:repository at '/home/mgorny/repos/steveeJ' has unsupported profi
error: parsed eapi '0' doesn't match sourced eapi '2' while processing ebuild src: media-tv/mantis-v4l-dvb-hg-0.1
!!! caught exception Metadata Exception: pkg ebuild src: media-tv/s2-liplianin-0.1, attr eapi
error: parsed eapi '0' doesn't match sourced eapi '2' while processing ebuild src: media-tv/s2-liplianin-0.1
-caught exception '%s' while processing '%s'(MetadataException("Metadata Exception: pkg ebuild src: media-tv/mantis-v4l-dvb-hg-0.1, attr description\nerror: Metadata Exception: pkg ebuild src: media-tv/mantis-v4l-dvb-hg-0.1, attr data\nerror: Metadata Exception: pkg ebuild src: media-tv/mantis-v4l-dvb-hg-0.1, attr eapi\nerror: parsed eapi '0' doesn't match sourced eapi '2'",), <<class 'pkgcore.ebuild.ebuild_src.package'> cpv='media-tv/mantis-v4l-dvb-hg-0.1' @0x7fe281cba550>)
-caught exception '%s' while processing '%s'(MetadataException("Metadata Exception: pkg ebuild src: media-tv/s2-liplianin-0.1, attr description\nerror: Metadata Exception: pkg ebuild src: media-tv/s2-liplianin-0.1, attr data\nerror: Metadata Exception: pkg ebuild src: media-tv/s2-liplianin-0.1, attr eapi\nerror: parsed eapi '0' doesn't match sourced eapi '2'",), <<class 'pkgcore.ebuild.ebuild_src.package'> cpv='media-tv/s2-liplianin-0.1' @0x7fe281cba690>)
+caught exception '%s' while processing '%s'(MetadataException("Metadata Exception: pkg ebuild src: media-tv/mantis-v4l-dvb-hg-0.1, attr description\nerror: Metadata Exception: pkg ebuild src: media-tv/mantis-v4l-dvb-hg-0.1, attr data\nerror: Metadata Exception: pkg ebuild src: media-tv/mantis-v4l-dvb-hg-0.1, attr eapi\nerror: parsed eapi '0' doesn't match sourced eapi '2'",), <<class 'pkgcore.ebuild.ebuild_src.package'> cpv='media-tv/mantis-v4l-dvb-hg-0.1' @0x7f80c73d3550>)
+caught exception '%s' while processing '%s'(MetadataException("Metadata Exception: pkg ebuild src: media-tv/s2-liplianin-0.1, attr description\nerror: Metadata Exception: pkg ebuild src: media-tv/s2-liplianin-0.1, attr data\nerror: Metadata Exception: pkg ebuild src: media-tv/s2-liplianin-0.1, attr eapi\nerror: parsed eapi '0' doesn't match sourced eapi '2'",), <<class 'pkgcore.ebuild.ebuild_src.package'> cpv='media-tv/s2-liplianin-0.1' @0x7f80c73d3690>)
* Cache regen failed with 1
diff --git a/voip.html b/voip.html
index 816b91364907..9552561a72de 100644
--- a/voip.html
+++ b/voip.html
@@ -138,73 +138,71 @@
</pre></td></tr>
<tr class="err" id="l64"><td><a href="#l64"><span>64</span></a></td><td><pre>!!! caught exception False while processing ebuild src: net-voip/yate-1.3.0-r1
</pre></td><td>[FATAL]</td></tr>
- <tr class="err" id="l65"><td><a href="#l65"><span>65</span></a></td><td><pre>!!! caught exception ("Expected command; instead got nothing from ''", None) while processing ebuild src: net-voip/yate-1.3.0
-</pre></td><td>[FATAL]</td></tr>
- <tr class="" id="l66"><td><a href="#l66"><span>66</span></a></td><td><pre>Traceback (most recent call last):
+ <tr class="" id="l65"><td><a href="#l65"><span>65</span></a></td><td><pre>Traceback (most recent call last):
</pre></td></tr>
- <tr class="" id="l67"><td><a href="#l67"><span>67</span></a></td><td><pre> File "/home/mgorny/pkgcore-venv/bin/pmaint", line 4, in &lt;module&gt;
+ <tr class="" id="l66"><td><a href="#l66"><span>66</span></a></td><td><pre> File "/home/mgorny/pkgcore-venv/bin/pmaint", line 4, in &lt;module&gt;
</pre></td></tr>
- <tr class="" id="l68"><td><a href="#l68"><span>68</span></a></td><td><pre> scripts.main(basename(__file__))
+ <tr class="" id="l67"><td><a href="#l67"><span>67</span></a></td><td><pre> scripts.main(basename(__file__))
</pre></td></tr>
- <tr class="" id="l69"><td><a href="#l69"><span>69</span></a></td><td><pre> File "/home/mgorny/pkgcore-venv/lib/python2.7/site-packages/pkgcore/scripts/__init__.py", line 40, in main
+ <tr class="" id="l68"><td><a href="#l68"><span>68</span></a></td><td><pre> File "/home/mgorny/pkgcore-venv/lib/python2.7/site-packages/pkgcore/scripts/__init__.py", line 40, in main
</pre></td></tr>
- <tr class="" id="l70"><td><a href="#l70"><span>70</span></a></td><td><pre> commandline.main(subcommands)
+ <tr class="" id="l69"><td><a href="#l69"><span>69</span></a></td><td><pre> commandline.main(subcommands)
</pre></td></tr>
- <tr class="" id="l71"><td><a href="#l71"><span>71</span></a></td><td><pre> File "/home/mgorny/pkgcore-venv/lib/python2.7/site-packages/pkgcore/util/commandline.py", line 928, in main
+ <tr class="" id="l70"><td><a href="#l70"><span>70</span></a></td><td><pre> File "/home/mgorny/pkgcore-venv/lib/python2.7/site-packages/pkgcore/util/commandline.py", line 928, in main
</pre></td></tr>
- <tr class="" id="l72"><td><a href="#l72"><span>72</span></a></td><td><pre> exitstatus = main_func(options, out, err)
+ <tr class="" id="l71"><td><a href="#l71"><span>71</span></a></td><td><pre> exitstatus = main_func(options, out, err)
</pre></td></tr>
- <tr class="" id="l73"><td><a href="#l73"><span>73</span></a></td><td><pre> File "/home/mgorny/pkgcore-venv/lib/python2.7/site-packages/pkgcore/scripts/pmaint.py", line 283, in regen_main
+ <tr class="" id="l72"><td><a href="#l72"><span>72</span></a></td><td><pre> File "/home/mgorny/pkgcore-venv/lib/python2.7/site-packages/pkgcore/scripts/pmaint.py", line 283, in regen_main
</pre></td></tr>
- <tr class="" id="l74"><td><a href="#l74"><span>74</span></a></td><td><pre> eclass_caching=(not options.disable_eclass_caching))
+ <tr class="" id="l73"><td><a href="#l73"><span>73</span></a></td><td><pre> eclass_caching=(not options.disable_eclass_caching))
</pre></td></tr>
- <tr class="" id="l75"><td><a href="#l75"><span>75</span></a></td><td><pre> File "/home/mgorny/pkgcore-venv/lib/python2.7/site-packages/pkgcore/operations/__init__.py", line 68, in _recast_exception_decorator
+ <tr class="" id="l74"><td><a href="#l74"><span>74</span></a></td><td><pre> File "/home/mgorny/pkgcore-venv/lib/python2.7/site-packages/pkgcore/operations/__init__.py", line 68, in _recast_exception_decorator
</pre></td></tr>
- <tr class="" id="l76"><td><a href="#l76"><span>76</span></a></td><td><pre> return functor(*args, **kwds)
+ <tr class="" id="l75"><td><a href="#l75"><span>75</span></a></td><td><pre> return functor(*args, **kwds)
</pre></td></tr>
- <tr class="" id="l77"><td><a href="#l77"><span>77</span></a></td><td><pre> File "/home/mgorny/pkgcore-venv/lib/python2.7/site-packages/pkgcore/operations/repo.py", line 247, in _cmd_api_regen_cache
+ <tr class="" id="l76"><td><a href="#l76"><span>76</span></a></td><td><pre> File "/home/mgorny/pkgcore-venv/lib/python2.7/site-packages/pkgcore/operations/repo.py", line 247, in _cmd_api_regen_cache
</pre></td></tr>
- <tr class="" id="l78"><td><a href="#l78"><span>78</span></a></td><td><pre> self._get_observer(observer), threads=threads, **options)
+ <tr class="" id="l77"><td><a href="#l77"><span>77</span></a></td><td><pre> self._get_observer(observer), threads=threads, **options)
</pre></td></tr>
- <tr class="" id="l79"><td><a href="#l79"><span>79</span></a></td><td><pre> File "/home/mgorny/pkgcore-venv/lib/python2.7/site-packages/pkgcore/operations/regen.py", line 37, in regen_repository
+ <tr class="" id="l78"><td><a href="#l78"><span>78</span></a></td><td><pre> File "/home/mgorny/pkgcore-venv/lib/python2.7/site-packages/pkgcore/operations/regen.py", line 37, in regen_repository
</pre></td></tr>
- <tr class="" id="l80"><td><a href="#l80"><span>80</span></a></td><td><pre> regen_iter(iter(repo), _get_repo_helper(), observer)
+ <tr class="" id="l79"><td><a href="#l79"><span>79</span></a></td><td><pre> regen_iter(iter(repo), _get_repo_helper(), observer)
</pre></td></tr>
- <tr class="" id="l81"><td><a href="#l81"><span>81</span></a></td><td><pre> File "/home/mgorny/pkgcore-venv/lib/python2.7/site-packages/pkgcore/operations/regen.py", line 15, in regen_iter
+ <tr class="" id="l80"><td><a href="#l80"><span>80</span></a></td><td><pre> File "/home/mgorny/pkgcore-venv/lib/python2.7/site-packages/pkgcore/operations/regen.py", line 15, in regen_iter
</pre></td></tr>
- <tr class="" id="l82"><td><a href="#l82"><span>82</span></a></td><td><pre> regen_func(x)
+ <tr class="" id="l81"><td><a href="#l81"><span>81</span></a></td><td><pre> regen_func(x)
</pre></td></tr>
- <tr class="" id="l83"><td><a href="#l83"><span>83</span></a></td><td><pre> File "/home/mgorny/pkgcore-venv/lib/python2.7/site-packages/pkgcore/ebuild/repository.py", line 521, in __call__
+ <tr class="" id="l82"><td><a href="#l82"><span>82</span></a></td><td><pre> File "/home/mgorny/pkgcore-venv/lib/python2.7/site-packages/pkgcore/ebuild/repository.py", line 521, in __call__
</pre></td></tr>
- <tr class="" id="l84"><td><a href="#l84"><span>84</span></a></td><td><pre> return pkg._fetch_metadata(ebp=self.ebp, force_regen=self.force)
+ <tr class="" id="l83"><td><a href="#l83"><span>83</span></a></td><td><pre> return pkg._fetch_metadata(ebp=self.ebp, force_regen=self.force)
</pre></td></tr>
- <tr class="" id="l85"><td><a href="#l85"><span>85</span></a></td><td><pre> File "/home/mgorny/pkgcore-venv/lib/python2.7/site-packages/pkgcore/ebuild/ebuild_src.py", line 272, in _fetch_metadata
+ <tr class="" id="l84"><td><a href="#l84"><span>84</span></a></td><td><pre> File "/home/mgorny/pkgcore-venv/lib/python2.7/site-packages/pkgcore/ebuild/ebuild_src.py", line 272, in _fetch_metadata
</pre></td></tr>
- <tr class="" id="l86"><td><a href="#l86"><span>86</span></a></td><td><pre> return self._parent._get_metadata(self, ebp=ebp, force_regen=force_regen)
+ <tr class="" id="l85"><td><a href="#l85"><span>85</span></a></td><td><pre> return self._parent._get_metadata(self, ebp=ebp, force_regen=force_regen)
</pre></td></tr>
- <tr class="" id="l87"><td><a href="#l87"><span>87</span></a></td><td><pre> File "/home/mgorny/pkgcore-venv/lib/python2.7/site-packages/pkgcore/ebuild/ebuild_src.py", line 363, in _get_metadata
+ <tr class="" id="l86"><td><a href="#l86"><span>86</span></a></td><td><pre> File "/home/mgorny/pkgcore-venv/lib/python2.7/site-packages/pkgcore/ebuild/ebuild_src.py", line 363, in _get_metadata
</pre></td></tr>
- <tr class="" id="l88"><td><a href="#l88"><span>88</span></a></td><td><pre> return self._update_metadata(pkg, ebp=ebp)
+ <tr class="" id="l87"><td><a href="#l87"><span>87</span></a></td><td><pre> return self._update_metadata(pkg, ebp=ebp)
</pre></td></tr>
- <tr class="" id="l89"><td><a href="#l89"><span>89</span></a></td><td><pre> File "/home/mgorny/pkgcore-venv/lib/python2.7/site-packages/pkgcore/ebuild/ebuild_src.py", line 371, in _update_metadata
+ <tr class="" id="l88"><td><a href="#l88"><span>88</span></a></td><td><pre> File "/home/mgorny/pkgcore-venv/lib/python2.7/site-packages/pkgcore/ebuild/ebuild_src.py", line 371, in _update_metadata
</pre></td></tr>
- <tr class="" id="l90"><td><a href="#l90"><span>90</span></a></td><td><pre> mydata = my_proc.get_keys(pkg, self._ecache)
+ <tr class="" id="l89"><td><a href="#l89"><span>89</span></a></td><td><pre> mydata = my_proc.get_keys(pkg, self._ecache)
</pre></td></tr>
- <tr class="" id="l91"><td><a href="#l91"><span>91</span></a></td><td><pre> File "/home/mgorny/pkgcore-venv/lib/python2.7/site-packages/pkgcore/ebuild/processor.py", line 826, in get_keys
+ <tr class="" id="l90"><td><a href="#l90"><span>90</span></a></td><td><pre> File "/home/mgorny/pkgcore-venv/lib/python2.7/site-packages/pkgcore/ebuild/processor.py", line 826, in get_keys
</pre></td></tr>
- <tr class="" id="l92"><td><a href="#l92"><span>92</span></a></td><td><pre> {"key": receive_key})
+ <tr class="" id="l91"><td><a href="#l91"><span>91</span></a></td><td><pre> {"key": receive_key})
</pre></td></tr>
- <tr class="" id="l93"><td><a href="#l93"><span>93</span></a></td><td><pre> File "/home/mgorny/pkgcore-venv/lib/python2.7/site-packages/pkgcore/ebuild/processor.py", line 759, in _run_depend_like_phase
+ <tr class="" id="l92"><td><a href="#l92"><span>92</span></a></td><td><pre> File "/home/mgorny/pkgcore-venv/lib/python2.7/site-packages/pkgcore/ebuild/processor.py", line 759, in _run_depend_like_phase
</pre></td></tr>
- <tr class="" id="l94"><td><a href="#l94"><span>94</span></a></td><td><pre> self.write("%s %i\n%s" % (command, len(data), data), append_newline=False)
+ <tr class="" id="l93"><td><a href="#l93"><span>93</span></a></td><td><pre> self.write("%s %i\n%s" % (command, len(data), data), append_newline=False)
</pre></td></tr>
- <tr class="" id="l95"><td><a href="#l95"><span>95</span></a></td><td><pre> File "/home/mgorny/pkgcore-venv/lib/python2.7/site-packages/pkgcore/ebuild/processor.py", line 457, in write
+ <tr class="" id="l94"><td><a href="#l94"><span>94</span></a></td><td><pre> File "/home/mgorny/pkgcore-venv/lib/python2.7/site-packages/pkgcore/ebuild/processor.py", line 457, in write
</pre></td></tr>
- <tr class="" id="l96"><td><a href="#l96"><span>96</span></a></td><td><pre> raise RuntimeError(ie)
+ <tr class="" id="l95"><td><a href="#l95"><span>95</span></a></td><td><pre> raise RuntimeError(ie)
</pre></td></tr>
- <tr class="" id="l97"><td><a href="#l97"><span>97</span></a></td><td><pre>RuntimeError: [Errno 32] Broken pipe
+ <tr class="" id="l96"><td><a href="#l96"><span>96</span></a></td><td><pre>RuntimeError: [Errno 32] Broken pipe
</pre></td></tr>
- <tr class="" id="l98"><td><a href="#l98"><span>98</span></a></td><td><pre> * Cache regen failed with 1
+ <tr class="" id="l97"><td><a href="#l97"><span>97</span></a></td><td><pre> * Cache regen failed with 1
</pre></td></tr>
</table>
diff --git a/voip.txt b/voip.txt
index 2f4e24f89414..057c16bf9a70 100644
--- a/voip.txt
+++ b/voip.txt
@@ -62,7 +62,6 @@ ERROR pkgcore: returned val from gen_metadata was 'False'
!!! caught exception inherit requires an unknown eclass, qt3 cannot be found while processing ebuild src: net-voip/yate-1.2.0-r1
ERROR pkgcore: returned val from gen_metadata was 'False'
!!! caught exception False while processing ebuild src: net-voip/yate-1.3.0-r1
-!!! caught exception ("Expected command; instead got nothing from ''", None) while processing ebuild src: net-voip/yate-1.3.0
Traceback (most recent call last):
File "/home/mgorny/pkgcore-venv/bin/pmaint", line 4, in <module>
scripts.main(basename(__file__))
diff --git a/wtk.html b/wtk.html
index e074bfba11fd..eea3a2983d43 100644
--- a/wtk.html
+++ b/wtk.html
@@ -340,15 +340,15 @@
</pre></td><td>[FATAL]</td></tr>
<tr class="" id="l165"><td><a href="#l165"><span>165</span></a></td><td><pre>ERROR pkgcore: returned val from gen_metadata was 'False'
</pre></td></tr>
- <tr class="err" id="l166"><td><a href="#l166"><span>166</span></a></td><td><pre>caught exception '%s' while processing '%s'(MetadataException('Metadata Exception: pkg ebuild src: perl-gcpan/Crypt-X509-0.51, attr description\nerror: Metadata Exception: pkg ebuild src: perl-gcpan/Crypt-X509-0.51, attr data\nerror: False',), &lt;&lt;class 'pkgcore.ebuild.ebuild_src.package'&gt; cpv='perl-gcpan/Crypt-X509-0.51' @0x7f32bde68910&gt;)
+ <tr class="err" id="l166"><td><a href="#l166"><span>166</span></a></td><td><pre>caught exception '%s' while processing '%s'(MetadataException('Metadata Exception: pkg ebuild src: perl-gcpan/Crypt-X509-0.51, attr description\nerror: Metadata Exception: pkg ebuild src: perl-gcpan/Crypt-X509-0.51, attr data\nerror: False',), &lt;&lt;class 'pkgcore.ebuild.ebuild_src.package'&gt; cpv='perl-gcpan/Crypt-X509-0.51' @0x7f66500c6910&gt;)
</pre></td><td>[FATAL]</td></tr>
<tr class="" id="l167"><td><a href="#l167"><span>167</span></a></td><td><pre>ERROR pkgcore: returned val from gen_metadata was 'False'
</pre></td></tr>
- <tr class="err" id="l168"><td><a href="#l168"><span>168</span></a></td><td><pre>caught exception '%s' while processing '%s'(MetadataException('Metadata Exception: pkg ebuild src: perl-gcpan/MathML-Entities-0.17, attr description\nerror: Metadata Exception: pkg ebuild src: perl-gcpan/MathML-Entities-0.17, attr data\nerror: False',), &lt;&lt;class 'pkgcore.ebuild.ebuild_src.package'&gt; cpv='perl-gcpan/MathML-Entities-0.17' @0x7f32bde68a50&gt;)
+ <tr class="err" id="l168"><td><a href="#l168"><span>168</span></a></td><td><pre>caught exception '%s' while processing '%s'(MetadataException('Metadata Exception: pkg ebuild src: perl-gcpan/MathML-Entities-0.17, attr description\nerror: Metadata Exception: pkg ebuild src: perl-gcpan/MathML-Entities-0.17, attr data\nerror: False',), &lt;&lt;class 'pkgcore.ebuild.ebuild_src.package'&gt; cpv='perl-gcpan/MathML-Entities-0.17' @0x7f66500c6a50&gt;)
</pre></td><td>[FATAL]</td></tr>
<tr class="" id="l169"><td><a href="#l169"><span>169</span></a></td><td><pre>ERROR pkgcore: returned val from gen_metadata was 'False'
</pre></td></tr>
- <tr class="err" id="l170"><td><a href="#l170"><span>170</span></a></td><td><pre>caught exception '%s' while processing '%s'(MetadataException('Metadata Exception: pkg ebuild src: app-crypt/msva-perl-9999, attr description\nerror: Metadata Exception: pkg ebuild src: app-crypt/msva-perl-9999, attr data\nerror: False',), &lt;&lt;class 'pkgcore.ebuild.ebuild_src.package'&gt; cpv='app-crypt/msva-perl-9999' @0x7f32bde71a50&gt;)
+ <tr class="err" id="l170"><td><a href="#l170"><span>170</span></a></td><td><pre>caught exception '%s' while processing '%s'(MetadataException('Metadata Exception: pkg ebuild src: app-crypt/msva-perl-9999, attr description\nerror: Metadata Exception: pkg ebuild src: app-crypt/msva-perl-9999, attr data\nerror: False',), &lt;&lt;class 'pkgcore.ebuild.ebuild_src.package'&gt; cpv='app-crypt/msva-perl-9999' @0x7f66500cfa50&gt;)
</pre></td><td>[FATAL]</td></tr>
<tr class="" id="l171"><td><a href="#l171"><span>171</span></a></td><td><pre> * Cache regen failed with 1
</pre></td></tr>
diff --git a/wtk.txt b/wtk.txt
index 6de61a888ead..23a94faec0f8 100644
--- a/wtk.txt
+++ b/wtk.txt
@@ -163,9 +163,9 @@ ERROR pkgcore: returned val from gen_metadata was 'False'
ERROR pkgcore: returned val from gen_metadata was 'False'
!!! caught exception False while processing ebuild src: app-crypt/msva-perl-9999
ERROR pkgcore: returned val from gen_metadata was 'False'
-caught exception '%s' while processing '%s'(MetadataException('Metadata Exception: pkg ebuild src: perl-gcpan/Crypt-X509-0.51, attr description\nerror: Metadata Exception: pkg ebuild src: perl-gcpan/Crypt-X509-0.51, attr data\nerror: False',), <<class 'pkgcore.ebuild.ebuild_src.package'> cpv='perl-gcpan/Crypt-X509-0.51' @0x7f32bde68910>)
+caught exception '%s' while processing '%s'(MetadataException('Metadata Exception: pkg ebuild src: perl-gcpan/Crypt-X509-0.51, attr description\nerror: Metadata Exception: pkg ebuild src: perl-gcpan/Crypt-X509-0.51, attr data\nerror: False',), <<class 'pkgcore.ebuild.ebuild_src.package'> cpv='perl-gcpan/Crypt-X509-0.51' @0x7f66500c6910>)
ERROR pkgcore: returned val from gen_metadata was 'False'
-caught exception '%s' while processing '%s'(MetadataException('Metadata Exception: pkg ebuild src: perl-gcpan/MathML-Entities-0.17, attr description\nerror: Metadata Exception: pkg ebuild src: perl-gcpan/MathML-Entities-0.17, attr data\nerror: False',), <<class 'pkgcore.ebuild.ebuild_src.package'> cpv='perl-gcpan/MathML-Entities-0.17' @0x7f32bde68a50>)
+caught exception '%s' while processing '%s'(MetadataException('Metadata Exception: pkg ebuild src: perl-gcpan/MathML-Entities-0.17, attr description\nerror: Metadata Exception: pkg ebuild src: perl-gcpan/MathML-Entities-0.17, attr data\nerror: False',), <<class 'pkgcore.ebuild.ebuild_src.package'> cpv='perl-gcpan/MathML-Entities-0.17' @0x7f66500c6a50>)
ERROR pkgcore: returned val from gen_metadata was 'False'
-caught exception '%s' while processing '%s'(MetadataException('Metadata Exception: pkg ebuild src: app-crypt/msva-perl-9999, attr description\nerror: Metadata Exception: pkg ebuild src: app-crypt/msva-perl-9999, attr data\nerror: False',), <<class 'pkgcore.ebuild.ebuild_src.package'> cpv='app-crypt/msva-perl-9999' @0x7f32bde71a50>)
+caught exception '%s' while processing '%s'(MetadataException('Metadata Exception: pkg ebuild src: app-crypt/msva-perl-9999, attr description\nerror: Metadata Exception: pkg ebuild src: app-crypt/msva-perl-9999, attr data\nerror: False',), <<class 'pkgcore.ebuild.ebuild_src.package'> cpv='app-crypt/msva-perl-9999' @0x7f66500cfa50>)
* Cache regen failed with 1
diff --git a/wuodan.html b/wuodan.html
index e57d13238b81..ed2bd8af9d00 100644
--- a/wuodan.html
+++ b/wuodan.html
@@ -136,7 +136,7 @@
</pre></td><td>[FATAL]</td></tr>
<tr class="" id="l63"><td><a href="#l63"><span>63</span></a></td><td><pre>ERROR pkgcore: returned val from gen_metadata was 'False'
</pre></td></tr>
- <tr class="err" id="l64"><td><a href="#l64"><span>64</span></a></td><td><pre>caught exception '%s' while processing '%s'(MetadataException('Metadata Exception: pkg ebuild src: www-servers/apache-2.4.2-r1, attr description\nerror: Metadata Exception: pkg ebuild src: www-servers/apache-2.4.2-r1, attr data\nerror: False',), &lt;&lt;class 'pkgcore.ebuild.ebuild_src.package'&gt; cpv='www-servers/apache-2.4.2-r1' @0x7f25bd919e10&gt;)
+ <tr class="err" id="l64"><td><a href="#l64"><span>64</span></a></td><td><pre>caught exception '%s' while processing '%s'(MetadataException('Metadata Exception: pkg ebuild src: www-servers/apache-2.4.2-r1, attr description\nerror: Metadata Exception: pkg ebuild src: www-servers/apache-2.4.2-r1, attr data\nerror: False',), &lt;&lt;class 'pkgcore.ebuild.ebuild_src.package'&gt; cpv='www-servers/apache-2.4.2-r1' @0x7fd9e6875e10&gt;)
</pre></td><td>[FATAL]</td></tr>
<tr class="" id="l65"><td><a href="#l65"><span>65</span></a></td><td><pre> * Cache regen failed with 1
</pre></td></tr>
diff --git a/wuodan.txt b/wuodan.txt
index 1cb90e530448..428e0ae8476f 100644
--- a/wuodan.txt
+++ b/wuodan.txt
@@ -61,5 +61,5 @@ WARNING:pkgcore:repository at '/home/mgorny/repos/steveeJ' has unsupported profi
ERROR pkgcore: returned val from gen_metadata was 'False'
!!! caught exception False while processing ebuild src: www-servers/apache-2.4.2-r1
ERROR pkgcore: returned val from gen_metadata was 'False'
-caught exception '%s' while processing '%s'(MetadataException('Metadata Exception: pkg ebuild src: www-servers/apache-2.4.2-r1, attr description\nerror: Metadata Exception: pkg ebuild src: www-servers/apache-2.4.2-r1, attr data\nerror: False',), <<class 'pkgcore.ebuild.ebuild_src.package'> cpv='www-servers/apache-2.4.2-r1' @0x7f25bd919e10>)
+caught exception '%s' while processing '%s'(MetadataException('Metadata Exception: pkg ebuild src: www-servers/apache-2.4.2-r1, attr description\nerror: Metadata Exception: pkg ebuild src: www-servers/apache-2.4.2-r1, attr data\nerror: False',), <<class 'pkgcore.ebuild.ebuild_src.package'> cpv='www-servers/apache-2.4.2-r1' @0x7fd9e6875e10>)
* Cache regen failed with 1
diff --git a/xmw.html b/xmw.html
index fb84a79f6d48..7922e3876e01 100644
--- a/xmw.html
+++ b/xmw.html
@@ -150,7 +150,7 @@
</pre></td><td>[FATAL]</td></tr>
<tr class="" id="l70"><td><a href="#l70"><span>70</span></a></td><td><pre>ERROR pkgcore: returned val from gen_metadata was 'False'
</pre></td></tr>
- <tr class="err" id="l71"><td><a href="#l71"><span>71</span></a></td><td><pre>caught exception '%s' while processing '%s'(MetadataException('Metadata Exception: pkg ebuild src: app-accessibility/florence-0.6.0, attr description\nerror: Metadata Exception: pkg ebuild src: app-accessibility/florence-0.6.0, attr data\nerror: False',), &lt;&lt;class 'pkgcore.ebuild.ebuild_src.package'&gt; cpv='app-accessibility/florence-0.6.0' @0x7fb3e88a1cd0&gt;)
+ <tr class="err" id="l71"><td><a href="#l71"><span>71</span></a></td><td><pre>caught exception '%s' while processing '%s'(MetadataException('Metadata Exception: pkg ebuild src: app-accessibility/florence-0.6.0, attr description\nerror: Metadata Exception: pkg ebuild src: app-accessibility/florence-0.6.0, attr data\nerror: False',), &lt;&lt;class 'pkgcore.ebuild.ebuild_src.package'&gt; cpv='app-accessibility/florence-0.6.0' @0x7f2db7d1ccd0&gt;)
</pre></td><td>[FATAL]</td></tr>
<tr class="" id="l72"><td><a href="#l72"><span>72</span></a></td><td><pre> * Cache regen failed with 1
</pre></td></tr>
diff --git a/xmw.txt b/xmw.txt
index 7b49528535c8..d1ec722631da 100644
--- a/xmw.txt
+++ b/xmw.txt
@@ -68,5 +68,5 @@ WARNING:pkgcore:repository at '/home/mgorny/repos/steveeJ' has unsupported profi
ERROR pkgcore: returned val from gen_metadata was 'False'
!!! caught exception False while processing ebuild src: app-accessibility/florence-0.6.0
ERROR pkgcore: returned val from gen_metadata was 'False'
-caught exception '%s' while processing '%s'(MetadataException('Metadata Exception: pkg ebuild src: app-accessibility/florence-0.6.0, attr description\nerror: Metadata Exception: pkg ebuild src: app-accessibility/florence-0.6.0, attr data\nerror: False',), <<class 'pkgcore.ebuild.ebuild_src.package'> cpv='app-accessibility/florence-0.6.0' @0x7fb3e88a1cd0>)
+caught exception '%s' while processing '%s'(MetadataException('Metadata Exception: pkg ebuild src: app-accessibility/florence-0.6.0, attr description\nerror: Metadata Exception: pkg ebuild src: app-accessibility/florence-0.6.0, attr data\nerror: False',), <<class 'pkgcore.ebuild.ebuild_src.package'> cpv='app-accessibility/florence-0.6.0' @0x7f2db7d1ccd0>)
* Cache regen failed with 1
diff --git a/zugaina.html b/zugaina.html
index 0ab751311462..70fcf9e6858a 100644
--- a/zugaina.html
+++ b/zugaina.html
@@ -50,7 +50,7 @@
</pre></td></tr>
<tr class="" id="l20"><td><a href="#l20"><span>20</span></a></td><td><pre>Matched data: 0 bytes
</pre></td></tr>
- <tr class="" id="l21"><td><a href="#l21"><span>21</span></a></td><td><pre>File list size: 47.25K
+ <tr class="" id="l21"><td><a href="#l21"><span>21</span></a></td><td><pre>File list size: 48.62K
</pre></td></tr>
<tr class="" id="l22"><td><a href="#l22"><span>22</span></a></td><td><pre>File list generation time: 0.001 seconds
</pre></td></tr>
@@ -62,7 +62,7 @@
</pre></td></tr>
<tr class="" id="l26"><td><a href="#l26"><span>26</span></a></td><td><pre>
</pre></td></tr>
- <tr class="" id="l27"><td><a href="#l27"><span>27</span></a></td><td><pre>sent 602 bytes received 51.10K bytes 14.77K bytes/sec
+ <tr class="" id="l27"><td><a href="#l27"><span>27</span></a></td><td><pre>sent 602 bytes received 51.10K bytes 4.14K bytes/sec
</pre></td></tr>
<tr class="" id="l28"><td><a href="#l28"><span>28</span></a></td><td><pre>total size is 3.20M speedup is 61.81
</pre></td></tr>
diff --git a/zugaina.txt b/zugaina.txt
index ef68d287483b..08b89699b14c 100644
--- a/zugaina.txt
+++ b/zugaina.txt
@@ -18,13 +18,13 @@ Total file size: 3.20M bytes
Total transferred file size: 0 bytes
Literal data: 0 bytes
Matched data: 0 bytes
-File list size: 47.25K
+File list size: 48.62K
File list generation time: 0.001 seconds
File list transfer time: 0.000 seconds
Total bytes sent: 602
Total bytes received: 51.10K
-sent 602 bytes received 51.10K bytes 14.77K bytes/sec
+sent 602 bytes received 51.10K bytes 4.14K bytes/sec
total size is 3.20M speedup is 61.81
*** syncing zugaina
*** synced zugaina