diff options
-rw-r--r-- | R_Overlay.html | 4 | ||||
-rw-r--r-- | R_Overlay.txt | 4 | ||||
-rw-r--r-- | belak.html | 4 | ||||
-rw-r--r-- | belak.txt | 4 | ||||
-rw-r--r-- | calculate.html | 20 | ||||
-rw-r--r-- | calculate.txt | 2 | ||||
-rw-r--r-- | embedded-cross.html | 68 | ||||
-rw-r--r-- | embedded-cross.txt | 1 | ||||
-rw-r--r-- | ephemeral.html | 18 | ||||
-rw-r--r-- | ephemeral.txt | 18 | ||||
-rw-r--r-- | fidonet.html | 2 | ||||
-rw-r--r-- | fidonet.txt | 2 | ||||
-rw-r--r-- | gbin.html | 6 | ||||
-rw-r--r-- | gbin.txt | 6 | ||||
-rw-r--r-- | gentoo-guis.html | 68 | ||||
-rw-r--r-- | gentoo-guis.txt | 1 | ||||
-rw-r--r-- | gentoo.html | 28 | ||||
-rw-r--r-- | gentoo.txt | 14 | ||||
-rw-r--r-- | hacking-gentoo.html | 8 | ||||
-rw-r--r-- | hacking-gentoo.txt | 8 | ||||
-rw-r--r-- | index.html | 2 | ||||
-rw-r--r-- | jensp.html | 68 | ||||
-rw-r--r-- | jensp.txt | 1 | ||||
-rw-r--r-- | loongson.html | 10 | ||||
-rw-r--r-- | loongson.txt | 10 | ||||
-rw-r--r-- | lordvan.html | 2 | ||||
-rw-r--r-- | lordvan.txt | 2 | ||||
-rw-r--r-- | maxik-overlay.html | 34 | ||||
-rw-r--r-- | maxik-overlay.txt | 11 | ||||
-rw-r--r-- | n4g.html | 2 | ||||
-rw-r--r-- | n4g.txt | 2 | ||||
-rw-r--r-- | n8x0.html | 6 | ||||
-rw-r--r-- | n8x0.txt | 6 | ||||
-rw-r--r-- | o11c.html | 2 | ||||
-rw-r--r-- | o11c.txt | 2 | ||||
-rw-r--r-- | poly-c.html | 2 | ||||
-rw-r--r-- | poly-c.txt | 2 | ||||
-rw-r--r-- | proaudio.html | 14 | ||||
-rw-r--r-- | proaudio.txt | 14 | ||||
-rw-r--r-- | rainyday.html | 46 | ||||
-rw-r--r-- | rainyday.txt | 46 | ||||
-rw-r--r-- | raw.html | 4 | ||||
-rw-r--r-- | raw.txt | 4 | ||||
-rw-r--r-- | rebel.html | 2 | ||||
-rw-r--r-- | rebel.txt | 2 | ||||
-rw-r--r-- | sigrok.html | 12 | ||||
-rw-r--r-- | sigrok.txt | 12 | ||||
-rw-r--r-- | sunrise.html | 4 | ||||
-rw-r--r-- | sunrise.txt | 4 | ||||
-rw-r--r-- | swegener.html | 2 | ||||
-rw-r--r-- | swegener.txt | 2 | ||||
-rw-r--r-- | vdr-testing.html | 4 | ||||
-rw-r--r-- | vdr-testing.txt | 4 | ||||
-rw-r--r-- | vincent.html | 8 | ||||
-rw-r--r-- | vincent.txt | 8 | ||||
-rw-r--r-- | voip.html | 68 | ||||
-rw-r--r-- | voip.txt | 1 | ||||
-rw-r--r-- | wtk.html | 6 | ||||
-rw-r--r-- | wtk.txt | 6 | ||||
-rw-r--r-- | xmw.html | 2 | ||||
-rw-r--r-- | xmw.txt | 2 | ||||
-rw-r--r-- | xwing.html | 70 | ||||
-rw-r--r-- | xwing.txt | 30 | ||||
-rw-r--r-- | y2kbadbug.html | 2 | ||||
-rw-r--r-- | y2kbadbug.txt | 2 | ||||
-rw-r--r-- | zugaina.html | 6 | ||||
-rw-r--r-- | zugaina.txt | 6 |
67 files changed, 474 insertions, 369 deletions
diff --git a/R_Overlay.html b/R_Overlay.html index eb8815097ae5..a4b69685cf0c 100644 --- a/R_Overlay.html +++ b/R_Overlay.html @@ -60,13 +60,13 @@ </pre></td></tr> <tr class="" id="l25"><td><a href="#l25"><span>25</span></a></td><td><pre>File list transfer time: 0.000 seconds </pre></td></tr> - <tr class="" id="l26"><td><a href="#l26"><span>26</span></a></td><td><pre>Total bytes sent: 14.46K + <tr class="" id="l26"><td><a href="#l26"><span>26</span></a></td><td><pre>Total bytes sent: 14.50K </pre></td></tr> <tr class="" id="l27"><td><a href="#l27"><span>27</span></a></td><td><pre>Total bytes received: 3.04M </pre></td></tr> <tr class="" id="l28"><td><a href="#l28"><span>28</span></a></td><td><pre> </pre></td></tr> - <tr class="" id="l29"><td><a href="#l29"><span>29</span></a></td><td><pre>sent 14.46K bytes received 3.04M bytes 185.19K bytes/sec + <tr class="" id="l29"><td><a href="#l29"><span>29</span></a></td><td><pre>sent 14.50K bytes received 3.04M bytes 185.19K bytes/sec </pre></td></tr> <tr class="" id="l30"><td><a href="#l30"><span>30</span></a></td><td><pre>total size is 74.88M speedup is 24.51 </pre></td></tr> diff --git a/R_Overlay.txt b/R_Overlay.txt index dc8c90706547..844b556795c6 100644 --- a/R_Overlay.txt +++ b/R_Overlay.txt @@ -23,10 +23,10 @@ Matched data: 0 bytes File list size: 2.82M File list generation time: 0.001 seconds File list transfer time: 0.000 seconds -Total bytes sent: 14.46K +Total bytes sent: 14.50K Total bytes received: 3.04M -sent 14.46K bytes received 3.04M bytes 185.19K bytes/sec +sent 14.50K bytes received 3.04M bytes 185.19K bytes/sec total size is 74.88M speedup is 24.51 *** syncing R_Overlay *** synced R_Overlay diff --git a/belak.html b/belak.html index 1f495ca56431..49301b514a8c 100644 --- a/belak.html +++ b/belak.html @@ -246,11 +246,11 @@ </pre></td><td>[FATAL]</td></tr> <tr class="" id="l118"><td><a href="#l118"><span>118</span></a></td><td><pre>ERROR pkgcore: returned val from gen_metadata was 'False' </pre></td></tr> - <tr class="err" id="l119"><td><a href="#l119"><span>119</span></a></td><td><pre>caught exception '%s' while processing '%s'(MetadataException('Metadata Exception: pkg ebuild src: app-editors/scribes-0.4-r954, attr description\nerror: Metadata Exception: pkg ebuild src: app-editors/scribes-0.4-r954, attr data\nerror: False',), <<class 'pkgcore.ebuild.ebuild_src.package'> cpv='app-editors/scribes-0.4-r954' @0x7f41eb4c4910>) + <tr class="err" id="l119"><td><a href="#l119"><span>119</span></a></td><td><pre>caught exception '%s' while processing '%s'(MetadataException('Metadata Exception: pkg ebuild src: app-editors/scribes-0.4-r954, attr description\nerror: Metadata Exception: pkg ebuild src: app-editors/scribes-0.4-r954, attr data\nerror: False',), <<class 'pkgcore.ebuild.ebuild_src.package'> cpv='app-editors/scribes-0.4-r954' @0x7f4165526910>) </pre></td><td>[FATAL]</td></tr> <tr class="" id="l120"><td><a href="#l120"><span>120</span></a></td><td><pre>ERROR pkgcore: returned val from gen_metadata was 'False' </pre></td></tr> - <tr class="err" id="l121"><td><a href="#l121"><span>121</span></a></td><td><pre>caught exception '%s' while processing '%s'(MetadataException('Metadata Exception: pkg ebuild src: app-editors/scribes-9999, attr description\nerror: Metadata Exception: pkg ebuild src: app-editors/scribes-9999, attr data\nerror: False',), <<class 'pkgcore.ebuild.ebuild_src.package'> cpv='app-editors/scribes-9999' @0x7f41eb4c47d0>) + <tr class="err" id="l121"><td><a href="#l121"><span>121</span></a></td><td><pre>caught exception '%s' while processing '%s'(MetadataException('Metadata Exception: pkg ebuild src: app-editors/scribes-9999, attr description\nerror: Metadata Exception: pkg ebuild src: app-editors/scribes-9999, attr data\nerror: False',), <<class 'pkgcore.ebuild.ebuild_src.package'> cpv='app-editors/scribes-9999' @0x7f41655267d0>) </pre></td><td>[FATAL]</td></tr> <tr class="" id="l122"><td><a href="#l122"><span>122</span></a></td><td><pre> * Cache regen failed with 1 </pre></td></tr> diff --git a/belak.txt b/belak.txt index dd87e9251477..c4d41bc97070 100644 --- a/belak.txt +++ b/belak.txt @@ -116,7 +116,7 @@ ERROR pkgcore: returned val from gen_metadata was 'False' ERROR pkgcore: returned val from gen_metadata was 'False' !!! caught exception False while processing ebuild src: app-editors/scribes-9999 ERROR pkgcore: returned val from gen_metadata was 'False' -caught exception '%s' while processing '%s'(MetadataException('Metadata Exception: pkg ebuild src: app-editors/scribes-0.4-r954, attr description\nerror: Metadata Exception: pkg ebuild src: app-editors/scribes-0.4-r954, attr data\nerror: False',), <<class 'pkgcore.ebuild.ebuild_src.package'> cpv='app-editors/scribes-0.4-r954' @0x7f41eb4c4910>) +caught exception '%s' while processing '%s'(MetadataException('Metadata Exception: pkg ebuild src: app-editors/scribes-0.4-r954, attr description\nerror: Metadata Exception: pkg ebuild src: app-editors/scribes-0.4-r954, attr data\nerror: False',), <<class 'pkgcore.ebuild.ebuild_src.package'> cpv='app-editors/scribes-0.4-r954' @0x7f4165526910>) ERROR pkgcore: returned val from gen_metadata was 'False' -caught exception '%s' while processing '%s'(MetadataException('Metadata Exception: pkg ebuild src: app-editors/scribes-9999, attr description\nerror: Metadata Exception: pkg ebuild src: app-editors/scribes-9999, attr data\nerror: False',), <<class 'pkgcore.ebuild.ebuild_src.package'> cpv='app-editors/scribes-9999' @0x7f41eb4c47d0>) +caught exception '%s' while processing '%s'(MetadataException('Metadata Exception: pkg ebuild src: app-editors/scribes-9999, attr description\nerror: Metadata Exception: pkg ebuild src: app-editors/scribes-9999, attr data\nerror: False',), <<class 'pkgcore.ebuild.ebuild_src.package'> cpv='app-editors/scribes-9999' @0x7f41655267d0>) * Cache regen failed with 1 diff --git a/calculate.html b/calculate.html index 9986cdd6331f..788d19dbabfc 100644 --- a/calculate.html +++ b/calculate.html @@ -30,21 +30,25 @@ </pre></td></tr> <tr class="" id="l10"><td><a href="#l10"><span>10</span></a></td><td><pre>WARNING:pkgcore:repository at '/home/mgorny/sync/steveeJ' has unsupported profile format(s): 'profile-set' </pre></td></tr> - <tr class="" id="l11"><td><a href="#l11"><span>11</span></a></td><td><pre>Already up-to-date. + <tr class="" id="l11"><td><a href="#l11"><span>11</span></a></td><td><pre>From git://git.calculate.ru/calculate/overlay </pre></td></tr> - <tr class="" id="l12"><td><a href="#l12"><span>12</span></a></td><td><pre>*** syncing calculate + <tr class="" id="l12"><td><a href="#l12"><span>12</span></a></td><td><pre> 914312f..0aa3a79 develop -> origin/develop </pre></td></tr> - <tr class="" id="l13"><td><a href="#l13"><span>13</span></a></td><td><pre>*** synced calculate + <tr class="" id="l13"><td><a href="#l13"><span>13</span></a></td><td><pre>Already up-to-date. </pre></td></tr> - <tr class="" id="l14"><td><a href="#l14"><span>14</span></a></td><td><pre> * Sync succeeded + <tr class="" id="l14"><td><a href="#l14"><span>14</span></a></td><td><pre>*** syncing calculate </pre></td></tr> - <tr class="" id="l15"><td><a href="#l15"><span>15</span></a></td><td><pre>$ pmaint regen --use-local-desc --pkg-desc-index -t 1 calculate + <tr class="" id="l15"><td><a href="#l15"><span>15</span></a></td><td><pre>*** synced calculate </pre></td></tr> - <tr class="" id="l16"><td><a href="#l16"><span>16</span></a></td><td><pre>WARNING:pkgcore:repository at '/home/mgorny/repos/steveeJ' has unsupported profile format(s): 'profile-set' + <tr class="" id="l16"><td><a href="#l16"><span>16</span></a></td><td><pre> * Sync succeeded </pre></td></tr> - <tr class="" id="l17"><td><a href="#l17"><span>17</span></a></td><td><pre>WARNING:pkgcore:repository at '/home/mgorny/repos/steveeJ' has unsupported profile format(s): 'profile-set' + <tr class="" id="l17"><td><a href="#l17"><span>17</span></a></td><td><pre>$ pmaint regen --use-local-desc --pkg-desc-index -t 1 calculate </pre></td></tr> - <tr class="" id="l18"><td><a href="#l18"><span>18</span></a></td><td><pre> * Cache regenerated successfully + <tr class="" id="l18"><td><a href="#l18"><span>18</span></a></td><td><pre>WARNING:pkgcore:repository at '/home/mgorny/repos/steveeJ' has unsupported profile format(s): 'profile-set' +</pre></td></tr> + <tr class="" id="l19"><td><a href="#l19"><span>19</span></a></td><td><pre>WARNING:pkgcore:repository at '/home/mgorny/repos/steveeJ' has unsupported profile format(s): 'profile-set' +</pre></td></tr> + <tr class="" id="l20"><td><a href="#l20"><span>20</span></a></td><td><pre> * Cache regenerated successfully </pre></td></tr> </table> diff --git a/calculate.txt b/calculate.txt index b29158f4f048..0183987964fb 100644 --- a/calculate.txt +++ b/calculate.txt @@ -8,6 +8,8 @@ 'status': 'unofficial'} $ pmaint sync calculate WARNING:pkgcore:repository at '/home/mgorny/sync/steveeJ' has unsupported profile format(s): 'profile-set' +From git://git.calculate.ru/calculate/overlay + 914312f..0aa3a79 develop -> origin/develop Already up-to-date. *** syncing calculate *** synced calculate diff --git a/embedded-cross.html b/embedded-cross.html index d1b9ee6efafe..c0576275846e 100644 --- a/embedded-cross.html +++ b/embedded-cross.html @@ -138,73 +138,71 @@ </pre></td></tr> <tr class="err" id="l64"><td><a href="#l64"><span>64</span></a></td><td><pre>!!! caught exception False while processing ebuild src: dev-libs/dbus-glib-0.86 </pre></td><td>[FATAL]</td></tr> - <tr class="err" id="l65"><td><a href="#l65"><span>65</span></a></td><td><pre>!!! caught exception ("Expected command; instead got nothing from ''", None) while processing ebuild src: dev-libs/eet-1.2.1 -</pre></td><td>[FATAL]</td></tr> - <tr class="" id="l66"><td><a href="#l66"><span>66</span></a></td><td><pre>Traceback (most recent call last): + <tr class="" id="l65"><td><a href="#l65"><span>65</span></a></td><td><pre>Traceback (most recent call last): </pre></td></tr> - <tr class="" id="l67"><td><a href="#l67"><span>67</span></a></td><td><pre> File "/home/mgorny/pkgcore-venv/bin/pmaint", line 4, in <module> + <tr class="" id="l66"><td><a href="#l66"><span>66</span></a></td><td><pre> File "/home/mgorny/pkgcore-venv/bin/pmaint", line 4, in <module> </pre></td></tr> - <tr class="" id="l68"><td><a href="#l68"><span>68</span></a></td><td><pre> scripts.main(basename(__file__)) + <tr class="" id="l67"><td><a href="#l67"><span>67</span></a></td><td><pre> scripts.main(basename(__file__)) </pre></td></tr> - <tr class="" id="l69"><td><a href="#l69"><span>69</span></a></td><td><pre> File "/home/mgorny/pkgcore-venv/lib/python2.7/site-packages/pkgcore/scripts/__init__.py", line 42, in main + <tr class="" id="l68"><td><a href="#l68"><span>68</span></a></td><td><pre> File "/home/mgorny/pkgcore-venv/lib/python2.7/site-packages/pkgcore/scripts/__init__.py", line 42, in main </pre></td></tr> - <tr class="" id="l70"><td><a href="#l70"><span>70</span></a></td><td><pre> commandline.main(argparser) + <tr class="" id="l69"><td><a href="#l69"><span>69</span></a></td><td><pre> commandline.main(argparser) </pre></td></tr> - <tr class="" id="l71"><td><a href="#l71"><span>71</span></a></td><td><pre> File "/home/mgorny/pkgcore-venv/lib/python2.7/site-packages/pkgcore/util/commandline.py", line 983, in main + <tr class="" id="l70"><td><a href="#l70"><span>70</span></a></td><td><pre> File "/home/mgorny/pkgcore-venv/lib/python2.7/site-packages/pkgcore/util/commandline.py", line 983, in main </pre></td></tr> - <tr class="" id="l72"><td><a href="#l72"><span>72</span></a></td><td><pre> exitstatus = main_func(options, out, err) + <tr class="" id="l71"><td><a href="#l71"><span>71</span></a></td><td><pre> exitstatus = main_func(options, out, err) </pre></td></tr> - <tr class="" id="l73"><td><a href="#l73"><span>73</span></a></td><td><pre> File "/home/mgorny/pkgcore-venv/lib/python2.7/site-packages/pkgcore/scripts/pmaint.py", line 286, in regen_main + <tr class="" id="l72"><td><a href="#l72"><span>72</span></a></td><td><pre> File "/home/mgorny/pkgcore-venv/lib/python2.7/site-packages/pkgcore/scripts/pmaint.py", line 286, in regen_main </pre></td></tr> - <tr class="" id="l74"><td><a href="#l74"><span>74</span></a></td><td><pre> eclass_caching=(not options.disable_eclass_caching)) + <tr class="" id="l73"><td><a href="#l73"><span>73</span></a></td><td><pre> eclass_caching=(not options.disable_eclass_caching)) </pre></td></tr> - <tr class="" id="l75"><td><a href="#l75"><span>75</span></a></td><td><pre> File "/home/mgorny/pkgcore-venv/lib/python2.7/site-packages/pkgcore/operations/__init__.py", line 68, in _recast_exception_decorator + <tr class="" id="l74"><td><a href="#l74"><span>74</span></a></td><td><pre> File "/home/mgorny/pkgcore-venv/lib/python2.7/site-packages/pkgcore/operations/__init__.py", line 68, in _recast_exception_decorator </pre></td></tr> - <tr class="" id="l76"><td><a href="#l76"><span>76</span></a></td><td><pre> return functor(*args, **kwds) + <tr class="" id="l75"><td><a href="#l75"><span>75</span></a></td><td><pre> return functor(*args, **kwds) </pre></td></tr> - <tr class="" id="l77"><td><a href="#l77"><span>77</span></a></td><td><pre> File "/home/mgorny/pkgcore-venv/lib/python2.7/site-packages/pkgcore/operations/repo.py", line 247, in _cmd_api_regen_cache + <tr class="" id="l76"><td><a href="#l76"><span>76</span></a></td><td><pre> File "/home/mgorny/pkgcore-venv/lib/python2.7/site-packages/pkgcore/operations/repo.py", line 247, in _cmd_api_regen_cache </pre></td></tr> - <tr class="" id="l78"><td><a href="#l78"><span>78</span></a></td><td><pre> self._get_observer(observer), threads=threads, **options) + <tr class="" id="l77"><td><a href="#l77"><span>77</span></a></td><td><pre> self._get_observer(observer), threads=threads, **options) </pre></td></tr> - <tr class="" id="l79"><td><a href="#l79"><span>79</span></a></td><td><pre> File "/home/mgorny/pkgcore-venv/lib/python2.7/site-packages/pkgcore/operations/regen.py", line 37, in regen_repository + <tr class="" id="l78"><td><a href="#l78"><span>78</span></a></td><td><pre> File "/home/mgorny/pkgcore-venv/lib/python2.7/site-packages/pkgcore/operations/regen.py", line 37, in regen_repository </pre></td></tr> - <tr class="" id="l80"><td><a href="#l80"><span>80</span></a></td><td><pre> regen_iter(iter(repo), _get_repo_helper(), observer) + <tr class="" id="l79"><td><a href="#l79"><span>79</span></a></td><td><pre> regen_iter(iter(repo), _get_repo_helper(), observer) </pre></td></tr> - <tr class="" id="l81"><td><a href="#l81"><span>81</span></a></td><td><pre> File "/home/mgorny/pkgcore-venv/lib/python2.7/site-packages/pkgcore/operations/regen.py", line 15, in regen_iter + <tr class="" id="l80"><td><a href="#l80"><span>80</span></a></td><td><pre> File "/home/mgorny/pkgcore-venv/lib/python2.7/site-packages/pkgcore/operations/regen.py", line 15, in regen_iter </pre></td></tr> - <tr class="" id="l82"><td><a href="#l82"><span>82</span></a></td><td><pre> regen_func(x) + <tr class="" id="l81"><td><a href="#l81"><span>81</span></a></td><td><pre> regen_func(x) </pre></td></tr> - <tr class="" id="l83"><td><a href="#l83"><span>83</span></a></td><td><pre> File "/home/mgorny/pkgcore-venv/lib/python2.7/site-packages/pkgcore/ebuild/repository.py", line 520, in __call__ + <tr class="" id="l82"><td><a href="#l82"><span>82</span></a></td><td><pre> File "/home/mgorny/pkgcore-venv/lib/python2.7/site-packages/pkgcore/ebuild/repository.py", line 520, in __call__ </pre></td></tr> - <tr class="" id="l84"><td><a href="#l84"><span>84</span></a></td><td><pre> return pkg._fetch_metadata(ebp=self.ebp, force_regen=self.force) + <tr class="" id="l83"><td><a href="#l83"><span>83</span></a></td><td><pre> return pkg._fetch_metadata(ebp=self.ebp, force_regen=self.force) </pre></td></tr> - <tr class="" id="l85"><td><a href="#l85"><span>85</span></a></td><td><pre> File "/home/mgorny/pkgcore-venv/lib/python2.7/site-packages/pkgcore/ebuild/ebuild_src.py", line 277, in _fetch_metadata + <tr class="" id="l84"><td><a href="#l84"><span>84</span></a></td><td><pre> File "/home/mgorny/pkgcore-venv/lib/python2.7/site-packages/pkgcore/ebuild/ebuild_src.py", line 277, in _fetch_metadata </pre></td></tr> - <tr class="" id="l86"><td><a href="#l86"><span>86</span></a></td><td><pre> return self._parent._get_metadata(self, ebp=ebp, force_regen=force_regen) + <tr class="" id="l85"><td><a href="#l85"><span>85</span></a></td><td><pre> return self._parent._get_metadata(self, ebp=ebp, force_regen=force_regen) </pre></td></tr> - <tr class="" id="l87"><td><a href="#l87"><span>87</span></a></td><td><pre> File "/home/mgorny/pkgcore-venv/lib/python2.7/site-packages/pkgcore/ebuild/ebuild_src.py", line 366, in _get_metadata + <tr class="" id="l86"><td><a href="#l86"><span>86</span></a></td><td><pre> File "/home/mgorny/pkgcore-venv/lib/python2.7/site-packages/pkgcore/ebuild/ebuild_src.py", line 366, in _get_metadata </pre></td></tr> - <tr class="" id="l88"><td><a href="#l88"><span>88</span></a></td><td><pre> return self._update_metadata(pkg, ebp=ebp) + <tr class="" id="l87"><td><a href="#l87"><span>87</span></a></td><td><pre> return self._update_metadata(pkg, ebp=ebp) </pre></td></tr> - <tr class="" id="l89"><td><a href="#l89"><span>89</span></a></td><td><pre> File "/home/mgorny/pkgcore-venv/lib/python2.7/site-packages/pkgcore/ebuild/ebuild_src.py", line 374, in _update_metadata + <tr class="" id="l88"><td><a href="#l88"><span>88</span></a></td><td><pre> File "/home/mgorny/pkgcore-venv/lib/python2.7/site-packages/pkgcore/ebuild/ebuild_src.py", line 374, in _update_metadata </pre></td></tr> - <tr class="" id="l90"><td><a href="#l90"><span>90</span></a></td><td><pre> mydata = my_proc.get_keys(pkg, self._ecache) + <tr class="" id="l89"><td><a href="#l89"><span>89</span></a></td><td><pre> mydata = my_proc.get_keys(pkg, self._ecache) </pre></td></tr> - <tr class="" id="l91"><td><a href="#l91"><span>91</span></a></td><td><pre> File "/home/mgorny/pkgcore-venv/lib/python2.7/site-packages/pkgcore/ebuild/processor.py", line 788, in get_keys + <tr class="" id="l90"><td><a href="#l90"><span>90</span></a></td><td><pre> File "/home/mgorny/pkgcore-venv/lib/python2.7/site-packages/pkgcore/ebuild/processor.py", line 788, in get_keys </pre></td></tr> - <tr class="" id="l92"><td><a href="#l92"><span>92</span></a></td><td><pre> {"key": receive_key}) + <tr class="" id="l91"><td><a href="#l91"><span>91</span></a></td><td><pre> {"key": receive_key}) </pre></td></tr> - <tr class="" id="l93"><td><a href="#l93"><span>93</span></a></td><td><pre> File "/home/mgorny/pkgcore-venv/lib/python2.7/site-packages/pkgcore/ebuild/processor.py", line 721, in _run_depend_like_phase + <tr class="" id="l92"><td><a href="#l92"><span>92</span></a></td><td><pre> File "/home/mgorny/pkgcore-venv/lib/python2.7/site-packages/pkgcore/ebuild/processor.py", line 721, in _run_depend_like_phase </pre></td></tr> - <tr class="" id="l94"><td><a href="#l94"><span>94</span></a></td><td><pre> self.write("%s %i\n%s" % (command, len(data), data), append_newline=False) + <tr class="" id="l93"><td><a href="#l93"><span>93</span></a></td><td><pre> self.write("%s %i\n%s" % (command, len(data), data), append_newline=False) </pre></td></tr> - <tr class="" id="l95"><td><a href="#l95"><span>95</span></a></td><td><pre> File "/home/mgorny/pkgcore-venv/lib/python2.7/site-packages/pkgcore/ebuild/processor.py", line 419, in write + <tr class="" id="l94"><td><a href="#l94"><span>94</span></a></td><td><pre> File "/home/mgorny/pkgcore-venv/lib/python2.7/site-packages/pkgcore/ebuild/processor.py", line 419, in write </pre></td></tr> - <tr class="" id="l96"><td><a href="#l96"><span>96</span></a></td><td><pre> raise RuntimeError(ie) + <tr class="" id="l95"><td><a href="#l95"><span>95</span></a></td><td><pre> raise RuntimeError(ie) </pre></td></tr> - <tr class="" id="l97"><td><a href="#l97"><span>97</span></a></td><td><pre>RuntimeError: [Errno 32] Broken pipe + <tr class="" id="l96"><td><a href="#l96"><span>96</span></a></td><td><pre>RuntimeError: [Errno 32] Broken pipe </pre></td></tr> - <tr class="" id="l98"><td><a href="#l98"><span>98</span></a></td><td><pre> * Cache regen failed with 1 + <tr class="" id="l97"><td><a href="#l97"><span>97</span></a></td><td><pre> * Cache regen failed with 1 </pre></td></tr> </table> diff --git a/embedded-cross.txt b/embedded-cross.txt index 96db8559bd3b..50a10e248f84 100644 --- a/embedded-cross.txt +++ b/embedded-cross.txt @@ -62,7 +62,6 @@ ERROR pkgcore: returned val from gen_metadata was 'False' !!! caught exception False while processing ebuild src: dev-libs/dbus-glib-0.82 ERROR pkgcore: returned val from gen_metadata was 'False' !!! caught exception False while processing ebuild src: dev-libs/dbus-glib-0.86 -!!! caught exception ("Expected command; instead got nothing from ''", None) while processing ebuild src: dev-libs/eet-1.2.1 Traceback (most recent call last): File "/home/mgorny/pkgcore-venv/bin/pmaint", line 4, in <module> scripts.main(basename(__file__)) diff --git a/ephemeral.html b/ephemeral.html index 0ab5ebe0d44e..dd051e6c81e7 100644 --- a/ephemeral.html +++ b/ephemeral.html @@ -764,27 +764,27 @@ </pre></td><td>[FATAL]</td></tr> <tr class="" id="l377"><td><a href="#l377"><span>377</span></a></td><td><pre>ERROR pkgcore: returned val from gen_metadata was 'False' </pre></td></tr> - <tr class="err" id="l378"><td><a href="#l378"><span>378</span></a></td><td><pre>caught exception '%s' while processing '%s'(MetadataException('Metadata Exception: pkg ebuild src: app-emulation/virt-v2v-0.8.9-r1, attr description\nerror: Metadata Exception: pkg ebuild src: app-emulation/virt-v2v-0.8.9-r1, attr data\nerror: False',), <<class 'pkgcore.ebuild.ebuild_src.package'> cpv='app-emulation/virt-v2v-0.8.9-r1' @0x7fde905d3a50>) + <tr class="err" id="l378"><td><a href="#l378"><span>378</span></a></td><td><pre>caught exception '%s' while processing '%s'(MetadataException('Metadata Exception: pkg ebuild src: app-emulation/virt-v2v-0.8.9-r1, attr description\nerror: Metadata Exception: pkg ebuild src: app-emulation/virt-v2v-0.8.9-r1, attr data\nerror: False',), <<class 'pkgcore.ebuild.ebuild_src.package'> cpv='app-emulation/virt-v2v-0.8.9-r1' @0x7fbbe7380a50>) </pre></td><td>[FATAL]</td></tr> <tr class="" id="l379"><td><a href="#l379"><span>379</span></a></td><td><pre>ERROR pkgcore: returned val from gen_metadata was 'False' </pre></td></tr> - <tr class="err" id="l380"><td><a href="#l380"><span>380</span></a></td><td><pre>caught exception '%s' while processing '%s'(MetadataException('Metadata Exception: pkg ebuild src: app-emulation/virt-v2v-0.9.0, attr description\nerror: Metadata Exception: pkg ebuild src: app-emulation/virt-v2v-0.9.0, attr data\nerror: False',), <<class 'pkgcore.ebuild.ebuild_src.package'> cpv='app-emulation/virt-v2v-0.9.0' @0x7fde905d3b90>) + <tr class="err" id="l380"><td><a href="#l380"><span>380</span></a></td><td><pre>caught exception '%s' while processing '%s'(MetadataException('Metadata Exception: pkg ebuild src: app-emulation/virt-v2v-0.9.0, attr description\nerror: Metadata Exception: pkg ebuild src: app-emulation/virt-v2v-0.9.0, attr data\nerror: False',), <<class 'pkgcore.ebuild.ebuild_src.package'> cpv='app-emulation/virt-v2v-0.9.0' @0x7fbbe7380b90>) </pre></td><td>[FATAL]</td></tr> <tr class="" id="l381"><td><a href="#l381"><span>381</span></a></td><td><pre>ERROR pkgcore: returned val from gen_metadata was 'False' </pre></td></tr> - <tr class="err" id="l382"><td><a href="#l382"><span>382</span></a></td><td><pre>caught exception '%s' while processing '%s'(MetadataException('Metadata Exception: pkg ebuild src: dev-libs/libconcord-0.23, attr description\nerror: Metadata Exception: pkg ebuild src: dev-libs/libconcord-0.23, attr data\nerror: False',), <<class 'pkgcore.ebuild.ebuild_src.package'> cpv='dev-libs/libconcord-0.23' @0x7fde905d3190>) + <tr class="err" id="l382"><td><a href="#l382"><span>382</span></a></td><td><pre>caught exception '%s' while processing '%s'(MetadataException('Metadata Exception: pkg ebuild src: dev-libs/libconcord-0.23, attr description\nerror: Metadata Exception: pkg ebuild src: dev-libs/libconcord-0.23, attr data\nerror: False',), <<class 'pkgcore.ebuild.ebuild_src.package'> cpv='dev-libs/libconcord-0.23' @0x7fbbe7380190>) </pre></td><td>[FATAL]</td></tr> <tr class="" id="l383"><td><a href="#l383"><span>383</span></a></td><td><pre>ERROR pkgcore: returned val from gen_metadata was 'False' </pre></td></tr> - <tr class="err" id="l384"><td><a href="#l384"><span>384</span></a></td><td><pre>caught exception '%s' while processing '%s'(MetadataException('Metadata Exception: pkg ebuild src: dev-libs/libconcord-0.24, attr description\nerror: Metadata Exception: pkg ebuild src: dev-libs/libconcord-0.24, attr data\nerror: False',), <<class 'pkgcore.ebuild.ebuild_src.package'> cpv='dev-libs/libconcord-0.24' @0x7fde905d3b90>) + <tr class="err" id="l384"><td><a href="#l384"><span>384</span></a></td><td><pre>caught exception '%s' while processing '%s'(MetadataException('Metadata Exception: pkg ebuild src: dev-libs/libconcord-0.24, attr description\nerror: Metadata Exception: pkg ebuild src: dev-libs/libconcord-0.24, attr data\nerror: False',), <<class 'pkgcore.ebuild.ebuild_src.package'> cpv='dev-libs/libconcord-0.24' @0x7fbbe7380b90>) </pre></td><td>[FATAL]</td></tr> <tr class="" id="l385"><td><a href="#l385"><span>385</span></a></td><td><pre>ERROR pkgcore: returned val from gen_metadata was 'False' </pre></td></tr> - <tr class="err" id="l386"><td><a href="#l386"><span>386</span></a></td><td><pre>caught exception '%s' while processing '%s'(MetadataException('Metadata Exception: pkg ebuild src: media-sound/phonoripper-0.10.1-r3, attr description\nerror: Metadata Exception: pkg ebuild src: media-sound/phonoripper-0.10.1-r3, attr data\nerror: False',), <<class 'pkgcore.ebuild.ebuild_src.package'> cpv='media-sound/phonoripper-0.10.1-r3' @0x7fde9012db90>) + <tr class="err" id="l386"><td><a href="#l386"><span>386</span></a></td><td><pre>caught exception '%s' while processing '%s'(MetadataException('Metadata Exception: pkg ebuild src: media-sound/phonoripper-0.10.1-r3, attr description\nerror: Metadata Exception: pkg ebuild src: media-sound/phonoripper-0.10.1-r3, attr data\nerror: False',), <<class 'pkgcore.ebuild.ebuild_src.package'> cpv='media-sound/phonoripper-0.10.1-r3' @0x7fbbe6edab90>) </pre></td><td>[FATAL]</td></tr> <tr class="" id="l387"><td><a href="#l387"><span>387</span></a></td><td><pre>ERROR pkgcore: returned val from gen_metadata was 'False' </pre></td></tr> - <tr class="err" id="l388"><td><a href="#l388"><span>388</span></a></td><td><pre>caught exception '%s' while processing '%s'(MetadataException('Metadata Exception: pkg ebuild src: dev-perl/Archive-Extract-0.72, attr description\nerror: Metadata Exception: pkg ebuild src: dev-perl/Archive-Extract-0.72, attr data\nerror: False',), <<class 'pkgcore.ebuild.ebuild_src.package'> cpv='dev-perl/Archive-Extract-0.72' @0x7fde90136050>) + <tr class="err" id="l388"><td><a href="#l388"><span>388</span></a></td><td><pre>caught exception '%s' while processing '%s'(MetadataException('Metadata Exception: pkg ebuild src: dev-perl/Archive-Extract-0.72, attr description\nerror: Metadata Exception: pkg ebuild src: dev-perl/Archive-Extract-0.72, attr data\nerror: False',), <<class 'pkgcore.ebuild.ebuild_src.package'> cpv='dev-perl/Archive-Extract-0.72' @0x7fbbe6ee3050>) </pre></td><td>[FATAL]</td></tr> <tr class="" id="l389"><td><a href="#l389"><span>389</span></a></td><td><pre>ERROR pkgcore: returned val from gen_metadata was 'False' </pre></td></tr> @@ -864,15 +864,15 @@ </pre></td></tr> <tr class="" id="l427"><td><a href="#l427"><span>427</span></a></td><td><pre> </pre></td></tr> - <tr class="" id="l428"><td><a href="#l428"><span>428</span></a></td><td><pre>erl/DateTime-Format-Epoch-0.13' @0x7fde9012db90>) + <tr class="" id="l428"><td><a href="#l428"><span>428</span></a></td><td><pre>erl/DateTime-Format-Epoch-0.13' @0x7fbbe6edab90>) </pre></td></tr> <tr class="" id="l429"><td><a href="#l429"><span>429</span></a></td><td><pre>ERROR pkgcore: returned val from gen_metadata was 'False' </pre></td></tr> - <tr class="err" id="l430"><td><a href="#l430"><span>430</span></a></td><td><pre>caught exception '%s' while processing '%s'(MetadataException('Metadata Exception: pkg ebuild src: dev-perl/Proc-ParallelLoop-0.5, attr description\nerror: Metadata Exception: pkg ebuild src: dev-perl/Proc-ParallelLoop-0.5, attr data\nerror: False',), <<class 'pkgcore.ebuild.ebuild_src.package'> cpv='dev-perl/Proc-ParallelLoop-0.5' @0x7fde90136050>) + <tr class="err" id="l430"><td><a href="#l430"><span>430</span></a></td><td><pre>caught exception '%s' while processing '%s'(MetadataException('Metadata Exception: pkg ebuild src: dev-perl/Proc-ParallelLoop-0.5, attr description\nerror: Metadata Exception: pkg ebuild src: dev-perl/Proc-ParallelLoop-0.5, attr data\nerror: False',), <<class 'pkgcore.ebuild.ebuild_src.package'> cpv='dev-perl/Proc-ParallelLoop-0.5' @0x7fbbe6ee3050>) </pre></td><td>[FATAL]</td></tr> <tr class="" id="l431"><td><a href="#l431"><span>431</span></a></td><td><pre>ERROR pkgcore: returned val from gen_metadata was 'False' </pre></td></tr> - <tr class="err" id="l432"><td><a href="#l432"><span>432</span></a></td><td><pre>caught exception '%s' while processing '%s'(MetadataException('Metadata Exception: pkg ebuild src: dev-perl/Term-Prompt-1.04, attr description\nerror: Metadata Exception: pkg ebuild src: dev-perl/Term-Prompt-1.04, attr data\nerror: False',), <<class 'pkgcore.ebuild.ebuild_src.package'> cpv='dev-perl/Term-Prompt-1.04' @0x7fde9012db90>) + <tr class="err" id="l432"><td><a href="#l432"><span>432</span></a></td><td><pre>caught exception '%s' while processing '%s'(MetadataException('Metadata Exception: pkg ebuild src: dev-perl/Term-Prompt-1.04, attr description\nerror: Metadata Exception: pkg ebuild src: dev-perl/Term-Prompt-1.04, attr data\nerror: False',), <<class 'pkgcore.ebuild.ebuild_src.package'> cpv='dev-perl/Term-Prompt-1.04' @0x7fbbe6edab90>) </pre></td><td>[FATAL]</td></tr> <tr class="" id="l433"><td><a href="#l433"><span>433</span></a></td><td><pre> * Cache regen failed with 1 </pre></td></tr> diff --git a/ephemeral.txt b/ephemeral.txt index 6610d773c267..1fff4ed23d0f 100644 --- a/ephemeral.txt +++ b/ephemeral.txt @@ -375,17 +375,17 @@ ERROR pkgcore: returned val from gen_metadata was 'False' ERROR pkgcore: returned val from gen_metadata was 'False' !!! caught exception False while processing ebuild src: dev-perl/Term-Prompt-1.04 ERROR pkgcore: returned val from gen_metadata was 'False' -caught exception '%s' while processing '%s'(MetadataException('Metadata Exception: pkg ebuild src: app-emulation/virt-v2v-0.8.9-r1, attr description\nerror: Metadata Exception: pkg ebuild src: app-emulation/virt-v2v-0.8.9-r1, attr data\nerror: False',), <<class 'pkgcore.ebuild.ebuild_src.package'> cpv='app-emulation/virt-v2v-0.8.9-r1' @0x7fde905d3a50>) +caught exception '%s' while processing '%s'(MetadataException('Metadata Exception: pkg ebuild src: app-emulation/virt-v2v-0.8.9-r1, attr description\nerror: Metadata Exception: pkg ebuild src: app-emulation/virt-v2v-0.8.9-r1, attr data\nerror: False',), <<class 'pkgcore.ebuild.ebuild_src.package'> cpv='app-emulation/virt-v2v-0.8.9-r1' @0x7fbbe7380a50>) ERROR pkgcore: returned val from gen_metadata was 'False' -caught exception '%s' while processing '%s'(MetadataException('Metadata Exception: pkg ebuild src: app-emulation/virt-v2v-0.9.0, attr description\nerror: Metadata Exception: pkg ebuild src: app-emulation/virt-v2v-0.9.0, attr data\nerror: False',), <<class 'pkgcore.ebuild.ebuild_src.package'> cpv='app-emulation/virt-v2v-0.9.0' @0x7fde905d3b90>) +caught exception '%s' while processing '%s'(MetadataException('Metadata Exception: pkg ebuild src: app-emulation/virt-v2v-0.9.0, attr description\nerror: Metadata Exception: pkg ebuild src: app-emulation/virt-v2v-0.9.0, attr data\nerror: False',), <<class 'pkgcore.ebuild.ebuild_src.package'> cpv='app-emulation/virt-v2v-0.9.0' @0x7fbbe7380b90>) ERROR pkgcore: returned val from gen_metadata was 'False' -caught exception '%s' while processing '%s'(MetadataException('Metadata Exception: pkg ebuild src: dev-libs/libconcord-0.23, attr description\nerror: Metadata Exception: pkg ebuild src: dev-libs/libconcord-0.23, attr data\nerror: False',), <<class 'pkgcore.ebuild.ebuild_src.package'> cpv='dev-libs/libconcord-0.23' @0x7fde905d3190>) +caught exception '%s' while processing '%s'(MetadataException('Metadata Exception: pkg ebuild src: dev-libs/libconcord-0.23, attr description\nerror: Metadata Exception: pkg ebuild src: dev-libs/libconcord-0.23, attr data\nerror: False',), <<class 'pkgcore.ebuild.ebuild_src.package'> cpv='dev-libs/libconcord-0.23' @0x7fbbe7380190>) ERROR pkgcore: returned val from gen_metadata was 'False' -caught exception '%s' while processing '%s'(MetadataException('Metadata Exception: pkg ebuild src: dev-libs/libconcord-0.24, attr description\nerror: Metadata Exception: pkg ebuild src: dev-libs/libconcord-0.24, attr data\nerror: False',), <<class 'pkgcore.ebuild.ebuild_src.package'> cpv='dev-libs/libconcord-0.24' @0x7fde905d3b90>) +caught exception '%s' while processing '%s'(MetadataException('Metadata Exception: pkg ebuild src: dev-libs/libconcord-0.24, attr description\nerror: Metadata Exception: pkg ebuild src: dev-libs/libconcord-0.24, attr data\nerror: False',), <<class 'pkgcore.ebuild.ebuild_src.package'> cpv='dev-libs/libconcord-0.24' @0x7fbbe7380b90>) ERROR pkgcore: returned val from gen_metadata was 'False' -caught exception '%s' while processing '%s'(MetadataException('Metadata Exception: pkg ebuild src: media-sound/phonoripper-0.10.1-r3, attr description\nerror: Metadata Exception: pkg ebuild src: media-sound/phonoripper-0.10.1-r3, attr data\nerror: False',), <<class 'pkgcore.ebuild.ebuild_src.package'> cpv='media-sound/phonoripper-0.10.1-r3' @0x7fde9012db90>) +caught exception '%s' while processing '%s'(MetadataException('Metadata Exception: pkg ebuild src: media-sound/phonoripper-0.10.1-r3, attr description\nerror: Metadata Exception: pkg ebuild src: media-sound/phonoripper-0.10.1-r3, attr data\nerror: False',), <<class 'pkgcore.ebuild.ebuild_src.package'> cpv='media-sound/phonoripper-0.10.1-r3' @0x7fbbe6edab90>) ERROR pkgcore: returned val from gen_metadata was 'False' -caught exception '%s' while processing '%s'(MetadataException('Metadata Exception: pkg ebuild src: dev-perl/Archive-Extract-0.72, attr description\nerror: Metadata Exception: pkg ebuild src: dev-perl/Archive-Extract-0.72, attr data\nerror: False',), <<class 'pkgcore.ebuild.ebuild_src.package'> cpv='dev-perl/Archive-Extract-0.72' @0x7fde90136050>) +caught exception '%s' while processing '%s'(MetadataException('Metadata Exception: pkg ebuild src: dev-perl/Archive-Extract-0.72, attr description\nerror: Metadata Exception: pkg ebuild src: dev-perl/Archive-Extract-0.72, attr data\nerror: False',), <<class 'pkgcore.ebuild.ebuild_src.package'> cpv='dev-perl/Archive-Extract-0.72' @0x7fbbe6ee3050>) ERROR pkgcore: returned val from gen_metadata was 'False' caught exception '%s' while processing '%s'(MetadataException('Metadata Exception: pkg ebuild src: dev-perl/DateTime-Format-Epoch-0.13, attr description\nerror: Metadata Exception: pkg ebuild src: dev-perl/DateTime-Format-Epoch-0.13, attr data\nerror: False',), <<class 'pkgcore.ebuild.ebuild_src.package'> cpv='dev-p !!! ERROR: dev-perl/Proc-ParallelLoop-0.5 failed. @@ -425,9 +425,9 @@ caught exception '%s' while processing '%s'(MetadataException('Metadata Exceptio !!! The die message: !!! EAPI= is not supported by perl-module.eclass -erl/DateTime-Format-Epoch-0.13' @0x7fde9012db90>) +erl/DateTime-Format-Epoch-0.13' @0x7fbbe6edab90>) ERROR pkgcore: returned val from gen_metadata was 'False' -caught exception '%s' while processing '%s'(MetadataException('Metadata Exception: pkg ebuild src: dev-perl/Proc-ParallelLoop-0.5, attr description\nerror: Metadata Exception: pkg ebuild src: dev-perl/Proc-ParallelLoop-0.5, attr data\nerror: False',), <<class 'pkgcore.ebuild.ebuild_src.package'> cpv='dev-perl/Proc-ParallelLoop-0.5' @0x7fde90136050>) +caught exception '%s' while processing '%s'(MetadataException('Metadata Exception: pkg ebuild src: dev-perl/Proc-ParallelLoop-0.5, attr description\nerror: Metadata Exception: pkg ebuild src: dev-perl/Proc-ParallelLoop-0.5, attr data\nerror: False',), <<class 'pkgcore.ebuild.ebuild_src.package'> cpv='dev-perl/Proc-ParallelLoop-0.5' @0x7fbbe6ee3050>) ERROR pkgcore: returned val from gen_metadata was 'False' -caught exception '%s' while processing '%s'(MetadataException('Metadata Exception: pkg ebuild src: dev-perl/Term-Prompt-1.04, attr description\nerror: Metadata Exception: pkg ebuild src: dev-perl/Term-Prompt-1.04, attr data\nerror: False',), <<class 'pkgcore.ebuild.ebuild_src.package'> cpv='dev-perl/Term-Prompt-1.04' @0x7fde9012db90>) +caught exception '%s' while processing '%s'(MetadataException('Metadata Exception: pkg ebuild src: dev-perl/Term-Prompt-1.04, attr description\nerror: Metadata Exception: pkg ebuild src: dev-perl/Term-Prompt-1.04, attr data\nerror: False',), <<class 'pkgcore.ebuild.ebuild_src.package'> cpv='dev-perl/Term-Prompt-1.04' @0x7fbbe6edab90>) * Cache regen failed with 1 diff --git a/fidonet.html b/fidonet.html index baf737704da2..c23a09906ed7 100644 --- a/fidonet.html +++ b/fidonet.html @@ -70,7 +70,7 @@ </pre></td></tr> <tr class="" id="l30"><td><a href="#l30"><span>30</span></a></td><td><pre> </pre></td></tr> - <tr class="" id="l31"><td><a href="#l31"><span>31</span></a></td><td><pre>sent 85 bytes received 127 bytes 84.80 bytes/sec + <tr class="" id="l31"><td><a href="#l31"><span>31</span></a></td><td><pre>sent 85 bytes received 127 bytes 141.33 bytes/sec </pre></td></tr> <tr class="" id="l32"><td><a href="#l32"><span>32</span></a></td><td><pre>total size is 32 speedup is 0.15 </pre></td></tr> diff --git a/fidonet.txt b/fidonet.txt index 3af277438534..4df426f5ad74 100644 --- a/fidonet.txt +++ b/fidonet.txt @@ -28,7 +28,7 @@ File list transfer time: 0.000 seconds Total bytes sent: 85 Total bytes received: 127 -sent 85 bytes received 127 bytes 84.80 bytes/sec +sent 85 bytes received 127 bytes 141.33 bytes/sec total size is 32 speedup is 0.15 *** syncing fidonet *** synced fidonet diff --git a/gbin.html b/gbin.html index 7927f01081cc..61f1688ffe36 100644 --- a/gbin.html +++ b/gbin.html @@ -234,13 +234,13 @@ </pre></td></tr> <tr class="" id="l112"><td><a href="#l112"><span>112</span></a></td><td><pre>ERROR pkgcore: returned val from gen_metadata was 'False' </pre></td></tr> - <tr class="err" id="l113"><td><a href="#l113"><span>113</span></a></td><td><pre>caught exception '%s' while processing '%s'(MetadataException('Metadata Exception: pkg ebuild src: games-board/gogui-1.4.6, attr description\nerror: Metadata Exception: pkg ebuild src: games-board/gogui-1.4.6, attr data\nerror: False',), <<class 'pkgcore.ebuild.ebuild_src.package'> cpv='games-board/gogui-1.4.6' @0x7fde96b64550>) + <tr class="err" id="l113"><td><a href="#l113"><span>113</span></a></td><td><pre>caught exception '%s' while processing '%s'(MetadataException('Metadata Exception: pkg ebuild src: games-board/gogui-1.4.6, attr description\nerror: Metadata Exception: pkg ebuild src: games-board/gogui-1.4.6, attr data\nerror: False',), <<class 'pkgcore.ebuild.ebuild_src.package'> cpv='games-board/gogui-1.4.6' @0x7f4ec88f8550>) </pre></td><td>[FATAL]</td></tr> <tr class="" id="l114"><td><a href="#l114"><span>114</span></a></td><td><pre>ERROR pkgcore: returned val from gen_metadata was 'False' </pre></td></tr> - <tr class="err" id="l115"><td><a href="#l115"><span>115</span></a></td><td><pre>caught exception '%s' while processing '%s'(MetadataException('Metadata Exception: pkg ebuild src: media-tv/xmltv-0.5.61, attr description\nerror: Metadata Exception: pkg ebuild src: media-tv/xmltv-0.5.61, attr data\nerror: False',), <<class 'pkgcore.ebuild.ebuild_src.package'> cpv='media-tv/xmltv-0.5.61' @0x7fde966bca50>) + <tr class="err" id="l115"><td><a href="#l115"><span>115</span></a></td><td><pre>caught exception '%s' while processing '%s'(MetadataException('Metadata Exception: pkg ebuild src: media-tv/xmltv-0.5.61, attr description\nerror: Metadata Exception: pkg ebuild src: media-tv/xmltv-0.5.61, attr data\nerror: False',), <<class 'pkgcore.ebuild.ebuild_src.package'> cpv='media-tv/xmltv-0.5.61' @0x7f4ec8450a50>) </pre></td><td>[FATAL]</td></tr> - <tr class="err" id="l116"><td><a href="#l116"><span>116</span></a></td><td><pre>caught exception '%s' while processing '%s'(MetadataException("Metadata Exception: pkg ebuild src: app-crypt/whitepixel-2, attr description\nerror: Metadata Exception: pkg ebuild src: app-crypt/whitepixel-2, attr data\nerror: Metadata Exception: pkg ebuild src: app-crypt/whitepixel-2, attr eapi\nerror: parsed eapi '0' doesn't match sourced eapi '3'",), <<class 'pkgcore.ebuild.ebuild_src.package'> cpv='app-crypt/whitepixel-2' @0x7fde966c9190>) + <tr class="err" id="l116"><td><a href="#l116"><span>116</span></a></td><td><pre>caught exception '%s' while processing '%s'(MetadataException("Metadata Exception: pkg ebuild src: app-crypt/whitepixel-2, attr description\nerror: Metadata Exception: pkg ebuild src: app-crypt/whitepixel-2, attr data\nerror: Metadata Exception: pkg ebuild src: app-crypt/whitepixel-2, attr eapi\nerror: parsed eapi '0' doesn't match sourced eapi '3'",), <<class 'pkgcore.ebuild.ebuild_src.package'> cpv='app-crypt/whitepixel-2' @0x7f4ec845d190>) </pre></td><td>[FATAL]</td></tr> <tr class="" id="l117"><td><a href="#l117"><span>117</span></a></td><td><pre> * Cache regen failed with 1 </pre></td></tr> @@ -110,8 +110,8 @@ ERROR pkgcore: returned val from gen_metadata was 'False' !!! caught exception Metadata Exception: pkg ebuild src: app-crypt/whitepixel-2, attr eapi error: parsed eapi '0' doesn't match sourced eapi '3' while processing ebuild src: app-crypt/whitepixel-2 ERROR pkgcore: returned val from gen_metadata was 'False' -caught exception '%s' while processing '%s'(MetadataException('Metadata Exception: pkg ebuild src: games-board/gogui-1.4.6, attr description\nerror: Metadata Exception: pkg ebuild src: games-board/gogui-1.4.6, attr data\nerror: False',), <<class 'pkgcore.ebuild.ebuild_src.package'> cpv='games-board/gogui-1.4.6' @0x7fde96b64550>) +caught exception '%s' while processing '%s'(MetadataException('Metadata Exception: pkg ebuild src: games-board/gogui-1.4.6, attr description\nerror: Metadata Exception: pkg ebuild src: games-board/gogui-1.4.6, attr data\nerror: False',), <<class 'pkgcore.ebuild.ebuild_src.package'> cpv='games-board/gogui-1.4.6' @0x7f4ec88f8550>) ERROR pkgcore: returned val from gen_metadata was 'False' -caught exception '%s' while processing '%s'(MetadataException('Metadata Exception: pkg ebuild src: media-tv/xmltv-0.5.61, attr description\nerror: Metadata Exception: pkg ebuild src: media-tv/xmltv-0.5.61, attr data\nerror: False',), <<class 'pkgcore.ebuild.ebuild_src.package'> cpv='media-tv/xmltv-0.5.61' @0x7fde966bca50>) -caught exception '%s' while processing '%s'(MetadataException("Metadata Exception: pkg ebuild src: app-crypt/whitepixel-2, attr description\nerror: Metadata Exception: pkg ebuild src: app-crypt/whitepixel-2, attr data\nerror: Metadata Exception: pkg ebuild src: app-crypt/whitepixel-2, attr eapi\nerror: parsed eapi '0' doesn't match sourced eapi '3'",), <<class 'pkgcore.ebuild.ebuild_src.package'> cpv='app-crypt/whitepixel-2' @0x7fde966c9190>) +caught exception '%s' while processing '%s'(MetadataException('Metadata Exception: pkg ebuild src: media-tv/xmltv-0.5.61, attr description\nerror: Metadata Exception: pkg ebuild src: media-tv/xmltv-0.5.61, attr data\nerror: False',), <<class 'pkgcore.ebuild.ebuild_src.package'> cpv='media-tv/xmltv-0.5.61' @0x7f4ec8450a50>) +caught exception '%s' while processing '%s'(MetadataException("Metadata Exception: pkg ebuild src: app-crypt/whitepixel-2, attr description\nerror: Metadata Exception: pkg ebuild src: app-crypt/whitepixel-2, attr data\nerror: Metadata Exception: pkg ebuild src: app-crypt/whitepixel-2, attr eapi\nerror: parsed eapi '0' doesn't match sourced eapi '3'",), <<class 'pkgcore.ebuild.ebuild_src.package'> cpv='app-crypt/whitepixel-2' @0x7f4ec845d190>) * Cache regen failed with 1 diff --git a/gentoo-guis.html b/gentoo-guis.html index 5fa03932d114..26f76eb4b513 100644 --- a/gentoo-guis.html +++ b/gentoo-guis.html @@ -138,71 +138,73 @@ </pre></td></tr> <tr class="err" id="l64"><td><a href="#l64"><span>64</span></a></td><td><pre>!!! caught exception False while processing ebuild src: app-portage/kdemerge-9999 </pre></td><td>[FATAL]</td></tr> - <tr class="" id="l65"><td><a href="#l65"><span>65</span></a></td><td><pre>Traceback (most recent call last): + <tr class="err" id="l65"><td><a href="#l65"><span>65</span></a></td><td><pre>!!! caught exception ("Expected command; instead got nothing from ''", None) while processing ebuild src: app-portage/kportagetray-9999 +</pre></td><td>[FATAL]</td></tr> + <tr class="" id="l66"><td><a href="#l66"><span>66</span></a></td><td><pre>Traceback (most recent call last): </pre></td></tr> - <tr class="" id="l66"><td><a href="#l66"><span>66</span></a></td><td><pre> File "/home/mgorny/pkgcore-venv/bin/pmaint", line 4, in <module> + <tr class="" id="l67"><td><a href="#l67"><span>67</span></a></td><td><pre> File "/home/mgorny/pkgcore-venv/bin/pmaint", line 4, in <module> </pre></td></tr> - <tr class="" id="l67"><td><a href="#l67"><span>67</span></a></td><td><pre> scripts.main(basename(__file__)) + <tr class="" id="l68"><td><a href="#l68"><span>68</span></a></td><td><pre> scripts.main(basename(__file__)) </pre></td></tr> - <tr class="" id="l68"><td><a href="#l68"><span>68</span></a></td><td><pre> File "/home/mgorny/pkgcore-venv/lib/python2.7/site-packages/pkgcore/scripts/__init__.py", line 42, in main + <tr class="" id="l69"><td><a href="#l69"><span>69</span></a></td><td><pre> File "/home/mgorny/pkgcore-venv/lib/python2.7/site-packages/pkgcore/scripts/__init__.py", line 42, in main </pre></td></tr> - <tr class="" id="l69"><td><a href="#l69"><span>69</span></a></td><td><pre> commandline.main(argparser) + <tr class="" id="l70"><td><a href="#l70"><span>70</span></a></td><td><pre> commandline.main(argparser) </pre></td></tr> - <tr class="" id="l70"><td><a href="#l70"><span>70</span></a></td><td><pre> File "/home/mgorny/pkgcore-venv/lib/python2.7/site-packages/pkgcore/util/commandline.py", line 983, in main + <tr class="" id="l71"><td><a href="#l71"><span>71</span></a></td><td><pre> File "/home/mgorny/pkgcore-venv/lib/python2.7/site-packages/pkgcore/util/commandline.py", line 983, in main </pre></td></tr> - <tr class="" id="l71"><td><a href="#l71"><span>71</span></a></td><td><pre> exitstatus = main_func(options, out, err) + <tr class="" id="l72"><td><a href="#l72"><span>72</span></a></td><td><pre> exitstatus = main_func(options, out, err) </pre></td></tr> - <tr class="" id="l72"><td><a href="#l72"><span>72</span></a></td><td><pre> File "/home/mgorny/pkgcore-venv/lib/python2.7/site-packages/pkgcore/scripts/pmaint.py", line 286, in regen_main + <tr class="" id="l73"><td><a href="#l73"><span>73</span></a></td><td><pre> File "/home/mgorny/pkgcore-venv/lib/python2.7/site-packages/pkgcore/scripts/pmaint.py", line 286, in regen_main </pre></td></tr> - <tr class="" id="l73"><td><a href="#l73"><span>73</span></a></td><td><pre> eclass_caching=(not options.disable_eclass_caching)) + <tr class="" id="l74"><td><a href="#l74"><span>74</span></a></td><td><pre> eclass_caching=(not options.disable_eclass_caching)) </pre></td></tr> - <tr class="" id="l74"><td><a href="#l74"><span>74</span></a></td><td><pre> File "/home/mgorny/pkgcore-venv/lib/python2.7/site-packages/pkgcore/operations/__init__.py", line 68, in _recast_exception_decorator + <tr class="" id="l75"><td><a href="#l75"><span>75</span></a></td><td><pre> File "/home/mgorny/pkgcore-venv/lib/python2.7/site-packages/pkgcore/operations/__init__.py", line 68, in _recast_exception_decorator </pre></td></tr> - <tr class="" id="l75"><td><a href="#l75"><span>75</span></a></td><td><pre> return functor(*args, **kwds) + <tr class="" id="l76"><td><a href="#l76"><span>76</span></a></td><td><pre> return functor(*args, **kwds) </pre></td></tr> - <tr class="" id="l76"><td><a href="#l76"><span>76</span></a></td><td><pre> File "/home/mgorny/pkgcore-venv/lib/python2.7/site-packages/pkgcore/operations/repo.py", line 247, in _cmd_api_regen_cache + <tr class="" id="l77"><td><a href="#l77"><span>77</span></a></td><td><pre> File "/home/mgorny/pkgcore-venv/lib/python2.7/site-packages/pkgcore/operations/repo.py", line 247, in _cmd_api_regen_cache </pre></td></tr> - <tr class="" id="l77"><td><a href="#l77"><span>77</span></a></td><td><pre> self._get_observer(observer), threads=threads, **options) + <tr class="" id="l78"><td><a href="#l78"><span>78</span></a></td><td><pre> self._get_observer(observer), threads=threads, **options) </pre></td></tr> - <tr class="" id="l78"><td><a href="#l78"><span>78</span></a></td><td><pre> File "/home/mgorny/pkgcore-venv/lib/python2.7/site-packages/pkgcore/operations/regen.py", line 37, in regen_repository + <tr class="" id="l79"><td><a href="#l79"><span>79</span></a></td><td><pre> File "/home/mgorny/pkgcore-venv/lib/python2.7/site-packages/pkgcore/operations/regen.py", line 37, in regen_repository </pre></td></tr> - <tr class="" id="l79"><td><a href="#l79"><span>79</span></a></td><td><pre> regen_iter(iter(repo), _get_repo_helper(), observer) + <tr class="" id="l80"><td><a href="#l80"><span>80</span></a></td><td><pre> regen_iter(iter(repo), _get_repo_helper(), observer) </pre></td></tr> - <tr class="" id="l80"><td><a href="#l80"><span>80</span></a></td><td><pre> File "/home/mgorny/pkgcore-venv/lib/python2.7/site-packages/pkgcore/operations/regen.py", line 15, in regen_iter + <tr class="" id="l81"><td><a href="#l81"><span>81</span></a></td><td><pre> File "/home/mgorny/pkgcore-venv/lib/python2.7/site-packages/pkgcore/operations/regen.py", line 15, in regen_iter </pre></td></tr> - <tr class="" id="l81"><td><a href="#l81"><span>81</span></a></td><td><pre> regen_func(x) + <tr class="" id="l82"><td><a href="#l82"><span>82</span></a></td><td><pre> regen_func(x) </pre></td></tr> - <tr class="" id="l82"><td><a href="#l82"><span>82</span></a></td><td><pre> File "/home/mgorny/pkgcore-venv/lib/python2.7/site-packages/pkgcore/ebuild/repository.py", line 520, in __call__ + <tr class="" id="l83"><td><a href="#l83"><span>83</span></a></td><td><pre> File "/home/mgorny/pkgcore-venv/lib/python2.7/site-packages/pkgcore/ebuild/repository.py", line 520, in __call__ </pre></td></tr> - <tr class="" id="l83"><td><a href="#l83"><span>83</span></a></td><td><pre> return pkg._fetch_metadata(ebp=self.ebp, force_regen=self.force) + <tr class="" id="l84"><td><a href="#l84"><span>84</span></a></td><td><pre> return pkg._fetch_metadata(ebp=self.ebp, force_regen=self.force) </pre></td></tr> - <tr class="" id="l84"><td><a href="#l84"><span>84</span></a></td><td><pre> File "/home/mgorny/pkgcore-venv/lib/python2.7/site-packages/pkgcore/ebuild/ebuild_src.py", line 277, in _fetch_metadata + <tr class="" id="l85"><td><a href="#l85"><span>85</span></a></td><td><pre> File "/home/mgorny/pkgcore-venv/lib/python2.7/site-packages/pkgcore/ebuild/ebuild_src.py", line 277, in _fetch_metadata </pre></td></tr> - <tr class="" id="l85"><td><a href="#l85"><span>85</span></a></td><td><pre> return self._parent._get_metadata(self, ebp=ebp, force_regen=force_regen) + <tr class="" id="l86"><td><a href="#l86"><span>86</span></a></td><td><pre> return self._parent._get_metadata(self, ebp=ebp, force_regen=force_regen) </pre></td></tr> - <tr class="" id="l86"><td><a href="#l86"><span>86</span></a></td><td><pre> File "/home/mgorny/pkgcore-venv/lib/python2.7/site-packages/pkgcore/ebuild/ebuild_src.py", line 366, in _get_metadata + <tr class="" id="l87"><td><a href="#l87"><span>87</span></a></td><td><pre> File "/home/mgorny/pkgcore-venv/lib/python2.7/site-packages/pkgcore/ebuild/ebuild_src.py", line 366, in _get_metadata </pre></td></tr> - <tr class="" id="l87"><td><a href="#l87"><span>87</span></a></td><td><pre> return self._update_metadata(pkg, ebp=ebp) + <tr class="" id="l88"><td><a href="#l88"><span>88</span></a></td><td><pre> return self._update_metadata(pkg, ebp=ebp) </pre></td></tr> - <tr class="" id="l88"><td><a href="#l88"><span>88</span></a></td><td><pre> File "/home/mgorny/pkgcore-venv/lib/python2.7/site-packages/pkgcore/ebuild/ebuild_src.py", line 374, in _update_metadata + <tr class="" id="l89"><td><a href="#l89"><span>89</span></a></td><td><pre> File "/home/mgorny/pkgcore-venv/lib/python2.7/site-packages/pkgcore/ebuild/ebuild_src.py", line 374, in _update_metadata </pre></td></tr> - <tr class="" id="l89"><td><a href="#l89"><span>89</span></a></td><td><pre> mydata = my_proc.get_keys(pkg, self._ecache) + <tr class="" id="l90"><td><a href="#l90"><span>90</span></a></td><td><pre> mydata = my_proc.get_keys(pkg, self._ecache) </pre></td></tr> - <tr class="" id="l90"><td><a href="#l90"><span>90</span></a></td><td><pre> File "/home/mgorny/pkgcore-venv/lib/python2.7/site-packages/pkgcore/ebuild/processor.py", line 788, in get_keys + <tr class="" id="l91"><td><a href="#l91"><span>91</span></a></td><td><pre> File "/home/mgorny/pkgcore-venv/lib/python2.7/site-packages/pkgcore/ebuild/processor.py", line 788, in get_keys </pre></td></tr> - <tr class="" id="l91"><td><a href="#l91"><span>91</span></a></td><td><pre> {"key": receive_key}) + <tr class="" id="l92"><td><a href="#l92"><span>92</span></a></td><td><pre> {"key": receive_key}) </pre></td></tr> - <tr class="" id="l92"><td><a href="#l92"><span>92</span></a></td><td><pre> File "/home/mgorny/pkgcore-venv/lib/python2.7/site-packages/pkgcore/ebuild/processor.py", line 721, in _run_depend_like_phase + <tr class="" id="l93"><td><a href="#l93"><span>93</span></a></td><td><pre> File "/home/mgorny/pkgcore-venv/lib/python2.7/site-packages/pkgcore/ebuild/processor.py", line 721, in _run_depend_like_phase </pre></td></tr> - <tr class="" id="l93"><td><a href="#l93"><span>93</span></a></td><td><pre> self.write("%s %i\n%s" % (command, len(data), data), append_newline=False) + <tr class="" id="l94"><td><a href="#l94"><span>94</span></a></td><td><pre> self.write("%s %i\n%s" % (command, len(data), data), append_newline=False) </pre></td></tr> - <tr class="" id="l94"><td><a href="#l94"><span>94</span></a></td><td><pre> File "/home/mgorny/pkgcore-venv/lib/python2.7/site-packages/pkgcore/ebuild/processor.py", line 419, in write + <tr class="" id="l95"><td><a href="#l95"><span>95</span></a></td><td><pre> File "/home/mgorny/pkgcore-venv/lib/python2.7/site-packages/pkgcore/ebuild/processor.py", line 419, in write </pre></td></tr> - <tr class="" id="l95"><td><a href="#l95"><span>95</span></a></td><td><pre> raise RuntimeError(ie) + <tr class="" id="l96"><td><a href="#l96"><span>96</span></a></td><td><pre> raise RuntimeError(ie) </pre></td></tr> - <tr class="" id="l96"><td><a href="#l96"><span>96</span></a></td><td><pre>RuntimeError: [Errno 32] Broken pipe + <tr class="" id="l97"><td><a href="#l97"><span>97</span></a></td><td><pre>RuntimeError: [Errno 32] Broken pipe </pre></td></tr> - <tr class="" id="l97"><td><a href="#l97"><span>97</span></a></td><td><pre> * Cache regen failed with 1 + <tr class="" id="l98"><td><a href="#l98"><span>98</span></a></td><td><pre> * Cache regen failed with 1 </pre></td></tr> </table> diff --git a/gentoo-guis.txt b/gentoo-guis.txt index 2f4e03696734..7b5397c5d0df 100644 --- a/gentoo-guis.txt +++ b/gentoo-guis.txt @@ -62,6 +62,7 @@ ERROR pkgcore: returned val from gen_metadata was 'False' !!! caught exception False while processing ebuild src: app-portage/c-portage-9999 ERROR pkgcore: returned val from gen_metadata was 'False' !!! caught exception False while processing ebuild src: app-portage/kdemerge-9999 +!!! caught exception ("Expected command; instead got nothing from ''", None) while processing ebuild src: app-portage/kportagetray-9999 Traceback (most recent call last): File "/home/mgorny/pkgcore-venv/bin/pmaint", line 4, in <module> scripts.main(basename(__file__)) diff --git a/gentoo.html b/gentoo.html index 6715db2a0a85..bdf53ef6fe64 100644 --- a/gentoo.html +++ b/gentoo.html @@ -46,35 +46,31 @@ </pre></td></tr> <tr class="" id="l18"><td><a href="#l18"><span>18</span></a></td><td><pre>From https://anongit.gentoo.org/git/repo/gentoo </pre></td></tr> - <tr class="" id="l19"><td><a href="#l19"><span>19</span></a></td><td><pre> 724153c..406f212 master -> origin/master + <tr class="" id="l19"><td><a href="#l19"><span>19</span></a></td><td><pre> 406f212..e4ec113 master -> origin/master </pre></td></tr> - <tr class="" id="l20"><td><a href="#l20"><span>20</span></a></td><td><pre>Updating 724153c..406f212 + <tr class="" id="l20"><td><a href="#l20"><span>20</span></a></td><td><pre>Updating 406f212..e4ec113 </pre></td></tr> <tr class="" id="l21"><td><a href="#l21"><span>21</span></a></td><td><pre>Fast-forward </pre></td></tr> - <tr class="" id="l22"><td><a href="#l22"><span>22</span></a></td><td><pre> mail-mta/postfix/Manifest | 2 +- + <tr class="" id="l22"><td><a href="#l22"><span>22</span></a></td><td><pre> net-proxy/squid/Manifest | 1 + </pre></td></tr> - <tr class="" id="l23"><td><a href="#l23"><span>23</span></a></td><td><pre> .../{postfix-3.2_pre20160314.ebuild => postfix-3.2_pre20160327.ebuild} | 0 + <tr class="" id="l23"><td><a href="#l23"><span>23</span></a></td><td><pre> net-proxy/squid/squid-3.5.16.ebuild | 249 ++++++++++++++++++++++++++++++++++++ </pre></td></tr> - <tr class="" id="l24"><td><a href="#l24"><span>24</span></a></td><td><pre> x11-libs/libva-intel-driver/libva-intel-driver-1.7.0.ebuild | 3 +-- + <tr class="" id="l24"><td><a href="#l24"><span>24</span></a></td><td><pre> 2 files changed, 250 insertions(+) </pre></td></tr> - <tr class="" id="l25"><td><a href="#l25"><span>25</span></a></td><td><pre> x11-libs/libva-intel-driver/libva-intel-driver-9999.ebuild | 3 +-- + <tr class="" id="l25"><td><a href="#l25"><span>25</span></a></td><td><pre> create mode 100644 net-proxy/squid/squid-3.5.16.ebuild </pre></td></tr> - <tr class="" id="l26"><td><a href="#l26"><span>26</span></a></td><td><pre> 4 files changed, 3 insertions(+), 5 deletions(-) + <tr class="" id="l26"><td><a href="#l26"><span>26</span></a></td><td><pre>*** syncing gentoo </pre></td></tr> - <tr class="" id="l27"><td><a href="#l27"><span>27</span></a></td><td><pre> rename mail-mta/postfix/{postfix-3.2_pre20160314.ebuild => postfix-3.2_pre20160327.ebuild} (100%) + <tr class="" id="l27"><td><a href="#l27"><span>27</span></a></td><td><pre>*** synced gentoo </pre></td></tr> - <tr class="" id="l28"><td><a href="#l28"><span>28</span></a></td><td><pre>*** syncing gentoo + <tr class="" id="l28"><td><a href="#l28"><span>28</span></a></td><td><pre> * Sync succeeded </pre></td></tr> - <tr class="" id="l29"><td><a href="#l29"><span>29</span></a></td><td><pre>*** synced gentoo + <tr class="" id="l29"><td><a href="#l29"><span>29</span></a></td><td><pre>$ pmaint regen --use-local-desc --pkg-desc-index -t 1 gentoo </pre></td></tr> - <tr class="" id="l30"><td><a href="#l30"><span>30</span></a></td><td><pre> * Sync succeeded + <tr class="" id="l30"><td><a href="#l30"><span>30</span></a></td><td><pre>WARNING:pkgcore:repository at '/home/mgorny/repos/steveeJ' has unsupported profile format(s): 'profile-set' </pre></td></tr> - <tr class="" id="l31"><td><a href="#l31"><span>31</span></a></td><td><pre>$ pmaint regen --use-local-desc --pkg-desc-index -t 1 gentoo -</pre></td></tr> - <tr class="" id="l32"><td><a href="#l32"><span>32</span></a></td><td><pre>WARNING:pkgcore:repository at '/home/mgorny/repos/steveeJ' has unsupported profile format(s): 'profile-set' -</pre></td></tr> - <tr class="" id="l33"><td><a href="#l33"><span>33</span></a></td><td><pre> * Cache regenerated successfully + <tr class="" id="l31"><td><a href="#l31"><span>31</span></a></td><td><pre> * Cache regenerated successfully </pre></td></tr> </table> diff --git a/gentoo.txt b/gentoo.txt index a67d8f50a631..7334e671aa62 100644 --- a/gentoo.txt +++ b/gentoo.txt @@ -16,15 +16,13 @@ $ pmaint sync gentoo WARNING:pkgcore:repository at '/home/mgorny/sync/steveeJ' has unsupported profile format(s): 'profile-set' From https://anongit.gentoo.org/git/repo/gentoo - 724153c..406f212 master -> origin/master -Updating 724153c..406f212 + 406f212..e4ec113 master -> origin/master +Updating 406f212..e4ec113 Fast-forward - mail-mta/postfix/Manifest | 2 +- - .../{postfix-3.2_pre20160314.ebuild => postfix-3.2_pre20160327.ebuild} | 0 - x11-libs/libva-intel-driver/libva-intel-driver-1.7.0.ebuild | 3 +-- - x11-libs/libva-intel-driver/libva-intel-driver-9999.ebuild | 3 +-- - 4 files changed, 3 insertions(+), 5 deletions(-) - rename mail-mta/postfix/{postfix-3.2_pre20160314.ebuild => postfix-3.2_pre20160327.ebuild} (100%) + net-proxy/squid/Manifest | 1 + + net-proxy/squid/squid-3.5.16.ebuild | 249 ++++++++++++++++++++++++++++++++++++ + 2 files changed, 250 insertions(+) + create mode 100644 net-proxy/squid/squid-3.5.16.ebuild *** syncing gentoo *** synced gentoo * Sync succeeded diff --git a/hacking-gentoo.html b/hacking-gentoo.html index e68d19ef22df..35f25a7297dc 100644 --- a/hacking-gentoo.html +++ b/hacking-gentoo.html @@ -54,21 +54,21 @@ </pre></td></tr> <tr class="" id="l22"><td><a href="#l22"><span>22</span></a></td><td><pre>Matched data: 0 bytes </pre></td></tr> - <tr class="" id="l23"><td><a href="#l23"><span>23</span></a></td><td><pre>File list size: 46.55K + <tr class="" id="l23"><td><a href="#l23"><span>23</span></a></td><td><pre>File list size: 48.00K </pre></td></tr> <tr class="" id="l24"><td><a href="#l24"><span>24</span></a></td><td><pre>File list generation time: 0.001 seconds </pre></td></tr> <tr class="" id="l25"><td><a href="#l25"><span>25</span></a></td><td><pre>File list transfer time: 0.000 seconds </pre></td></tr> - <tr class="" id="l26"><td><a href="#l26"><span>26</span></a></td><td><pre>Total bytes sent: 419 + <tr class="" id="l26"><td><a href="#l26"><span>26</span></a></td><td><pre>Total bytes sent: 411 </pre></td></tr> <tr class="" id="l27"><td><a href="#l27"><span>27</span></a></td><td><pre>Total bytes received: 49.99K </pre></td></tr> <tr class="" id="l28"><td><a href="#l28"><span>28</span></a></td><td><pre> </pre></td></tr> - <tr class="" id="l29"><td><a href="#l29"><span>29</span></a></td><td><pre>sent 419 bytes received 49.99K bytes 33.61K bytes/sec + <tr class="" id="l29"><td><a href="#l29"><span>29</span></a></td><td><pre>sent 411 bytes received 49.99K bytes 33.60K bytes/sec </pre></td></tr> - <tr class="" id="l30"><td><a href="#l30"><span>30</span></a></td><td><pre>total size is 5.29M speedup is 104.87 + <tr class="" id="l30"><td><a href="#l30"><span>30</span></a></td><td><pre>total size is 5.29M speedup is 104.89 </pre></td></tr> <tr class="" id="l31"><td><a href="#l31"><span>31</span></a></td><td><pre>*** syncing hacking-gentoo </pre></td></tr> diff --git a/hacking-gentoo.txt b/hacking-gentoo.txt index 522450a02b8b..1ecfc7ed9fba 100644 --- a/hacking-gentoo.txt +++ b/hacking-gentoo.txt @@ -20,14 +20,14 @@ Total file size: 5.29M bytes Total transferred file size: 0 bytes Literal data: 0 bytes Matched data: 0 bytes -File list size: 46.55K +File list size: 48.00K File list generation time: 0.001 seconds File list transfer time: 0.000 seconds -Total bytes sent: 419 +Total bytes sent: 411 Total bytes received: 49.99K -sent 419 bytes received 49.99K bytes 33.61K bytes/sec -total size is 5.29M speedup is 104.87 +sent 411 bytes received 49.99K bytes 33.60K bytes/sec +total size is 5.29M speedup is 104.89 *** syncing hacking-gentoo *** synced hacking-gentoo * Sync succeeded diff --git a/index.html b/index.html index 34d70f5e98dc..25635854b262 100644 --- a/index.html +++ b/index.html @@ -463,7 +463,7 @@ </table> - <address>Generated based on results from 2016-04-04 07:41:36 UTC</address> + <address>Generated based on results from 2016-04-04 08:02:02 UTC</address> </body> </html>
\ No newline at end of file diff --git a/jensp.html b/jensp.html index 442435b7fd41..1932143b5c51 100644 --- a/jensp.html +++ b/jensp.html @@ -132,73 +132,71 @@ </pre></td></tr> <tr class="err" id="l61"><td><a href="#l61"><span>61</span></a></td><td><pre>!!! caught exception False while processing ebuild src: sys-apps/maemo-flasher35-2.5.2.2 </pre></td><td>[FATAL]</td></tr> - <tr class="err" id="l62"><td><a href="#l62"><span>62</span></a></td><td><pre>!!! caught exception ("Expected command; instead got nothing from ''", None) while processing ebuild src: dev-perl/File-KeePass-2.03 -</pre></td><td>[FATAL]</td></tr> - <tr class="" id="l63"><td><a href="#l63"><span>63</span></a></td><td><pre>Traceback (most recent call last): + <tr class="" id="l62"><td><a href="#l62"><span>62</span></a></td><td><pre>Traceback (most recent call last): </pre></td></tr> - <tr class="" id="l64"><td><a href="#l64"><span>64</span></a></td><td><pre> File "/home/mgorny/pkgcore-venv/bin/pmaint", line 4, in <module> + <tr class="" id="l63"><td><a href="#l63"><span>63</span></a></td><td><pre> File "/home/mgorny/pkgcore-venv/bin/pmaint", line 4, in <module> </pre></td></tr> - <tr class="" id="l65"><td><a href="#l65"><span>65</span></a></td><td><pre> scripts.main(basename(__file__)) + <tr class="" id="l64"><td><a href="#l64"><span>64</span></a></td><td><pre> scripts.main(basename(__file__)) </pre></td></tr> - <tr class="" id="l66"><td><a href="#l66"><span>66</span></a></td><td><pre> File "/home/mgorny/pkgcore-venv/lib/python2.7/site-packages/pkgcore/scripts/__init__.py", line 42, in main + <tr class="" id="l65"><td><a href="#l65"><span>65</span></a></td><td><pre> File "/home/mgorny/pkgcore-venv/lib/python2.7/site-packages/pkgcore/scripts/__init__.py", line 42, in main </pre></td></tr> - <tr class="" id="l67"><td><a href="#l67"><span>67</span></a></td><td><pre> commandline.main(argparser) + <tr class="" id="l66"><td><a href="#l66"><span>66</span></a></td><td><pre> commandline.main(argparser) </pre></td></tr> - <tr class="" id="l68"><td><a href="#l68"><span>68</span></a></td><td><pre> File "/home/mgorny/pkgcore-venv/lib/python2.7/site-packages/pkgcore/util/commandline.py", line 983, in main + <tr class="" id="l67"><td><a href="#l67"><span>67</span></a></td><td><pre> File "/home/mgorny/pkgcore-venv/lib/python2.7/site-packages/pkgcore/util/commandline.py", line 983, in main </pre></td></tr> - <tr class="" id="l69"><td><a href="#l69"><span>69</span></a></td><td><pre> exitstatus = main_func(options, out, err) + <tr class="" id="l68"><td><a href="#l68"><span>68</span></a></td><td><pre> exitstatus = main_func(options, out, err) </pre></td></tr> - <tr class="" id="l70"><td><a href="#l70"><span>70</span></a></td><td><pre> File "/home/mgorny/pkgcore-venv/lib/python2.7/site-packages/pkgcore/scripts/pmaint.py", line 286, in regen_main + <tr class="" id="l69"><td><a href="#l69"><span>69</span></a></td><td><pre> File "/home/mgorny/pkgcore-venv/lib/python2.7/site-packages/pkgcore/scripts/pmaint.py", line 286, in regen_main </pre></td></tr> - <tr class="" id="l71"><td><a href="#l71"><span>71</span></a></td><td><pre> eclass_caching=(not options.disable_eclass_caching)) + <tr class="" id="l70"><td><a href="#l70"><span>70</span></a></td><td><pre> eclass_caching=(not options.disable_eclass_caching)) </pre></td></tr> - <tr class="" id="l72"><td><a href="#l72"><span>72</span></a></td><td><pre> File "/home/mgorny/pkgcore-venv/lib/python2.7/site-packages/pkgcore/operations/__init__.py", line 68, in _recast_exception_decorator + <tr class="" id="l71"><td><a href="#l71"><span>71</span></a></td><td><pre> File "/home/mgorny/pkgcore-venv/lib/python2.7/site-packages/pkgcore/operations/__init__.py", line 68, in _recast_exception_decorator </pre></td></tr> - <tr class="" id="l73"><td><a href="#l73"><span>73</span></a></td><td><pre> return functor(*args, **kwds) + <tr class="" id="l72"><td><a href="#l72"><span>72</span></a></td><td><pre> return functor(*args, **kwds) </pre></td></tr> - <tr class="" id="l74"><td><a href="#l74"><span>74</span></a></td><td><pre> File "/home/mgorny/pkgcore-venv/lib/python2.7/site-packages/pkgcore/operations/repo.py", line 247, in _cmd_api_regen_cache + <tr class="" id="l73"><td><a href="#l73"><span>73</span></a></td><td><pre> File "/home/mgorny/pkgcore-venv/lib/python2.7/site-packages/pkgcore/operations/repo.py", line 247, in _cmd_api_regen_cache </pre></td></tr> - <tr class="" id="l75"><td><a href="#l75"><span>75</span></a></td><td><pre> self._get_observer(observer), threads=threads, **options) + <tr class="" id="l74"><td><a href="#l74"><span>74</span></a></td><td><pre> self._get_observer(observer), threads=threads, **options) </pre></td></tr> - <tr class="" id="l76"><td><a href="#l76"><span>76</span></a></td><td><pre> File "/home/mgorny/pkgcore-venv/lib/python2.7/site-packages/pkgcore/operations/regen.py", line 37, in regen_repository + <tr class="" id="l75"><td><a href="#l75"><span>75</span></a></td><td><pre> File "/home/mgorny/pkgcore-venv/lib/python2.7/site-packages/pkgcore/operations/regen.py", line 37, in regen_repository </pre></td></tr> - <tr class="" id="l77"><td><a href="#l77"><span>77</span></a></td><td><pre> regen_iter(iter(repo), _get_repo_helper(), observer) + <tr class="" id="l76"><td><a href="#l76"><span>76</span></a></td><td><pre> regen_iter(iter(repo), _get_repo_helper(), observer) </pre></td></tr> - <tr class="" id="l78"><td><a href="#l78"><span>78</span></a></td><td><pre> File "/home/mgorny/pkgcore-venv/lib/python2.7/site-packages/pkgcore/operations/regen.py", line 15, in regen_iter + <tr class="" id="l77"><td><a href="#l77"><span>77</span></a></td><td><pre> File "/home/mgorny/pkgcore-venv/lib/python2.7/site-packages/pkgcore/operations/regen.py", line 15, in regen_iter </pre></td></tr> - <tr class="" id="l79"><td><a href="#l79"><span>79</span></a></td><td><pre> regen_func(x) + <tr class="" id="l78"><td><a href="#l78"><span>78</span></a></td><td><pre> regen_func(x) </pre></td></tr> - <tr class="" id="l80"><td><a href="#l80"><span>80</span></a></td><td><pre> File "/home/mgorny/pkgcore-venv/lib/python2.7/site-packages/pkgcore/ebuild/repository.py", line 520, in __call__ + <tr class="" id="l79"><td><a href="#l79"><span>79</span></a></td><td><pre> File "/home/mgorny/pkgcore-venv/lib/python2.7/site-packages/pkgcore/ebuild/repository.py", line 520, in __call__ </pre></td></tr> - <tr class="" id="l81"><td><a href="#l81"><span>81</span></a></td><td><pre> return pkg._fetch_metadata(ebp=self.ebp, force_regen=self.force) + <tr class="" id="l80"><td><a href="#l80"><span>80</span></a></td><td><pre> return pkg._fetch_metadata(ebp=self.ebp, force_regen=self.force) </pre></td></tr> - <tr class="" id="l82"><td><a href="#l82"><span>82</span></a></td><td><pre> File "/home/mgorny/pkgcore-venv/lib/python2.7/site-packages/pkgcore/ebuild/ebuild_src.py", line 277, in _fetch_metadata + <tr class="" id="l81"><td><a href="#l81"><span>81</span></a></td><td><pre> File "/home/mgorny/pkgcore-venv/lib/python2.7/site-packages/pkgcore/ebuild/ebuild_src.py", line 277, in _fetch_metadata </pre></td></tr> - <tr class="" id="l83"><td><a href="#l83"><span>83</span></a></td><td><pre> return self._parent._get_metadata(self, ebp=ebp, force_regen=force_regen) + <tr class="" id="l82"><td><a href="#l82"><span>82</span></a></td><td><pre> return self._parent._get_metadata(self, ebp=ebp, force_regen=force_regen) </pre></td></tr> - <tr class="" id="l84"><td><a href="#l84"><span>84</span></a></td><td><pre> File "/home/mgorny/pkgcore-venv/lib/python2.7/site-packages/pkgcore/ebuild/ebuild_src.py", line 366, in _get_metadata + <tr class="" id="l83"><td><a href="#l83"><span>83</span></a></td><td><pre> File "/home/mgorny/pkgcore-venv/lib/python2.7/site-packages/pkgcore/ebuild/ebuild_src.py", line 366, in _get_metadata </pre></td></tr> - <tr class="" id="l85"><td><a href="#l85"><span>85</span></a></td><td><pre> return self._update_metadata(pkg, ebp=ebp) + <tr class="" id="l84"><td><a href="#l84"><span>84</span></a></td><td><pre> return self._update_metadata(pkg, ebp=ebp) </pre></td></tr> - <tr class="" id="l86"><td><a href="#l86"><span>86</span></a></td><td><pre> File "/home/mgorny/pkgcore-venv/lib/python2.7/site-packages/pkgcore/ebuild/ebuild_src.py", line 374, in _update_metadata + <tr class="" id="l85"><td><a href="#l85"><span>85</span></a></td><td><pre> File "/home/mgorny/pkgcore-venv/lib/python2.7/site-packages/pkgcore/ebuild/ebuild_src.py", line 374, in _update_metadata </pre></td></tr> - <tr class="" id="l87"><td><a href="#l87"><span>87</span></a></td><td><pre> mydata = my_proc.get_keys(pkg, self._ecache) + <tr class="" id="l86"><td><a href="#l86"><span>86</span></a></td><td><pre> mydata = my_proc.get_keys(pkg, self._ecache) </pre></td></tr> - <tr class="" id="l88"><td><a href="#l88"><span>88</span></a></td><td><pre> File "/home/mgorny/pkgcore-venv/lib/python2.7/site-packages/pkgcore/ebuild/processor.py", line 788, in get_keys + <tr class="" id="l87"><td><a href="#l87"><span>87</span></a></td><td><pre> File "/home/mgorny/pkgcore-venv/lib/python2.7/site-packages/pkgcore/ebuild/processor.py", line 788, in get_keys </pre></td></tr> - <tr class="" id="l89"><td><a href="#l89"><span>89</span></a></td><td><pre> {"key": receive_key}) + <tr class="" id="l88"><td><a href="#l88"><span>88</span></a></td><td><pre> {"key": receive_key}) </pre></td></tr> - <tr class="" id="l90"><td><a href="#l90"><span>90</span></a></td><td><pre> File "/home/mgorny/pkgcore-venv/lib/python2.7/site-packages/pkgcore/ebuild/processor.py", line 721, in _run_depend_like_phase + <tr class="" id="l89"><td><a href="#l89"><span>89</span></a></td><td><pre> File "/home/mgorny/pkgcore-venv/lib/python2.7/site-packages/pkgcore/ebuild/processor.py", line 721, in _run_depend_like_phase </pre></td></tr> - <tr class="" id="l91"><td><a href="#l91"><span>91</span></a></td><td><pre> self.write("%s %i\n%s" % (command, len(data), data), append_newline=False) + <tr class="" id="l90"><td><a href="#l90"><span>90</span></a></td><td><pre> self.write("%s %i\n%s" % (command, len(data), data), append_newline=False) </pre></td></tr> - <tr class="" id="l92"><td><a href="#l92"><span>92</span></a></td><td><pre> File "/home/mgorny/pkgcore-venv/lib/python2.7/site-packages/pkgcore/ebuild/processor.py", line 419, in write + <tr class="" id="l91"><td><a href="#l91"><span>91</span></a></td><td><pre> File "/home/mgorny/pkgcore-venv/lib/python2.7/site-packages/pkgcore/ebuild/processor.py", line 419, in write </pre></td></tr> - <tr class="" id="l93"><td><a href="#l93"><span>93</span></a></td><td><pre> raise RuntimeError(ie) + <tr class="" id="l92"><td><a href="#l92"><span>92</span></a></td><td><pre> raise RuntimeError(ie) </pre></td></tr> - <tr class="" id="l94"><td><a href="#l94"><span>94</span></a></td><td><pre>RuntimeError: [Errno 32] Broken pipe + <tr class="" id="l93"><td><a href="#l93"><span>93</span></a></td><td><pre>RuntimeError: [Errno 32] Broken pipe </pre></td></tr> - <tr class="" id="l95"><td><a href="#l95"><span>95</span></a></td><td><pre> * Cache regen failed with 1 + <tr class="" id="l94"><td><a href="#l94"><span>94</span></a></td><td><pre> * Cache regen failed with 1 </pre></td></tr> </table> diff --git a/jensp.txt b/jensp.txt index e619f1885d9d..d6b68ecff292 100644 --- a/jensp.txt +++ b/jensp.txt @@ -59,7 +59,6 @@ ERROR pkgcore: returned val from gen_metadata was 'False' !!! caught exception False while processing ebuild src: x11-drivers/xf86-video-intel-9999 ERROR pkgcore: returned val from gen_metadata was 'False' !!! caught exception False while processing ebuild src: sys-apps/maemo-flasher35-2.5.2.2 -!!! caught exception ("Expected command; instead got nothing from ''", None) while processing ebuild src: dev-perl/File-KeePass-2.03 Traceback (most recent call last): File "/home/mgorny/pkgcore-venv/bin/pmaint", line 4, in <module> scripts.main(basename(__file__)) diff --git a/loongson.html b/loongson.html index e111a9281e2b..7853bd096b12 100644 --- a/loongson.html +++ b/loongson.html @@ -456,23 +456,23 @@ </pre></td><td>[FATAL]</td></tr> <tr class="" id="l223"><td><a href="#l223"><span>223</span></a></td><td><pre>ERROR pkgcore: returned val from gen_metadata was 'False' </pre></td></tr> - <tr class="err" id="l224"><td><a href="#l224"><span>224</span></a></td><td><pre>caught exception '%s' while processing '%s'(MetadataException('Metadata Exception: pkg ebuild src: net-libs/xulrunner-1.9.2.13-r1, attr description\nerror: Metadata Exception: pkg ebuild src: net-libs/xulrunner-1.9.2.13-r1, attr data\nerror: False',), <<class 'pkgcore.ebuild.ebuild_src.package'> cpv='net-libs/xulrunner-1.9.2.13-r1' @0x7f588494d550>) + <tr class="err" id="l224"><td><a href="#l224"><span>224</span></a></td><td><pre>caught exception '%s' while processing '%s'(MetadataException('Metadata Exception: pkg ebuild src: net-libs/xulrunner-1.9.2.13-r1, attr description\nerror: Metadata Exception: pkg ebuild src: net-libs/xulrunner-1.9.2.13-r1, attr data\nerror: False',), <<class 'pkgcore.ebuild.ebuild_src.package'> cpv='net-libs/xulrunner-1.9.2.13-r1' @0x7f18446bf550>) </pre></td><td>[FATAL]</td></tr> <tr class="" id="l225"><td><a href="#l225"><span>225</span></a></td><td><pre>ERROR pkgcore: returned val from gen_metadata was 'False' </pre></td></tr> - <tr class="err" id="l226"><td><a href="#l226"><span>226</span></a></td><td><pre>caught exception '%s' while processing '%s'(MetadataException('Metadata Exception: pkg ebuild src: net-libs/xulrunner-1.9.2.8-r1, attr description\nerror: Metadata Exception: pkg ebuild src: net-libs/xulrunner-1.9.2.8-r1, attr data\nerror: False',), <<class 'pkgcore.ebuild.ebuild_src.package'> cpv='net-libs/xulrunner-1.9.2.8-r1' @0x7f588494d690>) + <tr class="err" id="l226"><td><a href="#l226"><span>226</span></a></td><td><pre>caught exception '%s' while processing '%s'(MetadataException('Metadata Exception: pkg ebuild src: net-libs/xulrunner-1.9.2.8-r1, attr description\nerror: Metadata Exception: pkg ebuild src: net-libs/xulrunner-1.9.2.8-r1, attr data\nerror: False',), <<class 'pkgcore.ebuild.ebuild_src.package'> cpv='net-libs/xulrunner-1.9.2.8-r1' @0x7f18446bf690>) </pre></td><td>[FATAL]</td></tr> <tr class="" id="l227"><td><a href="#l227"><span>227</span></a></td><td><pre>ERROR pkgcore: returned val from gen_metadata was 'False' </pre></td></tr> - <tr class="err" id="l228"><td><a href="#l228"><span>228</span></a></td><td><pre>caught exception '%s' while processing '%s'(MetadataException('Metadata Exception: pkg ebuild src: net-libs/xulrunner-2.0_beta5_pre-r2, attr description\nerror: Metadata Exception: pkg ebuild src: net-libs/xulrunner-2.0_beta5_pre-r2, attr data\nerror: False',), <<class 'pkgcore.ebuild.ebuild_src.package'> cpv='net-libs/xulrunner-2.0_beta5_pre-r2' @0x7f588494dcd0>) + <tr class="err" id="l228"><td><a href="#l228"><span>228</span></a></td><td><pre>caught exception '%s' while processing '%s'(MetadataException('Metadata Exception: pkg ebuild src: net-libs/xulrunner-2.0_beta5_pre-r2, attr description\nerror: Metadata Exception: pkg ebuild src: net-libs/xulrunner-2.0_beta5_pre-r2, attr data\nerror: False',), <<class 'pkgcore.ebuild.ebuild_src.package'> cpv='net-libs/xulrunner-2.0_beta5_pre-r2' @0x7f18446bfcd0>) </pre></td><td>[FATAL]</td></tr> <tr class="" id="l229"><td><a href="#l229"><span>229</span></a></td><td><pre>ERROR pkgcore: returned val from gen_metadata was 'False' </pre></td></tr> - <tr class="err" id="l230"><td><a href="#l230"><span>230</span></a></td><td><pre>caught exception '%s' while processing '%s'(MetadataException('Metadata Exception: pkg ebuild src: www-client/firefox-3.6.13, attr description\nerror: Metadata Exception: pkg ebuild src: www-client/firefox-3.6.13, attr data\nerror: False',), <<class 'pkgcore.ebuild.ebuild_src.package'> cpv='www-client/firefox-3.6.13' @0x7f588494d7d0>) + <tr class="err" id="l230"><td><a href="#l230"><span>230</span></a></td><td><pre>caught exception '%s' while processing '%s'(MetadataException('Metadata Exception: pkg ebuild src: www-client/firefox-3.6.13, attr description\nerror: Metadata Exception: pkg ebuild src: www-client/firefox-3.6.13, attr data\nerror: False',), <<class 'pkgcore.ebuild.ebuild_src.package'> cpv='www-client/firefox-3.6.13' @0x7f18446bf7d0>) </pre></td><td>[FATAL]</td></tr> <tr class="" id="l231"><td><a href="#l231"><span>231</span></a></td><td><pre>ERROR pkgcore: returned val from gen_metadata was 'False' </pre></td></tr> - <tr class="err" id="l232"><td><a href="#l232"><span>232</span></a></td><td><pre>caught exception '%s' while processing '%s'(MetadataException('Metadata Exception: pkg ebuild src: www-client/firefox-3.6.8, attr description\nerror: Metadata Exception: pkg ebuild src: www-client/firefox-3.6.8, attr data\nerror: False',), <<class 'pkgcore.ebuild.ebuild_src.package'> cpv='www-client/firefox-3.6.8' @0x7f588494dcd0>) + <tr class="err" id="l232"><td><a href="#l232"><span>232</span></a></td><td><pre>caught exception '%s' while processing '%s'(MetadataException('Metadata Exception: pkg ebuild src: www-client/firefox-3.6.8, attr description\nerror: Metadata Exception: pkg ebuild src: www-client/firefox-3.6.8, attr data\nerror: False',), <<class 'pkgcore.ebuild.ebuild_src.package'> cpv='www-client/firefox-3.6.8' @0x7f18446bfcd0>) </pre></td><td>[FATAL]</td></tr> <tr class="" id="l233"><td><a href="#l233"><span>233</span></a></td><td><pre> * Cache regen failed with 1 </pre></td></tr> diff --git a/loongson.txt b/loongson.txt index 7b9dec8edfe9..2d9975f9af3d 100644 --- a/loongson.txt +++ b/loongson.txt @@ -221,13 +221,13 @@ ERROR pkgcore: returned val from gen_metadata was 'False' ERROR pkgcore: returned val from gen_metadata was 'False' !!! caught exception False while processing ebuild src: www-client/firefox-3.6.8 ERROR pkgcore: returned val from gen_metadata was 'False' -caught exception '%s' while processing '%s'(MetadataException('Metadata Exception: pkg ebuild src: net-libs/xulrunner-1.9.2.13-r1, attr description\nerror: Metadata Exception: pkg ebuild src: net-libs/xulrunner-1.9.2.13-r1, attr data\nerror: False',), <<class 'pkgcore.ebuild.ebuild_src.package'> cpv='net-libs/xulrunner-1.9.2.13-r1' @0x7f588494d550>) +caught exception '%s' while processing '%s'(MetadataException('Metadata Exception: pkg ebuild src: net-libs/xulrunner-1.9.2.13-r1, attr description\nerror: Metadata Exception: pkg ebuild src: net-libs/xulrunner-1.9.2.13-r1, attr data\nerror: False',), <<class 'pkgcore.ebuild.ebuild_src.package'> cpv='net-libs/xulrunner-1.9.2.13-r1' @0x7f18446bf550>) ERROR pkgcore: returned val from gen_metadata was 'False' -caught exception '%s' while processing '%s'(MetadataException('Metadata Exception: pkg ebuild src: net-libs/xulrunner-1.9.2.8-r1, attr description\nerror: Metadata Exception: pkg ebuild src: net-libs/xulrunner-1.9.2.8-r1, attr data\nerror: False',), <<class 'pkgcore.ebuild.ebuild_src.package'> cpv='net-libs/xulrunner-1.9.2.8-r1' @0x7f588494d690>) +caught exception '%s' while processing '%s'(MetadataException('Metadata Exception: pkg ebuild src: net-libs/xulrunner-1.9.2.8-r1, attr description\nerror: Metadata Exception: pkg ebuild src: net-libs/xulrunner-1.9.2.8-r1, attr data\nerror: False',), <<class 'pkgcore.ebuild.ebuild_src.package'> cpv='net-libs/xulrunner-1.9.2.8-r1' @0x7f18446bf690>) ERROR pkgcore: returned val from gen_metadata was 'False' -caught exception '%s' while processing '%s'(MetadataException('Metadata Exception: pkg ebuild src: net-libs/xulrunner-2.0_beta5_pre-r2, attr description\nerror: Metadata Exception: pkg ebuild src: net-libs/xulrunner-2.0_beta5_pre-r2, attr data\nerror: False',), <<class 'pkgcore.ebuild.ebuild_src.package'> cpv='net-libs/xulrunner-2.0_beta5_pre-r2' @0x7f588494dcd0>) +caught exception '%s' while processing '%s'(MetadataException('Metadata Exception: pkg ebuild src: net-libs/xulrunner-2.0_beta5_pre-r2, attr description\nerror: Metadata Exception: pkg ebuild src: net-libs/xulrunner-2.0_beta5_pre-r2, attr data\nerror: False',), <<class 'pkgcore.ebuild.ebuild_src.package'> cpv='net-libs/xulrunner-2.0_beta5_pre-r2' @0x7f18446bfcd0>) ERROR pkgcore: returned val from gen_metadata was 'False' -caught exception '%s' while processing '%s'(MetadataException('Metadata Exception: pkg ebuild src: www-client/firefox-3.6.13, attr description\nerror: Metadata Exception: pkg ebuild src: www-client/firefox-3.6.13, attr data\nerror: False',), <<class 'pkgcore.ebuild.ebuild_src.package'> cpv='www-client/firefox-3.6.13' @0x7f588494d7d0>) +caught exception '%s' while processing '%s'(MetadataException('Metadata Exception: pkg ebuild src: www-client/firefox-3.6.13, attr description\nerror: Metadata Exception: pkg ebuild src: www-client/firefox-3.6.13, attr data\nerror: False',), <<class 'pkgcore.ebuild.ebuild_src.package'> cpv='www-client/firefox-3.6.13' @0x7f18446bf7d0>) ERROR pkgcore: returned val from gen_metadata was 'False' -caught exception '%s' while processing '%s'(MetadataException('Metadata Exception: pkg ebuild src: www-client/firefox-3.6.8, attr description\nerror: Metadata Exception: pkg ebuild src: www-client/firefox-3.6.8, attr data\nerror: False',), <<class 'pkgcore.ebuild.ebuild_src.package'> cpv='www-client/firefox-3.6.8' @0x7f588494dcd0>) +caught exception '%s' while processing '%s'(MetadataException('Metadata Exception: pkg ebuild src: www-client/firefox-3.6.8, attr description\nerror: Metadata Exception: pkg ebuild src: www-client/firefox-3.6.8, attr data\nerror: False',), <<class 'pkgcore.ebuild.ebuild_src.package'> cpv='www-client/firefox-3.6.8' @0x7f18446bfcd0>) * Cache regen failed with 1 diff --git a/lordvan.html b/lordvan.html index bffb9ae504f3..219154533aba 100644 --- a/lordvan.html +++ b/lordvan.html @@ -152,7 +152,7 @@ </pre></td><td>[FATAL]</td></tr> <tr class="" id="l71"><td><a href="#l71"><span>71</span></a></td><td><pre>ERROR pkgcore: returned val from gen_metadata was 'False' </pre></td></tr> - <tr class="err" id="l72"><td><a href="#l72"><span>72</span></a></td><td><pre>caught exception '%s' while processing '%s'(MetadataException('Metadata Exception: pkg ebuild src: app-misc/labyrinth-0.4.0, attr description\nerror: Metadata Exception: pkg ebuild src: app-misc/labyrinth-0.4.0, attr data\nerror: False',), <<class 'pkgcore.ebuild.ebuild_src.package'> cpv='app-misc/labyrinth-0.4.0' @0x7f363fb0fe10>) + <tr class="err" id="l72"><td><a href="#l72"><span>72</span></a></td><td><pre>caught exception '%s' while processing '%s'(MetadataException('Metadata Exception: pkg ebuild src: app-misc/labyrinth-0.4.0, attr description\nerror: Metadata Exception: pkg ebuild src: app-misc/labyrinth-0.4.0, attr data\nerror: False',), <<class 'pkgcore.ebuild.ebuild_src.package'> cpv='app-misc/labyrinth-0.4.0' @0x7f50164fee10>) </pre></td><td>[FATAL]</td></tr> <tr class="" id="l73"><td><a href="#l73"><span>73</span></a></td><td><pre> * Cache regen failed with 1 </pre></td></tr> diff --git a/lordvan.txt b/lordvan.txt index 20807b117c88..a7320d7aef5a 100644 --- a/lordvan.txt +++ b/lordvan.txt @@ -69,5 +69,5 @@ WARNING:pkgcore:repository at '/home/mgorny/repos/steveeJ' has unsupported profi ERROR pkgcore: returned val from gen_metadata was 'False' !!! caught exception False while processing ebuild src: app-misc/labyrinth-0.4.0 ERROR pkgcore: returned val from gen_metadata was 'False' -caught exception '%s' while processing '%s'(MetadataException('Metadata Exception: pkg ebuild src: app-misc/labyrinth-0.4.0, attr description\nerror: Metadata Exception: pkg ebuild src: app-misc/labyrinth-0.4.0, attr data\nerror: False',), <<class 'pkgcore.ebuild.ebuild_src.package'> cpv='app-misc/labyrinth-0.4.0' @0x7f363fb0fe10>) +caught exception '%s' while processing '%s'(MetadataException('Metadata Exception: pkg ebuild src: app-misc/labyrinth-0.4.0, attr description\nerror: Metadata Exception: pkg ebuild src: app-misc/labyrinth-0.4.0, attr data\nerror: False',), <<class 'pkgcore.ebuild.ebuild_src.package'> cpv='app-misc/labyrinth-0.4.0' @0x7f50164fee10>) * Cache regen failed with 1 diff --git a/maxik-overlay.html b/maxik-overlay.html index 28314a50991b..5eca05434a9e 100644 --- a/maxik-overlay.html +++ b/maxik-overlay.html @@ -36,21 +36,39 @@ </pre></td></tr> <tr class="" id="l13"><td><a href="#l13"><span>13</span></a></td><td><pre>WARNING:pkgcore:repository at '/home/mgorny/sync/steveeJ' has unsupported profile format(s): 'profile-set' </pre></td></tr> - <tr class="" id="l14"><td><a href="#l14"><span>14</span></a></td><td><pre>Already up-to-date. + <tr class="" id="l14"><td><a href="#l14"><span>14</span></a></td><td><pre>From https://github.com/mradermaxlol/maxik-overlay </pre></td></tr> - <tr class="" id="l15"><td><a href="#l15"><span>15</span></a></td><td><pre>*** syncing maxik-overlay + <tr class="" id="l15"><td><a href="#l15"><span>15</span></a></td><td><pre> 36bfe1f..ca35919 master -> origin/master </pre></td></tr> - <tr class="" id="l16"><td><a href="#l16"><span>16</span></a></td><td><pre>*** synced maxik-overlay + <tr class="" id="l16"><td><a href="#l16"><span>16</span></a></td><td><pre>Updating 36bfe1f..ca35919 </pre></td></tr> - <tr class="" id="l17"><td><a href="#l17"><span>17</span></a></td><td><pre> * Sync succeeded + <tr class="" id="l17"><td><a href="#l17"><span>17</span></a></td><td><pre>Fast-forward </pre></td></tr> - <tr class="" id="l18"><td><a href="#l18"><span>18</span></a></td><td><pre>$ pmaint regen --use-local-desc --pkg-desc-index -t 1 maxik-overlay + <tr class="" id="l18"><td><a href="#l18"><span>18</span></a></td><td><pre> app-emulation/wine/Manifest | 5 +- </pre></td></tr> - <tr class="" id="l19"><td><a href="#l19"><span>19</span></a></td><td><pre>WARNING:pkgcore:repository at '/home/mgorny/repos/steveeJ' has unsupported profile format(s): 'profile-set' + <tr class="" id="l19"><td><a href="#l19"><span>19</span></a></td><td><pre> app-emulation/wine/wine-1.9.7-r2.ebuild | 456 --------------------- </pre></td></tr> - <tr class="" id="l20"><td><a href="#l20"><span>20</span></a></td><td><pre>WARNING:pkgcore:repository at '/home/mgorny/repos/steveeJ' has unsupported profile format(s): 'profile-set' + <tr class="" id="l20"><td><a href="#l20"><span>20</span></a></td><td><pre> .../{wine-1.9.6-r3.ebuild => wine-1.9.7-r3.ebuild} | 5 - </pre></td></tr> - <tr class="" id="l21"><td><a href="#l21"><span>21</span></a></td><td><pre> * Cache regenerated successfully + <tr class="" id="l21"><td><a href="#l21"><span>21</span></a></td><td><pre> 3 files changed, 2 insertions(+), 464 deletions(-) +</pre></td></tr> + <tr class="" id="l22"><td><a href="#l22"><span>22</span></a></td><td><pre> delete mode 100644 app-emulation/wine/wine-1.9.7-r2.ebuild +</pre></td></tr> + <tr class="" id="l23"><td><a href="#l23"><span>23</span></a></td><td><pre> rename app-emulation/wine/{wine-1.9.6-r3.ebuild => wine-1.9.7-r3.ebuild} (98%) +</pre></td></tr> + <tr class="" id="l24"><td><a href="#l24"><span>24</span></a></td><td><pre>*** syncing maxik-overlay +</pre></td></tr> + <tr class="" id="l25"><td><a href="#l25"><span>25</span></a></td><td><pre>*** synced maxik-overlay +</pre></td></tr> + <tr class="" id="l26"><td><a href="#l26"><span>26</span></a></td><td><pre> * Sync succeeded +</pre></td></tr> + <tr class="" id="l27"><td><a href="#l27"><span>27</span></a></td><td><pre>$ pmaint regen --use-local-desc --pkg-desc-index -t 1 maxik-overlay +</pre></td></tr> + <tr class="" id="l28"><td><a href="#l28"><span>28</span></a></td><td><pre>WARNING:pkgcore:repository at '/home/mgorny/repos/steveeJ' has unsupported profile format(s): 'profile-set' +</pre></td></tr> + <tr class="" id="l29"><td><a href="#l29"><span>29</span></a></td><td><pre>WARNING:pkgcore:repository at '/home/mgorny/repos/steveeJ' has unsupported profile format(s): 'profile-set' +</pre></td></tr> + <tr class="" id="l30"><td><a href="#l30"><span>30</span></a></td><td><pre> * Cache regenerated successfully </pre></td></tr> </table> diff --git a/maxik-overlay.txt b/maxik-overlay.txt index baeb8a8ec4d1..aedbd1501577 100644 --- a/maxik-overlay.txt +++ b/maxik-overlay.txt @@ -11,7 +11,16 @@ 'status': 'unofficial'} $ pmaint sync maxik-overlay WARNING:pkgcore:repository at '/home/mgorny/sync/steveeJ' has unsupported profile format(s): 'profile-set' -Already up-to-date. +From https://github.com/mradermaxlol/maxik-overlay + 36bfe1f..ca35919 master -> origin/master +Updating 36bfe1f..ca35919 +Fast-forward + app-emulation/wine/Manifest | 5 +- + app-emulation/wine/wine-1.9.7-r2.ebuild | 456 --------------------- + .../{wine-1.9.6-r3.ebuild => wine-1.9.7-r3.ebuild} | 5 - + 3 files changed, 2 insertions(+), 464 deletions(-) + delete mode 100644 app-emulation/wine/wine-1.9.7-r2.ebuild + rename app-emulation/wine/{wine-1.9.6-r3.ebuild => wine-1.9.7-r3.ebuild} (98%) *** syncing maxik-overlay *** synced maxik-overlay * Sync succeeded @@ -142,7 +142,7 @@ </pre></td><td>[FATAL]</td></tr> <tr class="" id="l66"><td><a href="#l66"><span>66</span></a></td><td><pre>ERROR pkgcore: returned val from gen_metadata was 'False' </pre></td></tr> - <tr class="err" id="l67"><td><a href="#l67"><span>67</span></a></td><td><pre>caught exception '%s' while processing '%s'(MetadataException('Metadata Exception: pkg ebuild src: app-admin/oessysmon-0.1.7-r1, attr description\nerror: Metadata Exception: pkg ebuild src: app-admin/oessysmon-0.1.7-r1, attr data\nerror: False',), <<class 'pkgcore.ebuild.ebuild_src.package'> cpv='app-admin/oessysmon-0.1.7-r1' @0x7f04c9c91e10>) + <tr class="err" id="l67"><td><a href="#l67"><span>67</span></a></td><td><pre>caught exception '%s' while processing '%s'(MetadataException('Metadata Exception: pkg ebuild src: app-admin/oessysmon-0.1.7-r1, attr description\nerror: Metadata Exception: pkg ebuild src: app-admin/oessysmon-0.1.7-r1, attr data\nerror: False',), <<class 'pkgcore.ebuild.ebuild_src.package'> cpv='app-admin/oessysmon-0.1.7-r1' @0x7f184edace10>) </pre></td><td>[FATAL]</td></tr> <tr class="" id="l68"><td><a href="#l68"><span>68</span></a></td><td><pre> * Cache regen failed with 1 </pre></td></tr> @@ -64,5 +64,5 @@ WARNING:pkgcore:repository at '/home/mgorny/repos/steveeJ' has unsupported profi ERROR pkgcore: returned val from gen_metadata was 'False' !!! caught exception False while processing ebuild src: app-admin/oessysmon-0.1.7-r1 ERROR pkgcore: returned val from gen_metadata was 'False' -caught exception '%s' while processing '%s'(MetadataException('Metadata Exception: pkg ebuild src: app-admin/oessysmon-0.1.7-r1, attr description\nerror: Metadata Exception: pkg ebuild src: app-admin/oessysmon-0.1.7-r1, attr data\nerror: False',), <<class 'pkgcore.ebuild.ebuild_src.package'> cpv='app-admin/oessysmon-0.1.7-r1' @0x7f04c9c91e10>) +caught exception '%s' while processing '%s'(MetadataException('Metadata Exception: pkg ebuild src: app-admin/oessysmon-0.1.7-r1, attr description\nerror: Metadata Exception: pkg ebuild src: app-admin/oessysmon-0.1.7-r1, attr data\nerror: False',), <<class 'pkgcore.ebuild.ebuild_src.package'> cpv='app-admin/oessysmon-0.1.7-r1' @0x7f184edace10>) * Cache regen failed with 1 diff --git a/n8x0.html b/n8x0.html index 84710220b0a6..20e2669b0c92 100644 --- a/n8x0.html +++ b/n8x0.html @@ -304,15 +304,15 @@ </pre></td><td>[FATAL]</td></tr> <tr class="" id="l147"><td><a href="#l147"><span>147</span></a></td><td><pre>ERROR pkgcore: returned val from gen_metadata was 'False' </pre></td></tr> - <tr class="err" id="l148"><td><a href="#l148"><span>148</span></a></td><td><pre>caught exception '%s' while processing '%s'(MetadataException('Metadata Exception: pkg ebuild src: sys-apps/fb_text2screen-0.1.1, attr description\nerror: Metadata Exception: pkg ebuild src: sys-apps/fb_text2screen-0.1.1, attr data\nerror: False',), <<class 'pkgcore.ebuild.ebuild_src.package'> cpv='sys-apps/fb_text2screen-0.1.1' @0x7f8b471b7e10>) + <tr class="err" id="l148"><td><a href="#l148"><span>148</span></a></td><td><pre>caught exception '%s' while processing '%s'(MetadataException('Metadata Exception: pkg ebuild src: sys-apps/fb_text2screen-0.1.1, attr description\nerror: Metadata Exception: pkg ebuild src: sys-apps/fb_text2screen-0.1.1, attr data\nerror: False',), <<class 'pkgcore.ebuild.ebuild_src.package'> cpv='sys-apps/fb_text2screen-0.1.1' @0x7f556fd97e10>) </pre></td><td>[FATAL]</td></tr> <tr class="" id="l149"><td><a href="#l149"><span>149</span></a></td><td><pre>ERROR pkgcore: returned val from gen_metadata was 'False' </pre></td></tr> - <tr class="err" id="l150"><td><a href="#l150"><span>150</span></a></td><td><pre>caught exception '%s' while processing '%s'(MetadataException('Metadata Exception: pkg ebuild src: sys-apps/opendsme-0.2, attr description\nerror: Metadata Exception: pkg ebuild src: sys-apps/opendsme-0.2, attr data\nerror: False',), <<class 'pkgcore.ebuild.ebuild_src.package'> cpv='sys-apps/opendsme-0.2' @0x7f8b46d05910>) + <tr class="err" id="l150"><td><a href="#l150"><span>150</span></a></td><td><pre>caught exception '%s' while processing '%s'(MetadataException('Metadata Exception: pkg ebuild src: sys-apps/opendsme-0.2, attr description\nerror: Metadata Exception: pkg ebuild src: sys-apps/opendsme-0.2, attr data\nerror: False',), <<class 'pkgcore.ebuild.ebuild_src.package'> cpv='sys-apps/opendsme-0.2' @0x7f556f8e5910>) </pre></td><td>[FATAL]</td></tr> <tr class="" id="l151"><td><a href="#l151"><span>151</span></a></td><td><pre>ERROR pkgcore: returned val from gen_metadata was 'False' </pre></td></tr> - <tr class="err" id="l152"><td><a href="#l152"><span>152</span></a></td><td><pre>caught exception '%s' while processing '%s'(MetadataException('Metadata Exception: pkg ebuild src: app-accessibility/florence-0.5.1, attr description\nerror: Metadata Exception: pkg ebuild src: app-accessibility/florence-0.5.1, attr data\nerror: False',), <<class 'pkgcore.ebuild.ebuild_src.package'> cpv='app-accessibility/florence-0.5.1' @0x7f8b46d06b90>) + <tr class="err" id="l152"><td><a href="#l152"><span>152</span></a></td><td><pre>caught exception '%s' while processing '%s'(MetadataException('Metadata Exception: pkg ebuild src: app-accessibility/florence-0.5.1, attr description\nerror: Metadata Exception: pkg ebuild src: app-accessibility/florence-0.5.1, attr data\nerror: False',), <<class 'pkgcore.ebuild.ebuild_src.package'> cpv='app-accessibility/florence-0.5.1' @0x7f556f8e6b90>) </pre></td><td>[FATAL]</td></tr> <tr class="" id="l153"><td><a href="#l153"><span>153</span></a></td><td><pre> * Cache regen failed with 1 </pre></td></tr> @@ -145,9 +145,9 @@ ERROR pkgcore: returned val from gen_metadata was 'False' ERROR pkgcore: returned val from gen_metadata was 'False' !!! caught exception False while processing ebuild src: app-accessibility/florence-0.5.1 ERROR pkgcore: returned val from gen_metadata was 'False' -caught exception '%s' while processing '%s'(MetadataException('Metadata Exception: pkg ebuild src: sys-apps/fb_text2screen-0.1.1, attr description\nerror: Metadata Exception: pkg ebuild src: sys-apps/fb_text2screen-0.1.1, attr data\nerror: False',), <<class 'pkgcore.ebuild.ebuild_src.package'> cpv='sys-apps/fb_text2screen-0.1.1' @0x7f8b471b7e10>) +caught exception '%s' while processing '%s'(MetadataException('Metadata Exception: pkg ebuild src: sys-apps/fb_text2screen-0.1.1, attr description\nerror: Metadata Exception: pkg ebuild src: sys-apps/fb_text2screen-0.1.1, attr data\nerror: False',), <<class 'pkgcore.ebuild.ebuild_src.package'> cpv='sys-apps/fb_text2screen-0.1.1' @0x7f556fd97e10>) ERROR pkgcore: returned val from gen_metadata was 'False' -caught exception '%s' while processing '%s'(MetadataException('Metadata Exception: pkg ebuild src: sys-apps/opendsme-0.2, attr description\nerror: Metadata Exception: pkg ebuild src: sys-apps/opendsme-0.2, attr data\nerror: False',), <<class 'pkgcore.ebuild.ebuild_src.package'> cpv='sys-apps/opendsme-0.2' @0x7f8b46d05910>) +caught exception '%s' while processing '%s'(MetadataException('Metadata Exception: pkg ebuild src: sys-apps/opendsme-0.2, attr description\nerror: Metadata Exception: pkg ebuild src: sys-apps/opendsme-0.2, attr data\nerror: False',), <<class 'pkgcore.ebuild.ebuild_src.package'> cpv='sys-apps/opendsme-0.2' @0x7f556f8e5910>) ERROR pkgcore: returned val from gen_metadata was 'False' -caught exception '%s' while processing '%s'(MetadataException('Metadata Exception: pkg ebuild src: app-accessibility/florence-0.5.1, attr description\nerror: Metadata Exception: pkg ebuild src: app-accessibility/florence-0.5.1, attr data\nerror: False',), <<class 'pkgcore.ebuild.ebuild_src.package'> cpv='app-accessibility/florence-0.5.1' @0x7f8b46d06b90>) +caught exception '%s' while processing '%s'(MetadataException('Metadata Exception: pkg ebuild src: app-accessibility/florence-0.5.1, attr description\nerror: Metadata Exception: pkg ebuild src: app-accessibility/florence-0.5.1, attr data\nerror: False',), <<class 'pkgcore.ebuild.ebuild_src.package'> cpv='app-accessibility/florence-0.5.1' @0x7f556f8e6b90>) * Cache regen failed with 1 diff --git a/o11c.html b/o11c.html index 0915580bc79d..3d8634a79987 100644 --- a/o11c.html +++ b/o11c.html @@ -148,7 +148,7 @@ </pre></td><td>[FATAL]</td></tr> <tr class="" id="l69"><td><a href="#l69"><span>69</span></a></td><td><pre>ERROR pkgcore: returned val from gen_metadata was 'False' </pre></td></tr> - <tr class="err" id="l70"><td><a href="#l70"><span>70</span></a></td><td><pre>caught exception '%s' while processing '%s'(MetadataException('Metadata Exception: pkg ebuild src: dev-python/attoconf-9999, attr description\nerror: Metadata Exception: pkg ebuild src: dev-python/attoconf-9999, attr data\nerror: False',), <<class 'pkgcore.ebuild.ebuild_src.package'> cpv='dev-python/attoconf-9999' @0x7fc9d49b9550>) + <tr class="err" id="l70"><td><a href="#l70"><span>70</span></a></td><td><pre>caught exception '%s' while processing '%s'(MetadataException('Metadata Exception: pkg ebuild src: dev-python/attoconf-9999, attr description\nerror: Metadata Exception: pkg ebuild src: dev-python/attoconf-9999, attr data\nerror: False',), <<class 'pkgcore.ebuild.ebuild_src.package'> cpv='dev-python/attoconf-9999' @0x7fe5f42e3550>) </pre></td><td>[FATAL]</td></tr> <tr class="" id="l71"><td><a href="#l71"><span>71</span></a></td><td><pre> * Cache regen failed with 1 </pre></td></tr> @@ -67,5 +67,5 @@ WARNING:pkgcore:repository at '/home/mgorny/repos/steveeJ' has unsupported profi ERROR pkgcore: returned val from gen_metadata was 'False' !!! caught exception False while processing ebuild src: dev-python/attoconf-9999 ERROR pkgcore: returned val from gen_metadata was 'False' -caught exception '%s' while processing '%s'(MetadataException('Metadata Exception: pkg ebuild src: dev-python/attoconf-9999, attr description\nerror: Metadata Exception: pkg ebuild src: dev-python/attoconf-9999, attr data\nerror: False',), <<class 'pkgcore.ebuild.ebuild_src.package'> cpv='dev-python/attoconf-9999' @0x7fc9d49b9550>) +caught exception '%s' while processing '%s'(MetadataException('Metadata Exception: pkg ebuild src: dev-python/attoconf-9999, attr description\nerror: Metadata Exception: pkg ebuild src: dev-python/attoconf-9999, attr data\nerror: False',), <<class 'pkgcore.ebuild.ebuild_src.package'> cpv='dev-python/attoconf-9999' @0x7fe5f42e3550>) * Cache regen failed with 1 diff --git a/poly-c.html b/poly-c.html index f13fda7cc953..66eea9e635ad 100644 --- a/poly-c.html +++ b/poly-c.html @@ -118,7 +118,7 @@ </pre></td></tr> <tr class="" id="l54"><td><a href="#l54"><span>54</span></a></td><td><pre> </pre></td></tr> - <tr class="" id="l55"><td><a href="#l55"><span>55</span></a></td><td><pre>sent 85 bytes received 133 bytes 145.33 bytes/sec + <tr class="" id="l55"><td><a href="#l55"><span>55</span></a></td><td><pre>sent 85 bytes received 133 bytes 62.29 bytes/sec </pre></td></tr> <tr class="" id="l56"><td><a href="#l56"><span>56</span></a></td><td><pre>total size is 32 speedup is 0.15 </pre></td></tr> diff --git a/poly-c.txt b/poly-c.txt index f9cc7cdc7396..0ceac5f3e0cf 100644 --- a/poly-c.txt +++ b/poly-c.txt @@ -52,7 +52,7 @@ File list transfer time: 0.000 seconds Total bytes sent: 85 Total bytes received: 133 -sent 85 bytes received 133 bytes 145.33 bytes/sec +sent 85 bytes received 133 bytes 62.29 bytes/sec total size is 32 speedup is 0.15 *** syncing poly-c *** synced poly-c diff --git a/proaudio.html b/proaudio.html index 7132809dfa87..0288a767b3f3 100644 --- a/proaudio.html +++ b/proaudio.html @@ -606,31 +606,31 @@ </pre></td><td>[FATAL]</td></tr> <tr class="" id="l298"><td><a href="#l298"><span>298</span></a></td><td><pre>ERROR pkgcore: returned val from gen_metadata was 'False' </pre></td></tr> - <tr class="err" id="l299"><td><a href="#l299"><span>299</span></a></td><td><pre>caught exception '%s' while processing '%s'(MetadataException('Metadata Exception: pkg ebuild src: media-sound/freqtweak-0.7.0_pre20070214-r1, attr description\nerror: Metadata Exception: pkg ebuild src: media-sound/freqtweak-0.7.0_pre20070214-r1, attr data\nerror: False',), <<class 'pkgcore.ebuild.ebuild_src.package'> cpv='media-sound/freqtweak-0.7.0_pre20070214-r1' @0x7f621691e190>) + <tr class="err" id="l299"><td><a href="#l299"><span>299</span></a></td><td><pre>caught exception '%s' while processing '%s'(MetadataException('Metadata Exception: pkg ebuild src: media-sound/freqtweak-0.7.0_pre20070214-r1, attr description\nerror: Metadata Exception: pkg ebuild src: media-sound/freqtweak-0.7.0_pre20070214-r1, attr data\nerror: False',), <<class 'pkgcore.ebuild.ebuild_src.package'> cpv='media-sound/freqtweak-0.7.0_pre20070214-r1' @0x7fae8736d190>) </pre></td><td>[FATAL]</td></tr> <tr class="" id="l300"><td><a href="#l300"><span>300</span></a></td><td><pre>ERROR pkgcore: returned val from gen_metadata was 'False' </pre></td></tr> - <tr class="err" id="l301"><td><a href="#l301"><span>301</span></a></td><td><pre>caught exception '%s' while processing '%s'(MetadataException('Metadata Exception: pkg ebuild src: media-sound/freqtweak-9999, attr description\nerror: Metadata Exception: pkg ebuild src: media-sound/freqtweak-9999, attr data\nerror: False',), <<class 'pkgcore.ebuild.ebuild_src.package'> cpv='media-sound/freqtweak-9999' @0x7f621691e410>) + <tr class="err" id="l301"><td><a href="#l301"><span>301</span></a></td><td><pre>caught exception '%s' while processing '%s'(MetadataException('Metadata Exception: pkg ebuild src: media-sound/freqtweak-9999, attr description\nerror: Metadata Exception: pkg ebuild src: media-sound/freqtweak-9999, attr data\nerror: False',), <<class 'pkgcore.ebuild.ebuild_src.package'> cpv='media-sound/freqtweak-9999' @0x7fae8736d410>) </pre></td><td>[FATAL]</td></tr> <tr class="" id="l302"><td><a href="#l302"><span>302</span></a></td><td><pre>ERROR pkgcore: returned val from gen_metadata was 'False' </pre></td></tr> - <tr class="err" id="l303"><td><a href="#l303"><span>303</span></a></td><td><pre>caught exception '%s' while processing '%s'(MetadataException('Metadata Exception: pkg ebuild src: media-sound/ggseq-0.3.1, attr description\nerror: Metadata Exception: pkg ebuild src: media-sound/ggseq-0.3.1, attr data\nerror: False',), <<class 'pkgcore.ebuild.ebuild_src.package'> cpv='media-sound/ggseq-0.3.1' @0x7f621691ee10>) + <tr class="err" id="l303"><td><a href="#l303"><span>303</span></a></td><td><pre>caught exception '%s' while processing '%s'(MetadataException('Metadata Exception: pkg ebuild src: media-sound/ggseq-0.3.1, attr description\nerror: Metadata Exception: pkg ebuild src: media-sound/ggseq-0.3.1, attr data\nerror: False',), <<class 'pkgcore.ebuild.ebuild_src.package'> cpv='media-sound/ggseq-0.3.1' @0x7fae8736de10>) </pre></td><td>[FATAL]</td></tr> <tr class="" id="l304"><td><a href="#l304"><span>304</span></a></td><td><pre>ERROR pkgcore: returned val from gen_metadata was 'False' </pre></td></tr> - <tr class="err" id="l305"><td><a href="#l305"><span>305</span></a></td><td><pre>caught exception '%s' while processing '%s'(MetadataException('Metadata Exception: pkg ebuild src: media-sound/wired-0.4, attr description\nerror: Metadata Exception: pkg ebuild src: media-sound/wired-0.4, attr data\nerror: False',), <<class 'pkgcore.ebuild.ebuild_src.package'> cpv='media-sound/wired-0.4' @0x7f6216845cd0>) + <tr class="err" id="l305"><td><a href="#l305"><span>305</span></a></td><td><pre>caught exception '%s' while processing '%s'(MetadataException('Metadata Exception: pkg ebuild src: media-sound/wired-0.4, attr description\nerror: Metadata Exception: pkg ebuild src: media-sound/wired-0.4, attr data\nerror: False',), <<class 'pkgcore.ebuild.ebuild_src.package'> cpv='media-sound/wired-0.4' @0x7fae87294cd0>) </pre></td><td>[FATAL]</td></tr> <tr class="" id="l306"><td><a href="#l306"><span>306</span></a></td><td><pre>ERROR pkgcore: returned val from gen_metadata was 'False' </pre></td></tr> - <tr class="err" id="l307"><td><a href="#l307"><span>307</span></a></td><td><pre>caught exception '%s' while processing '%s'(MetadataException('Metadata Exception: pkg ebuild src: media-sound/wired-0.5, attr description\nerror: Metadata Exception: pkg ebuild src: media-sound/wired-0.5, attr data\nerror: False',), <<class 'pkgcore.ebuild.ebuild_src.package'> cpv='media-sound/wired-0.5' @0x7f621691ee10>) + <tr class="err" id="l307"><td><a href="#l307"><span>307</span></a></td><td><pre>caught exception '%s' while processing '%s'(MetadataException('Metadata Exception: pkg ebuild src: media-sound/wired-0.5, attr description\nerror: Metadata Exception: pkg ebuild src: media-sound/wired-0.5, attr data\nerror: False',), <<class 'pkgcore.ebuild.ebuild_src.package'> cpv='media-sound/wired-0.5' @0x7fae8736de10>) </pre></td><td>[FATAL]</td></tr> <tr class="" id="l308"><td><a href="#l308"><span>308</span></a></td><td><pre>ERROR pkgcore: returned val from gen_metadata was 'False' </pre></td></tr> - <tr class="err" id="l309"><td><a href="#l309"><span>309</span></a></td><td><pre>caught exception '%s' while processing '%s'(MetadataException('Metadata Exception: pkg ebuild src: media-sound/wired-0.6, attr description\nerror: Metadata Exception: pkg ebuild src: media-sound/wired-0.6, attr data\nerror: False',), <<class 'pkgcore.ebuild.ebuild_src.package'> cpv='media-sound/wired-0.6' @0x7f6216845cd0>) + <tr class="err" id="l309"><td><a href="#l309"><span>309</span></a></td><td><pre>caught exception '%s' while processing '%s'(MetadataException('Metadata Exception: pkg ebuild src: media-sound/wired-0.6, attr description\nerror: Metadata Exception: pkg ebuild src: media-sound/wired-0.6, attr data\nerror: False',), <<class 'pkgcore.ebuild.ebuild_src.package'> cpv='media-sound/wired-0.6' @0x7fae87294cd0>) </pre></td><td>[FATAL]</td></tr> <tr class="" id="l310"><td><a href="#l310"><span>310</span></a></td><td><pre>ERROR pkgcore: returned val from gen_metadata was 'False' </pre></td></tr> - <tr class="err" id="l311"><td><a href="#l311"><span>311</span></a></td><td><pre>caught exception '%s' while processing '%s'(MetadataException('Metadata Exception: pkg ebuild src: media-sound/wired-9999, attr description\nerror: Metadata Exception: pkg ebuild src: media-sound/wired-9999, attr data\nerror: False',), <<class 'pkgcore.ebuild.ebuild_src.package'> cpv='media-sound/wired-9999' @0x7f621691ee10>) + <tr class="err" id="l311"><td><a href="#l311"><span>311</span></a></td><td><pre>caught exception '%s' while processing '%s'(MetadataException('Metadata Exception: pkg ebuild src: media-sound/wired-9999, attr description\nerror: Metadata Exception: pkg ebuild src: media-sound/wired-9999, attr data\nerror: False',), <<class 'pkgcore.ebuild.ebuild_src.package'> cpv='media-sound/wired-9999' @0x7fae8736de10>) </pre></td><td>[FATAL]</td></tr> <tr class="" id="l312"><td><a href="#l312"><span>312</span></a></td><td><pre> * Cache regen failed with 1 </pre></td></tr> diff --git a/proaudio.txt b/proaudio.txt index c4dac7d2813e..81ea65c6de25 100644 --- a/proaudio.txt +++ b/proaudio.txt @@ -296,17 +296,17 @@ ERROR pkgcore: returned val from gen_metadata was 'False' ERROR pkgcore: returned val from gen_metadata was 'False' !!! caught exception False while processing ebuild src: media-sound/wired-9999 ERROR pkgcore: returned val from gen_metadata was 'False' -caught exception '%s' while processing '%s'(MetadataException('Metadata Exception: pkg ebuild src: media-sound/freqtweak-0.7.0_pre20070214-r1, attr description\nerror: Metadata Exception: pkg ebuild src: media-sound/freqtweak-0.7.0_pre20070214-r1, attr data\nerror: False',), <<class 'pkgcore.ebuild.ebuild_src.package'> cpv='media-sound/freqtweak-0.7.0_pre20070214-r1' @0x7f621691e190>) +caught exception '%s' while processing '%s'(MetadataException('Metadata Exception: pkg ebuild src: media-sound/freqtweak-0.7.0_pre20070214-r1, attr description\nerror: Metadata Exception: pkg ebuild src: media-sound/freqtweak-0.7.0_pre20070214-r1, attr data\nerror: False',), <<class 'pkgcore.ebuild.ebuild_src.package'> cpv='media-sound/freqtweak-0.7.0_pre20070214-r1' @0x7fae8736d190>) ERROR pkgcore: returned val from gen_metadata was 'False' -caught exception '%s' while processing '%s'(MetadataException('Metadata Exception: pkg ebuild src: media-sound/freqtweak-9999, attr description\nerror: Metadata Exception: pkg ebuild src: media-sound/freqtweak-9999, attr data\nerror: False',), <<class 'pkgcore.ebuild.ebuild_src.package'> cpv='media-sound/freqtweak-9999' @0x7f621691e410>) +caught exception '%s' while processing '%s'(MetadataException('Metadata Exception: pkg ebuild src: media-sound/freqtweak-9999, attr description\nerror: Metadata Exception: pkg ebuild src: media-sound/freqtweak-9999, attr data\nerror: False',), <<class 'pkgcore.ebuild.ebuild_src.package'> cpv='media-sound/freqtweak-9999' @0x7fae8736d410>) ERROR pkgcore: returned val from gen_metadata was 'False' -caught exception '%s' while processing '%s'(MetadataException('Metadata Exception: pkg ebuild src: media-sound/ggseq-0.3.1, attr description\nerror: Metadata Exception: pkg ebuild src: media-sound/ggseq-0.3.1, attr data\nerror: False',), <<class 'pkgcore.ebuild.ebuild_src.package'> cpv='media-sound/ggseq-0.3.1' @0x7f621691ee10>) +caught exception '%s' while processing '%s'(MetadataException('Metadata Exception: pkg ebuild src: media-sound/ggseq-0.3.1, attr description\nerror: Metadata Exception: pkg ebuild src: media-sound/ggseq-0.3.1, attr data\nerror: False',), <<class 'pkgcore.ebuild.ebuild_src.package'> cpv='media-sound/ggseq-0.3.1' @0x7fae8736de10>) ERROR pkgcore: returned val from gen_metadata was 'False' -caught exception '%s' while processing '%s'(MetadataException('Metadata Exception: pkg ebuild src: media-sound/wired-0.4, attr description\nerror: Metadata Exception: pkg ebuild src: media-sound/wired-0.4, attr data\nerror: False',), <<class 'pkgcore.ebuild.ebuild_src.package'> cpv='media-sound/wired-0.4' @0x7f6216845cd0>) +caught exception '%s' while processing '%s'(MetadataException('Metadata Exception: pkg ebuild src: media-sound/wired-0.4, attr description\nerror: Metadata Exception: pkg ebuild src: media-sound/wired-0.4, attr data\nerror: False',), <<class 'pkgcore.ebuild.ebuild_src.package'> cpv='media-sound/wired-0.4' @0x7fae87294cd0>) ERROR pkgcore: returned val from gen_metadata was 'False' -caught exception '%s' while processing '%s'(MetadataException('Metadata Exception: pkg ebuild src: media-sound/wired-0.5, attr description\nerror: Metadata Exception: pkg ebuild src: media-sound/wired-0.5, attr data\nerror: False',), <<class 'pkgcore.ebuild.ebuild_src.package'> cpv='media-sound/wired-0.5' @0x7f621691ee10>) +caught exception '%s' while processing '%s'(MetadataException('Metadata Exception: pkg ebuild src: media-sound/wired-0.5, attr description\nerror: Metadata Exception: pkg ebuild src: media-sound/wired-0.5, attr data\nerror: False',), <<class 'pkgcore.ebuild.ebuild_src.package'> cpv='media-sound/wired-0.5' @0x7fae8736de10>) ERROR pkgcore: returned val from gen_metadata was 'False' -caught exception '%s' while processing '%s'(MetadataException('Metadata Exception: pkg ebuild src: media-sound/wired-0.6, attr description\nerror: Metadata Exception: pkg ebuild src: media-sound/wired-0.6, attr data\nerror: False',), <<class 'pkgcore.ebuild.ebuild_src.package'> cpv='media-sound/wired-0.6' @0x7f6216845cd0>) +caught exception '%s' while processing '%s'(MetadataException('Metadata Exception: pkg ebuild src: media-sound/wired-0.6, attr description\nerror: Metadata Exception: pkg ebuild src: media-sound/wired-0.6, attr data\nerror: False',), <<class 'pkgcore.ebuild.ebuild_src.package'> cpv='media-sound/wired-0.6' @0x7fae87294cd0>) ERROR pkgcore: returned val from gen_metadata was 'False' -caught exception '%s' while processing '%s'(MetadataException('Metadata Exception: pkg ebuild src: media-sound/wired-9999, attr description\nerror: Metadata Exception: pkg ebuild src: media-sound/wired-9999, attr data\nerror: False',), <<class 'pkgcore.ebuild.ebuild_src.package'> cpv='media-sound/wired-9999' @0x7f621691ee10>) +caught exception '%s' while processing '%s'(MetadataException('Metadata Exception: pkg ebuild src: media-sound/wired-9999, attr description\nerror: Metadata Exception: pkg ebuild src: media-sound/wired-9999, attr data\nerror: False',), <<class 'pkgcore.ebuild.ebuild_src.package'> cpv='media-sound/wired-9999' @0x7fae8736de10>) * Cache regen failed with 1 diff --git a/rainyday.html b/rainyday.html index 305e56ab90db..ceb6ae80f909 100644 --- a/rainyday.html +++ b/rainyday.html @@ -1136,7 +1136,7 @@ </pre></td><td>[FATAL]</td></tr> <tr class="" id="l563"><td><a href="#l563"><span>563</span></a></td><td><pre>ERROR pkgcore: returned val from gen_metadata was 'False' </pre></td></tr> - <tr class="err" id="l564"><td><a href="#l564"><span>564</span></a></td><td><pre>caught exception '%s' while processing '%s'(MetadataException('Metadata Exception: pkg ebuild src: app-pda/libopensync-plugin-kdepim-0.35, attr description\nerror: Metadata Exception: pkg ebuild src: app-pda/libopensync-plugin-kdepim-0.35, attr data\nerror: False',), <<class 'pkgcore.ebuild.ebuild_src.package'> cpv='app-pda/libopensync-plugin-kdepim-0.35' @0x7fd323ed87d0>) + <tr class="err" id="l564"><td><a href="#l564"><span>564</span></a></td><td><pre>caught exception '%s' while processing '%s'(MetadataException('Metadata Exception: pkg ebuild src: app-pda/libopensync-plugin-kdepim-0.35, attr description\nerror: Metadata Exception: pkg ebuild src: app-pda/libopensync-plugin-kdepim-0.35, attr data\nerror: False',), <<class 'pkgcore.ebuild.ebuild_src.package'> cpv='app-pda/libopensync-plugin-kdepim-0.35' @0x7f3ff77de7d0>) </pre></td><td>[FATAL]</td></tr> <tr class="" id="l565"><td><a href="#l565"><span>565</span></a></td><td><pre>ERROR pkgcore: returned val from gen_metadata was 'False' </pre></td></tr> @@ -1544,43 +1544,43 @@ </pre></td></tr> <tr class="" id="l767"><td><a href="#l767"><span>767</span></a></td><td><pre> </pre></td></tr> - <tr class="" id="l768"><td><a href="#l768"><span>768</span></a></td><td><pre>.package'> cpv='app-pda/libopensync-plugin-kdepim-0.36' @0x7fd323ed8910>) + <tr class="" id="l768"><td><a href="#l768"><span>768</span></a></td><td><pre>.package'> cpv='app-pda/libopensync-plugin-kdepim-0.36' @0x7f3ff77de910>) </pre></td></tr> <tr class="" id="l769"><td><a href="#l769"><span>769</span></a></td><td><pre>ERROR pkgcore: returned val from gen_metadata was 'False' </pre></td></tr> - <tr class="err" id="l770"><td><a href="#l770"><span>770</span></a></td><td><pre>caught exception '%s' while processing '%s'(MetadataException('Metadata Exception: pkg ebuild src: app-pda/libopensync-plugin-kdepim-9999, attr description\nerror: Metadata Exception: pkg ebuild src: app-pda/libopensync-plugin-kdepim-9999, attr data\nerror: False',), <<class 'pkgcore.ebuild.ebuild_src.package'> cpv='app-pda/libopensync-plugin-kdepim-9999' @0x7fd323ed87d0>) + <tr class="err" id="l770"><td><a href="#l770"><span>770</span></a></td><td><pre>caught exception '%s' while processing '%s'(MetadataException('Metadata Exception: pkg ebuild src: app-pda/libopensync-plugin-kdepim-9999, attr description\nerror: Metadata Exception: pkg ebuild src: app-pda/libopensync-plugin-kdepim-9999, attr data\nerror: False',), <<class 'pkgcore.ebuild.ebuild_src.package'> cpv='app-pda/libopensync-plugin-kdepim-9999' @0x7f3ff77de7d0>) </pre></td><td>[FATAL]</td></tr> <tr class="" id="l771"><td><a href="#l771"><span>771</span></a></td><td><pre>ERROR pkgcore: returned val from gen_metadata was 'False' </pre></td></tr> - <tr class="err" id="l772"><td><a href="#l772"><span>772</span></a></td><td><pre>caught exception '%s' while processing '%s'(MetadataException('Metadata Exception: pkg ebuild src: x11-wm/metacity-2.30.3, attr description\nerror: Metadata Exception: pkg ebuild src: x11-wm/metacity-2.30.3, attr data\nerror: False',), <<class 'pkgcore.ebuild.ebuild_src.package'> cpv='x11-wm/metacity-2.30.3' @0x7fd323a40b90>) + <tr class="err" id="l772"><td><a href="#l772"><span>772</span></a></td><td><pre>caught exception '%s' while processing '%s'(MetadataException('Metadata Exception: pkg ebuild src: x11-wm/metacity-2.30.3, attr description\nerror: Metadata Exception: pkg ebuild src: x11-wm/metacity-2.30.3, attr data\nerror: False',), <<class 'pkgcore.ebuild.ebuild_src.package'> cpv='x11-wm/metacity-2.30.3' @0x7f3ff7346b90>) </pre></td><td>[FATAL]</td></tr> <tr class="" id="l773"><td><a href="#l773"><span>773</span></a></td><td><pre>ERROR pkgcore: returned val from gen_metadata was 'False' </pre></td></tr> - <tr class="err" id="l774"><td><a href="#l774"><span>774</span></a></td><td><pre>caught exception '%s' while processing '%s'(MetadataException('Metadata Exception: pkg ebuild src: x11-libs/compizconfig-backend-kconfig4-0.8.4, attr description\nerror: Metadata Exception: pkg ebuild src: x11-libs/compizconfig-backend-kconfig4-0.8.4, attr data\nerror: False',), <<class 'pkgcore.ebuild.ebuild_src.package'> cpv='x11-libs/compizconfig-backend-kconfig4-0.8.4' @0x7fd3238f4690>) + <tr class="err" id="l774"><td><a href="#l774"><span>774</span></a></td><td><pre>caught exception '%s' while processing '%s'(MetadataException('Metadata Exception: pkg ebuild src: x11-libs/compizconfig-backend-kconfig4-0.8.4, attr description\nerror: Metadata Exception: pkg ebuild src: x11-libs/compizconfig-backend-kconfig4-0.8.4, attr data\nerror: False',), <<class 'pkgcore.ebuild.ebuild_src.package'> cpv='x11-libs/compizconfig-backend-kconfig4-0.8.4' @0x7f3ff71fa690>) </pre></td><td>[FATAL]</td></tr> <tr class="" id="l775"><td><a href="#l775"><span>775</span></a></td><td><pre>ERROR pkgcore: returned val from gen_metadata was 'False' </pre></td></tr> - <tr class="err" id="l776"><td><a href="#l776"><span>776</span></a></td><td><pre>caught exception '%s' while processing '%s'(MetadataException('Metadata Exception: pkg ebuild src: x11-libs/compizconfig-backend-kconfig4-0.8.8, attr description\nerror: Metadata Exception: pkg ebuild src: x11-libs/compizconfig-backend-kconfig4-0.8.8, attr data\nerror: False',), <<class 'pkgcore.ebuild.ebuild_src.package'> cpv='x11-libs/compizconfig-backend-kconfig4-0.8.8' @0x7fd323a40b90>) + <tr class="err" id="l776"><td><a href="#l776"><span>776</span></a></td><td><pre>caught exception '%s' while processing '%s'(MetadataException('Metadata Exception: pkg ebuild src: x11-libs/compizconfig-backend-kconfig4-0.8.8, attr description\nerror: Metadata Exception: pkg ebuild src: x11-libs/compizconfig-backend-kconfig4-0.8.8, attr data\nerror: False',), <<class 'pkgcore.ebuild.ebuild_src.package'> cpv='x11-libs/compizconfig-backend-kconfig4-0.8.8' @0x7f3ff7346b90>) </pre></td><td>[FATAL]</td></tr> <tr class="" id="l777"><td><a href="#l777"><span>777</span></a></td><td><pre>ERROR pkgcore: returned val from gen_metadata was 'False' </pre></td></tr> - <tr class="err" id="l778"><td><a href="#l778"><span>778</span></a></td><td><pre>caught exception '%s' while processing '%s'(MetadataException('Metadata Exception: pkg ebuild src: dev-perl/DCOP-Amarok-Player-0.036, attr description\nerror: Metadata Exception: pkg ebuild src: dev-perl/DCOP-Amarok-Player-0.036, attr data\nerror: False',), <<class 'pkgcore.ebuild.ebuild_src.package'> cpv='dev-perl/DCOP-Amarok-Player-0.036' @0x7fd32391b910>) + <tr class="err" id="l778"><td><a href="#l778"><span>778</span></a></td><td><pre>caught exception '%s' while processing '%s'(MetadataException('Metadata Exception: pkg ebuild src: dev-perl/DCOP-Amarok-Player-0.036, attr description\nerror: Metadata Exception: pkg ebuild src: dev-perl/DCOP-Amarok-Player-0.036, attr data\nerror: False',), <<class 'pkgcore.ebuild.ebuild_src.package'> cpv='dev-perl/DCOP-Amarok-Player-0.036' @0x7f3ff7221910>) </pre></td><td>[FATAL]</td></tr> <tr class="" id="l779"><td><a href="#l779"><span>779</span></a></td><td><pre>ERROR pkgcore: returned val from gen_metadata was 'False' </pre></td></tr> - <tr class="err" id="l780"><td><a href="#l780"><span>780</span></a></td><td><pre>caught exception '%s' while processing '%s'(MetadataException('Metadata Exception: pkg ebuild src: dev-perl/DCOP-Amarok-Player-0.037, attr description\nerror: Metadata Exception: pkg ebuild src: dev-perl/DCOP-Amarok-Player-0.037, attr data\nerror: False',), <<class 'pkgcore.ebuild.ebuild_src.package'> cpv='dev-perl/DCOP-Amarok-Player-0.037' @0x7fd323a40b90>) + <tr class="err" id="l780"><td><a href="#l780"><span>780</span></a></td><td><pre>caught exception '%s' while processing '%s'(MetadataException('Metadata Exception: pkg ebuild src: dev-perl/DCOP-Amarok-Player-0.037, attr description\nerror: Metadata Exception: pkg ebuild src: dev-perl/DCOP-Amarok-Player-0.037, attr data\nerror: False',), <<class 'pkgcore.ebuild.ebuild_src.package'> cpv='dev-perl/DCOP-Amarok-Player-0.037' @0x7f3ff7346b90>) </pre></td><td>[FATAL]</td></tr> <tr class="" id="l781"><td><a href="#l781"><span>781</span></a></td><td><pre>ERROR pkgcore: returned val from gen_metadata was 'False' </pre></td></tr> - <tr class="err" id="l782"><td><a href="#l782"><span>782</span></a></td><td><pre>caught exception '%s' while processing '%s'(MetadataException('Metadata Exception: pkg ebuild src: dev-perl/DCOP-Amarok-0.035, attr description\nerror: Metadata Exception: pkg ebuild src: dev-perl/DCOP-Amarok-0.035, attr data\nerror: False',), <<class 'pkgcore.ebuild.ebuild_src.package'> cpv='dev-perl/DCOP-Amarok-0.035' @0x7fd32391b910>) + <tr class="err" id="l782"><td><a href="#l782"><span>782</span></a></td><td><pre>caught exception '%s' while processing '%s'(MetadataException('Metadata Exception: pkg ebuild src: dev-perl/DCOP-Amarok-0.035, attr description\nerror: Metadata Exception: pkg ebuild src: dev-perl/DCOP-Amarok-0.035, attr data\nerror: False',), <<class 'pkgcore.ebuild.ebuild_src.package'> cpv='dev-perl/DCOP-Amarok-0.035' @0x7f3ff7221910>) </pre></td><td>[FATAL]</td></tr> <tr class="" id="l783"><td><a href="#l783"><span>783</span></a></td><td><pre>ERROR pkgcore: returned val from gen_metadata was 'False' </pre></td></tr> - <tr class="err" id="l784"><td><a href="#l784"><span>784</span></a></td><td><pre>caught exception '%s' while processing '%s'(MetadataException('Metadata Exception: pkg ebuild src: dev-perl/DCOP-Amarok-0.036, attr description\nerror: Metadata Exception: pkg ebuild src: dev-perl/DCOP-Amarok-0.036, attr data\nerror: False',), <<class 'pkgcore.ebuild.ebuild_src.package'> cpv='dev-perl/DCOP-Amarok-0.036' @0x7fd323a40b90>) + <tr class="err" id="l784"><td><a href="#l784"><span>784</span></a></td><td><pre>caught exception '%s' while processing '%s'(MetadataException('Metadata Exception: pkg ebuild src: dev-perl/DCOP-Amarok-0.036, attr description\nerror: Metadata Exception: pkg ebuild src: dev-perl/DCOP-Amarok-0.036, attr data\nerror: False',), <<class 'pkgcore.ebuild.ebuild_src.package'> cpv='dev-perl/DCOP-Amarok-0.036' @0x7f3ff7346b90>) </pre></td><td>[FATAL]</td></tr> <tr class="" id="l785"><td><a href="#l785"><span>785</span></a></td><td><pre>ERROR pkgcore: returned val from gen_metadata was 'False' </pre></td></tr> - <tr class="err" id="l786"><td><a href="#l786"><span>786</span></a></td><td><pre>caught exception '%s' while processing '%s'(MetadataException('Metadata Exception: pkg ebuild src: dev-perl/DCOP-0.036, attr description\nerror: Metadata Exception: pkg ebuild src: dev-perl/DCOP-0.036, attr data\nerror: False',), <<class 'pkgcore.ebuild.ebuild_src.package'> cpv='dev-perl/DCOP-0.036' @0x7fd32391b910>) + <tr class="err" id="l786"><td><a href="#l786"><span>786</span></a></td><td><pre>caught exception '%s' while processing '%s'(MetadataException('Metadata Exception: pkg ebuild src: dev-perl/DCOP-0.036, attr description\nerror: Metadata Exception: pkg ebuild src: dev-perl/DCOP-0.036, attr data\nerror: False',), <<class 'pkgcore.ebuild.ebuild_src.package'> cpv='dev-perl/DCOP-0.036' @0x7f3ff7221910>) </pre></td><td>[FATAL]</td></tr> <tr class="" id="l787"><td><a href="#l787"><span>787</span></a></td><td><pre>ERROR pkgcore: returned val from gen_metadata was 'False' </pre></td></tr> @@ -2026,51 +2026,51 @@ </pre></td></tr> <tr class="" id="l1008"><td><a href="#l1008"><span>1008</span></a></td><td><pre> </pre></td></tr> - <tr class="" id="l1009"><td><a href="#l1009"><span>1009</span></a></td><td><pre> <<class 'pkgcore.ebuild.ebuild_src.package'> cpv='dev-perl/DCOP-0.038' @0x7fd323a40b90>) + <tr class="" id="l1009"><td><a href="#l1009"><span>1009</span></a></td><td><pre> <<class 'pkgcore.ebuild.ebuild_src.package'> cpv='dev-perl/DCOP-0.038' @0x7f3ff7346b90>) </pre></td></tr> <tr class="" id="l1010"><td><a href="#l1010"><span>1010</span></a></td><td><pre>ERROR pkgcore: returned val from gen_metadata was 'False' </pre></td></tr> - <tr class="err" id="l1011"><td><a href="#l1011"><span>1011</span></a></td><td><pre>caught exception '%s' while processing '%s'(MetadataException('Metadata Exception: pkg ebuild src: dev-perl/PerlQt-3.009_beta2, attr description\nerror: Metadata Exception: pkg ebuild src: dev-perl/PerlQt-3.009_beta2, attr data\nerror: False',), <<class 'pkgcore.ebuild.ebuild_src.package'> cpv='dev-perl/PerlQt-3.009_beta2' @0x7fd32391b910>) + <tr class="err" id="l1011"><td><a href="#l1011"><span>1011</span></a></td><td><pre>caught exception '%s' while processing '%s'(MetadataException('Metadata Exception: pkg ebuild src: dev-perl/PerlQt-3.009_beta2, attr description\nerror: Metadata Exception: pkg ebuild src: dev-perl/PerlQt-3.009_beta2, attr data\nerror: False',), <<class 'pkgcore.ebuild.ebuild_src.package'> cpv='dev-perl/PerlQt-3.009_beta2' @0x7f3ff7221910>) </pre></td><td>[FATAL]</td></tr> <tr class="" id="l1012"><td><a href="#l1012"><span>1012</span></a></td><td><pre>ERROR pkgcore: returned val from gen_metadata was 'False' </pre></td></tr> - <tr class="err" id="l1013"><td><a href="#l1013"><span>1013</span></a></td><td><pre>caught exception '%s' while processing '%s'(MetadataException('Metadata Exception: pkg ebuild src: net-misc/gwget-1.0.4-r1, attr description\nerror: Metadata Exception: pkg ebuild src: net-misc/gwget-1.0.4-r1, attr data\nerror: False',), <<class 'pkgcore.ebuild.ebuild_src.package'> cpv='net-misc/gwget-1.0.4-r1' @0x7fd3238dd910>) + <tr class="err" id="l1013"><td><a href="#l1013"><span>1013</span></a></td><td><pre>caught exception '%s' while processing '%s'(MetadataException('Metadata Exception: pkg ebuild src: net-misc/gwget-1.0.4-r1, attr description\nerror: Metadata Exception: pkg ebuild src: net-misc/gwget-1.0.4-r1, attr data\nerror: False',), <<class 'pkgcore.ebuild.ebuild_src.package'> cpv='net-misc/gwget-1.0.4-r1' @0x7f3ff71e3910>) </pre></td><td>[FATAL]</td></tr> <tr class="" id="l1014"><td><a href="#l1014"><span>1014</span></a></td><td><pre>ERROR pkgcore: returned val from gen_metadata was 'False' </pre></td></tr> - <tr class="err" id="l1015"><td><a href="#l1015"><span>1015</span></a></td><td><pre>caught exception '%s' while processing '%s'(MetadataException('Metadata Exception: pkg ebuild src: media-video/asdf-0.4, attr description\nerror: Metadata Exception: pkg ebuild src: media-video/asdf-0.4, attr data\nerror: False',), <<class 'pkgcore.ebuild.ebuild_src.package'> cpv='media-video/asdf-0.4' @0x7fd3238757d0>) + <tr class="err" id="l1015"><td><a href="#l1015"><span>1015</span></a></td><td><pre>caught exception '%s' while processing '%s'(MetadataException('Metadata Exception: pkg ebuild src: media-video/asdf-0.4, attr description\nerror: Metadata Exception: pkg ebuild src: media-video/asdf-0.4, attr data\nerror: False',), <<class 'pkgcore.ebuild.ebuild_src.package'> cpv='media-video/asdf-0.4' @0x7f3ff717b7d0>) </pre></td><td>[FATAL]</td></tr> <tr class="" id="l1016"><td><a href="#l1016"><span>1016</span></a></td><td><pre>ERROR pkgcore: returned val from gen_metadata was 'False' </pre></td></tr> - <tr class="err" id="l1017"><td><a href="#l1017"><span>1017</span></a></td><td><pre>caught exception '%s' while processing '%s'(MetadataException('Metadata Exception: pkg ebuild src: media-video/dpencoder-0.6c, attr description\nerror: Metadata Exception: pkg ebuild src: media-video/dpencoder-0.6c, attr data\nerror: False',), <<class 'pkgcore.ebuild.ebuild_src.package'> cpv='media-video/dpencoder-0.6c' @0x7fd323875cd0>) + <tr class="err" id="l1017"><td><a href="#l1017"><span>1017</span></a></td><td><pre>caught exception '%s' while processing '%s'(MetadataException('Metadata Exception: pkg ebuild src: media-video/dpencoder-0.6c, attr description\nerror: Metadata Exception: pkg ebuild src: media-video/dpencoder-0.6c, attr data\nerror: False',), <<class 'pkgcore.ebuild.ebuild_src.package'> cpv='media-video/dpencoder-0.6c' @0x7f3ff717bcd0>) </pre></td><td>[FATAL]</td></tr> <tr class="" id="l1018"><td><a href="#l1018"><span>1018</span></a></td><td><pre>ERROR pkgcore: returned val from gen_metadata was 'False' </pre></td></tr> - <tr class="err" id="l1019"><td><a href="#l1019"><span>1019</span></a></td><td><pre>caught exception '%s' while processing '%s'(MetadataException('Metadata Exception: pkg ebuild src: x11-themes/gtk-engines-qt-0.8-r4, attr description\nerror: Metadata Exception: pkg ebuild src: x11-themes/gtk-engines-qt-0.8-r4, attr data\nerror: False',), <<class 'pkgcore.ebuild.ebuild_src.package'> cpv='x11-themes/gtk-engines-qt-0.8-r4' @0x7fd323838e10>) + <tr class="err" id="l1019"><td><a href="#l1019"><span>1019</span></a></td><td><pre>caught exception '%s' while processing '%s'(MetadataException('Metadata Exception: pkg ebuild src: x11-themes/gtk-engines-qt-0.8-r4, attr description\nerror: Metadata Exception: pkg ebuild src: x11-themes/gtk-engines-qt-0.8-r4, attr data\nerror: False',), <<class 'pkgcore.ebuild.ebuild_src.package'> cpv='x11-themes/gtk-engines-qt-0.8-r4' @0x7f3ff713ee10>) </pre></td><td>[FATAL]</td></tr> <tr class="" id="l1020"><td><a href="#l1020"><span>1020</span></a></td><td><pre>ERROR pkgcore: returned val from gen_metadata was 'False' </pre></td></tr> - <tr class="err" id="l1021"><td><a href="#l1021"><span>1021</span></a></td><td><pre>caught exception '%s' while processing '%s'(MetadataException('Metadata Exception: pkg ebuild src: x11-themes/qtcurve-0.59.2, attr description\nerror: Metadata Exception: pkg ebuild src: x11-themes/qtcurve-0.59.2, attr data\nerror: False',), <<class 'pkgcore.ebuild.ebuild_src.package'> cpv='x11-themes/qtcurve-0.59.2' @0x7fd323841690>) + <tr class="err" id="l1021"><td><a href="#l1021"><span>1021</span></a></td><td><pre>caught exception '%s' while processing '%s'(MetadataException('Metadata Exception: pkg ebuild src: x11-themes/qtcurve-0.59.2, attr description\nerror: Metadata Exception: pkg ebuild src: x11-themes/qtcurve-0.59.2, attr data\nerror: False',), <<class 'pkgcore.ebuild.ebuild_src.package'> cpv='x11-themes/qtcurve-0.59.2' @0x7f3ff7147690>) </pre></td><td>[FATAL]</td></tr> <tr class="" id="l1022"><td><a href="#l1022"><span>1022</span></a></td><td><pre>ERROR pkgcore: returned val from gen_metadata was 'False' </pre></td></tr> - <tr class="err" id="l1023"><td><a href="#l1023"><span>1023</span></a></td><td><pre>caught exception '%s' while processing '%s'(MetadataException('Metadata Exception: pkg ebuild src: x11-themes/qtcurve-0.59.5, attr description\nerror: Metadata Exception: pkg ebuild src: x11-themes/qtcurve-0.59.5, attr data\nerror: False',), <<class 'pkgcore.ebuild.ebuild_src.package'> cpv='x11-themes/qtcurve-0.59.5' @0x7fd323838e10>) + <tr class="err" id="l1023"><td><a href="#l1023"><span>1023</span></a></td><td><pre>caught exception '%s' while processing '%s'(MetadataException('Metadata Exception: pkg ebuild src: x11-themes/qtcurve-0.59.5, attr description\nerror: Metadata Exception: pkg ebuild src: x11-themes/qtcurve-0.59.5, attr data\nerror: False',), <<class 'pkgcore.ebuild.ebuild_src.package'> cpv='x11-themes/qtcurve-0.59.5' @0x7f3ff713ee10>) </pre></td><td>[FATAL]</td></tr> <tr class="" id="l1024"><td><a href="#l1024"><span>1024</span></a></td><td><pre>ERROR pkgcore: returned val from gen_metadata was 'False' </pre></td></tr> - <tr class="err" id="l1025"><td><a href="#l1025"><span>1025</span></a></td><td><pre>caught exception '%s' while processing '%s'(MetadataException('Metadata Exception: pkg ebuild src: x11-themes/qtcurve-0.65.2, attr description\nerror: Metadata Exception: pkg ebuild src: x11-themes/qtcurve-0.65.2, attr data\nerror: False',), <<class 'pkgcore.ebuild.ebuild_src.package'> cpv='x11-themes/qtcurve-0.65.2' @0x7fd323841690>) + <tr class="err" id="l1025"><td><a href="#l1025"><span>1025</span></a></td><td><pre>caught exception '%s' while processing '%s'(MetadataException('Metadata Exception: pkg ebuild src: x11-themes/qtcurve-0.65.2, attr description\nerror: Metadata Exception: pkg ebuild src: x11-themes/qtcurve-0.65.2, attr data\nerror: False',), <<class 'pkgcore.ebuild.ebuild_src.package'> cpv='x11-themes/qtcurve-0.65.2' @0x7f3ff7147690>) </pre></td><td>[FATAL]</td></tr> <tr class="" id="l1026"><td><a href="#l1026"><span>1026</span></a></td><td><pre>ERROR pkgcore: returned val from gen_metadata was 'False' </pre></td></tr> - <tr class="err" id="l1027"><td><a href="#l1027"><span>1027</span></a></td><td><pre>caught exception '%s' while processing '%s'(MetadataException('Metadata Exception: pkg ebuild src: x11-themes/qtcurve-0.68.1, attr description\nerror: Metadata Exception: pkg ebuild src: x11-themes/qtcurve-0.68.1, attr data\nerror: False',), <<class 'pkgcore.ebuild.ebuild_src.package'> cpv='x11-themes/qtcurve-0.68.1' @0x7fd323838e10>) + <tr class="err" id="l1027"><td><a href="#l1027"><span>1027</span></a></td><td><pre>caught exception '%s' while processing '%s'(MetadataException('Metadata Exception: pkg ebuild src: x11-themes/qtcurve-0.68.1, attr description\nerror: Metadata Exception: pkg ebuild src: x11-themes/qtcurve-0.68.1, attr data\nerror: False',), <<class 'pkgcore.ebuild.ebuild_src.package'> cpv='x11-themes/qtcurve-0.68.1' @0x7f3ff713ee10>) </pre></td><td>[FATAL]</td></tr> <tr class="" id="l1028"><td><a href="#l1028"><span>1028</span></a></td><td><pre>ERROR pkgcore: returned val from gen_metadata was 'False' </pre></td></tr> - <tr class="err" id="l1029"><td><a href="#l1029"><span>1029</span></a></td><td><pre>caught exception '%s' while processing '%s'(MetadataException('Metadata Exception: pkg ebuild src: x11-themes/qtcurve-0.69.1, attr description\nerror: Metadata Exception: pkg ebuild src: x11-themes/qtcurve-0.69.1, attr data\nerror: False',), <<class 'pkgcore.ebuild.ebuild_src.package'> cpv='x11-themes/qtcurve-0.69.1' @0x7fd323841690>) + <tr class="err" id="l1029"><td><a href="#l1029"><span>1029</span></a></td><td><pre>caught exception '%s' while processing '%s'(MetadataException('Metadata Exception: pkg ebuild src: x11-themes/qtcurve-0.69.1, attr description\nerror: Metadata Exception: pkg ebuild src: x11-themes/qtcurve-0.69.1, attr data\nerror: False',), <<class 'pkgcore.ebuild.ebuild_src.package'> cpv='x11-themes/qtcurve-0.69.1' @0x7f3ff7147690>) </pre></td><td>[FATAL]</td></tr> <tr class="" id="l1030"><td><a href="#l1030"><span>1030</span></a></td><td><pre>ERROR pkgcore: returned val from gen_metadata was 'False' </pre></td></tr> - <tr class="err" id="l1031"><td><a href="#l1031"><span>1031</span></a></td><td><pre>caught exception '%s' while processing '%s'(MetadataException('Metadata Exception: pkg ebuild src: kde-base/dcopperl-3.5.10, attr description\nerror: Metadata Exception: pkg ebuild src: kde-base/dcopperl-3.5.10, attr data\nerror: False',), <<class 'pkgcore.ebuild.ebuild_src.package'> cpv='kde-base/dcopperl-3.5.10' @0x7fd3237f92d0>) + <tr class="err" id="l1031"><td><a href="#l1031"><span>1031</span></a></td><td><pre>caught exception '%s' while processing '%s'(MetadataException('Metadata Exception: pkg ebuild src: kde-base/dcopperl-3.5.10, attr description\nerror: Metadata Exception: pkg ebuild src: kde-base/dcopperl-3.5.10, attr data\nerror: False',), <<class 'pkgcore.ebuild.ebuild_src.package'> cpv='kde-base/dcopperl-3.5.10' @0x7f3ff70ff2d0>) </pre></td><td>[FATAL]</td></tr> <tr class="" id="l1032"><td><a href="#l1032"><span>1032</span></a></td><td><pre> * Cache regen failed with 1 </pre></td></tr> diff --git a/rainyday.txt b/rainyday.txt index 3f007de6252f..0623f5cc8560 100644 --- a/rainyday.txt +++ b/rainyday.txt @@ -561,7 +561,7 @@ ERROR pkgcore: returned val from gen_metadata was 'False' ERROR pkgcore: returned val from gen_metadata was 'False' !!! caught exception False while processing ebuild src: kde-base/dcopperl-3.5.10 ERROR pkgcore: returned val from gen_metadata was 'False' -caught exception '%s' while processing '%s'(MetadataException('Metadata Exception: pkg ebuild src: app-pda/libopensync-plugin-kdepim-0.35, attr description\nerror: Metadata Exception: pkg ebuild src: app-pda/libopensync-plugin-kdepim-0.35, attr data\nerror: False',), <<class 'pkgcore.ebuild.ebuild_src.package'> cpv='app-pda/libopensync-plugin-kdepim-0.35' @0x7fd323ed87d0>) +caught exception '%s' while processing '%s'(MetadataException('Metadata Exception: pkg ebuild src: app-pda/libopensync-plugin-kdepim-0.35, attr description\nerror: Metadata Exception: pkg ebuild src: app-pda/libopensync-plugin-kdepim-0.35, attr data\nerror: False',), <<class 'pkgcore.ebuild.ebuild_src.package'> cpv='app-pda/libopensync-plugin-kdepim-0.35' @0x7f3ff77de7d0>) ERROR pkgcore: returned val from gen_metadata was 'False' caught exception '%s' while processing '%s'(MetadataException('Metadata Exception: pkg ebuild src: app-pda/libopensync-plugin-kdepim-0.36, attr description\nerror: Metadata Exception: pkg ebuild src: app-pda/libopensync-plugin-kdepim-0.36, attr data\nerror: False',), <<class 'pkgcore.ebuild.ebuild_src !!! ERROR: app-pda/libopensync-plugin-kdepim-9999 failed. @@ -765,25 +765,25 @@ caught exception '%s' while processing '%s'(MetadataException('Metadata Exceptio !!! The die message: !!! EAPI= is not supported by perl-module.eclass -.package'> cpv='app-pda/libopensync-plugin-kdepim-0.36' @0x7fd323ed8910>) +.package'> cpv='app-pda/libopensync-plugin-kdepim-0.36' @0x7f3ff77de910>) ERROR pkgcore: returned val from gen_metadata was 'False' -caught exception '%s' while processing '%s'(MetadataException('Metadata Exception: pkg ebuild src: app-pda/libopensync-plugin-kdepim-9999, attr description\nerror: Metadata Exception: pkg ebuild src: app-pda/libopensync-plugin-kdepim-9999, attr data\nerror: False',), <<class 'pkgcore.ebuild.ebuild_src.package'> cpv='app-pda/libopensync-plugin-kdepim-9999' @0x7fd323ed87d0>) +caught exception '%s' while processing '%s'(MetadataException('Metadata Exception: pkg ebuild src: app-pda/libopensync-plugin-kdepim-9999, attr description\nerror: Metadata Exception: pkg ebuild src: app-pda/libopensync-plugin-kdepim-9999, attr data\nerror: False',), <<class 'pkgcore.ebuild.ebuild_src.package'> cpv='app-pda/libopensync-plugin-kdepim-9999' @0x7f3ff77de7d0>) ERROR pkgcore: returned val from gen_metadata was 'False' -caught exception '%s' while processing '%s'(MetadataException('Metadata Exception: pkg ebuild src: x11-wm/metacity-2.30.3, attr description\nerror: Metadata Exception: pkg ebuild src: x11-wm/metacity-2.30.3, attr data\nerror: False',), <<class 'pkgcore.ebuild.ebuild_src.package'> cpv='x11-wm/metacity-2.30.3' @0x7fd323a40b90>) +caught exception '%s' while processing '%s'(MetadataException('Metadata Exception: pkg ebuild src: x11-wm/metacity-2.30.3, attr description\nerror: Metadata Exception: pkg ebuild src: x11-wm/metacity-2.30.3, attr data\nerror: False',), <<class 'pkgcore.ebuild.ebuild_src.package'> cpv='x11-wm/metacity-2.30.3' @0x7f3ff7346b90>) ERROR pkgcore: returned val from gen_metadata was 'False' -caught exception '%s' while processing '%s'(MetadataException('Metadata Exception: pkg ebuild src: x11-libs/compizconfig-backend-kconfig4-0.8.4, attr description\nerror: Metadata Exception: pkg ebuild src: x11-libs/compizconfig-backend-kconfig4-0.8.4, attr data\nerror: False',), <<class 'pkgcore.ebuild.ebuild_src.package'> cpv='x11-libs/compizconfig-backend-kconfig4-0.8.4' @0x7fd3238f4690>) +caught exception '%s' while processing '%s'(MetadataException('Metadata Exception: pkg ebuild src: x11-libs/compizconfig-backend-kconfig4-0.8.4, attr description\nerror: Metadata Exception: pkg ebuild src: x11-libs/compizconfig-backend-kconfig4-0.8.4, attr data\nerror: False',), <<class 'pkgcore.ebuild.ebuild_src.package'> cpv='x11-libs/compizconfig-backend-kconfig4-0.8.4' @0x7f3ff71fa690>) ERROR pkgcore: returned val from gen_metadata was 'False' -caught exception '%s' while processing '%s'(MetadataException('Metadata Exception: pkg ebuild src: x11-libs/compizconfig-backend-kconfig4-0.8.8, attr description\nerror: Metadata Exception: pkg ebuild src: x11-libs/compizconfig-backend-kconfig4-0.8.8, attr data\nerror: False',), <<class 'pkgcore.ebuild.ebuild_src.package'> cpv='x11-libs/compizconfig-backend-kconfig4-0.8.8' @0x7fd323a40b90>) +caught exception '%s' while processing '%s'(MetadataException('Metadata Exception: pkg ebuild src: x11-libs/compizconfig-backend-kconfig4-0.8.8, attr description\nerror: Metadata Exception: pkg ebuild src: x11-libs/compizconfig-backend-kconfig4-0.8.8, attr data\nerror: False',), <<class 'pkgcore.ebuild.ebuild_src.package'> cpv='x11-libs/compizconfig-backend-kconfig4-0.8.8' @0x7f3ff7346b90>) ERROR pkgcore: returned val from gen_metadata was 'False' -caught exception '%s' while processing '%s'(MetadataException('Metadata Exception: pkg ebuild src: dev-perl/DCOP-Amarok-Player-0.036, attr description\nerror: Metadata Exception: pkg ebuild src: dev-perl/DCOP-Amarok-Player-0.036, attr data\nerror: False',), <<class 'pkgcore.ebuild.ebuild_src.package'> cpv='dev-perl/DCOP-Amarok-Player-0.036' @0x7fd32391b910>) +caught exception '%s' while processing '%s'(MetadataException('Metadata Exception: pkg ebuild src: dev-perl/DCOP-Amarok-Player-0.036, attr description\nerror: Metadata Exception: pkg ebuild src: dev-perl/DCOP-Amarok-Player-0.036, attr data\nerror: False',), <<class 'pkgcore.ebuild.ebuild_src.package'> cpv='dev-perl/DCOP-Amarok-Player-0.036' @0x7f3ff7221910>) ERROR pkgcore: returned val from gen_metadata was 'False' -caught exception '%s' while processing '%s'(MetadataException('Metadata Exception: pkg ebuild src: dev-perl/DCOP-Amarok-Player-0.037, attr description\nerror: Metadata Exception: pkg ebuild src: dev-perl/DCOP-Amarok-Player-0.037, attr data\nerror: False',), <<class 'pkgcore.ebuild.ebuild_src.package'> cpv='dev-perl/DCOP-Amarok-Player-0.037' @0x7fd323a40b90>) +caught exception '%s' while processing '%s'(MetadataException('Metadata Exception: pkg ebuild src: dev-perl/DCOP-Amarok-Player-0.037, attr description\nerror: Metadata Exception: pkg ebuild src: dev-perl/DCOP-Amarok-Player-0.037, attr data\nerror: False',), <<class 'pkgcore.ebuild.ebuild_src.package'> cpv='dev-perl/DCOP-Amarok-Player-0.037' @0x7f3ff7346b90>) ERROR pkgcore: returned val from gen_metadata was 'False' -caught exception '%s' while processing '%s'(MetadataException('Metadata Exception: pkg ebuild src: dev-perl/DCOP-Amarok-0.035, attr description\nerror: Metadata Exception: pkg ebuild src: dev-perl/DCOP-Amarok-0.035, attr data\nerror: False',), <<class 'pkgcore.ebuild.ebuild_src.package'> cpv='dev-perl/DCOP-Amarok-0.035' @0x7fd32391b910>) +caught exception '%s' while processing '%s'(MetadataException('Metadata Exception: pkg ebuild src: dev-perl/DCOP-Amarok-0.035, attr description\nerror: Metadata Exception: pkg ebuild src: dev-perl/DCOP-Amarok-0.035, attr data\nerror: False',), <<class 'pkgcore.ebuild.ebuild_src.package'> cpv='dev-perl/DCOP-Amarok-0.035' @0x7f3ff7221910>) ERROR pkgcore: returned val from gen_metadata was 'False' -caught exception '%s' while processing '%s'(MetadataException('Metadata Exception: pkg ebuild src: dev-perl/DCOP-Amarok-0.036, attr description\nerror: Metadata Exception: pkg ebuild src: dev-perl/DCOP-Amarok-0.036, attr data\nerror: False',), <<class 'pkgcore.ebuild.ebuild_src.package'> cpv='dev-perl/DCOP-Amarok-0.036' @0x7fd323a40b90>) +caught exception '%s' while processing '%s'(MetadataException('Metadata Exception: pkg ebuild src: dev-perl/DCOP-Amarok-0.036, attr description\nerror: Metadata Exception: pkg ebuild src: dev-perl/DCOP-Amarok-0.036, attr data\nerror: False',), <<class 'pkgcore.ebuild.ebuild_src.package'> cpv='dev-perl/DCOP-Amarok-0.036' @0x7f3ff7346b90>) ERROR pkgcore: returned val from gen_metadata was 'False' -caught exception '%s' while processing '%s'(MetadataException('Metadata Exception: pkg ebuild src: dev-perl/DCOP-0.036, attr description\nerror: Metadata Exception: pkg ebuild src: dev-perl/DCOP-0.036, attr data\nerror: False',), <<class 'pkgcore.ebuild.ebuild_src.package'> cpv='dev-perl/DCOP-0.036' @0x7fd32391b910>) +caught exception '%s' while processing '%s'(MetadataException('Metadata Exception: pkg ebuild src: dev-perl/DCOP-0.036, attr description\nerror: Metadata Exception: pkg ebuild src: dev-perl/DCOP-0.036, attr data\nerror: False',), <<class 'pkgcore.ebuild.ebuild_src.package'> cpv='dev-perl/DCOP-0.036' @0x7f3ff7221910>) ERROR pkgcore: returned val from gen_metadata was 'False' caught exception '%s' while processing '%s'(MetadataException('Metadata Exception: pkg ebuild src: dev-perl/DCOP-0.038, attr description\nerror: Metadata Exception: pkg ebuild src: dev-perl/DCOP-0.038, attr data\nerror: False',), !!! ERROR: dev-perl/PerlQt-3.009_beta2 failed. @@ -1006,27 +1006,27 @@ caught exception '%s' while processing '%s'(MetadataException('Metadata Exceptio !!! The die message: !!! EAPI=1 is not supported by perl-module.eclass - <<class 'pkgcore.ebuild.ebuild_src.package'> cpv='dev-perl/DCOP-0.038' @0x7fd323a40b90>) + <<class 'pkgcore.ebuild.ebuild_src.package'> cpv='dev-perl/DCOP-0.038' @0x7f3ff7346b90>) ERROR pkgcore: returned val from gen_metadata was 'False' -caught exception '%s' while processing '%s'(MetadataException('Metadata Exception: pkg ebuild src: dev-perl/PerlQt-3.009_beta2, attr description\nerror: Metadata Exception: pkg ebuild src: dev-perl/PerlQt-3.009_beta2, attr data\nerror: False',), <<class 'pkgcore.ebuild.ebuild_src.package'> cpv='dev-perl/PerlQt-3.009_beta2' @0x7fd32391b910>) +caught exception '%s' while processing '%s'(MetadataException('Metadata Exception: pkg ebuild src: dev-perl/PerlQt-3.009_beta2, attr description\nerror: Metadata Exception: pkg ebuild src: dev-perl/PerlQt-3.009_beta2, attr data\nerror: False',), <<class 'pkgcore.ebuild.ebuild_src.package'> cpv='dev-perl/PerlQt-3.009_beta2' @0x7f3ff7221910>) ERROR pkgcore: returned val from gen_metadata was 'False' -caught exception '%s' while processing '%s'(MetadataException('Metadata Exception: pkg ebuild src: net-misc/gwget-1.0.4-r1, attr description\nerror: Metadata Exception: pkg ebuild src: net-misc/gwget-1.0.4-r1, attr data\nerror: False',), <<class 'pkgcore.ebuild.ebuild_src.package'> cpv='net-misc/gwget-1.0.4-r1' @0x7fd3238dd910>) +caught exception '%s' while processing '%s'(MetadataException('Metadata Exception: pkg ebuild src: net-misc/gwget-1.0.4-r1, attr description\nerror: Metadata Exception: pkg ebuild src: net-misc/gwget-1.0.4-r1, attr data\nerror: False',), <<class 'pkgcore.ebuild.ebuild_src.package'> cpv='net-misc/gwget-1.0.4-r1' @0x7f3ff71e3910>) ERROR pkgcore: returned val from gen_metadata was 'False' -caught exception '%s' while processing '%s'(MetadataException('Metadata Exception: pkg ebuild src: media-video/asdf-0.4, attr description\nerror: Metadata Exception: pkg ebuild src: media-video/asdf-0.4, attr data\nerror: False',), <<class 'pkgcore.ebuild.ebuild_src.package'> cpv='media-video/asdf-0.4' @0x7fd3238757d0>) +caught exception '%s' while processing '%s'(MetadataException('Metadata Exception: pkg ebuild src: media-video/asdf-0.4, attr description\nerror: Metadata Exception: pkg ebuild src: media-video/asdf-0.4, attr data\nerror: False',), <<class 'pkgcore.ebuild.ebuild_src.package'> cpv='media-video/asdf-0.4' @0x7f3ff717b7d0>) ERROR pkgcore: returned val from gen_metadata was 'False' -caught exception '%s' while processing '%s'(MetadataException('Metadata Exception: pkg ebuild src: media-video/dpencoder-0.6c, attr description\nerror: Metadata Exception: pkg ebuild src: media-video/dpencoder-0.6c, attr data\nerror: False',), <<class 'pkgcore.ebuild.ebuild_src.package'> cpv='media-video/dpencoder-0.6c' @0x7fd323875cd0>) +caught exception '%s' while processing '%s'(MetadataException('Metadata Exception: pkg ebuild src: media-video/dpencoder-0.6c, attr description\nerror: Metadata Exception: pkg ebuild src: media-video/dpencoder-0.6c, attr data\nerror: False',), <<class 'pkgcore.ebuild.ebuild_src.package'> cpv='media-video/dpencoder-0.6c' @0x7f3ff717bcd0>) ERROR pkgcore: returned val from gen_metadata was 'False' -caught exception '%s' while processing '%s'(MetadataException('Metadata Exception: pkg ebuild src: x11-themes/gtk-engines-qt-0.8-r4, attr description\nerror: Metadata Exception: pkg ebuild src: x11-themes/gtk-engines-qt-0.8-r4, attr data\nerror: False',), <<class 'pkgcore.ebuild.ebuild_src.package'> cpv='x11-themes/gtk-engines-qt-0.8-r4' @0x7fd323838e10>) +caught exception '%s' while processing '%s'(MetadataException('Metadata Exception: pkg ebuild src: x11-themes/gtk-engines-qt-0.8-r4, attr description\nerror: Metadata Exception: pkg ebuild src: x11-themes/gtk-engines-qt-0.8-r4, attr data\nerror: False',), <<class 'pkgcore.ebuild.ebuild_src.package'> cpv='x11-themes/gtk-engines-qt-0.8-r4' @0x7f3ff713ee10>) ERROR pkgcore: returned val from gen_metadata was 'False' -caught exception '%s' while processing '%s'(MetadataException('Metadata Exception: pkg ebuild src: x11-themes/qtcurve-0.59.2, attr description\nerror: Metadata Exception: pkg ebuild src: x11-themes/qtcurve-0.59.2, attr data\nerror: False',), <<class 'pkgcore.ebuild.ebuild_src.package'> cpv='x11-themes/qtcurve-0.59.2' @0x7fd323841690>) +caught exception '%s' while processing '%s'(MetadataException('Metadata Exception: pkg ebuild src: x11-themes/qtcurve-0.59.2, attr description\nerror: Metadata Exception: pkg ebuild src: x11-themes/qtcurve-0.59.2, attr data\nerror: False',), <<class 'pkgcore.ebuild.ebuild_src.package'> cpv='x11-themes/qtcurve-0.59.2' @0x7f3ff7147690>) ERROR pkgcore: returned val from gen_metadata was 'False' -caught exception '%s' while processing '%s'(MetadataException('Metadata Exception: pkg ebuild src: x11-themes/qtcurve-0.59.5, attr description\nerror: Metadata Exception: pkg ebuild src: x11-themes/qtcurve-0.59.5, attr data\nerror: False',), <<class 'pkgcore.ebuild.ebuild_src.package'> cpv='x11-themes/qtcurve-0.59.5' @0x7fd323838e10>) +caught exception '%s' while processing '%s'(MetadataException('Metadata Exception: pkg ebuild src: x11-themes/qtcurve-0.59.5, attr description\nerror: Metadata Exception: pkg ebuild src: x11-themes/qtcurve-0.59.5, attr data\nerror: False',), <<class 'pkgcore.ebuild.ebuild_src.package'> cpv='x11-themes/qtcurve-0.59.5' @0x7f3ff713ee10>) ERROR pkgcore: returned val from gen_metadata was 'False' -caught exception '%s' while processing '%s'(MetadataException('Metadata Exception: pkg ebuild src: x11-themes/qtcurve-0.65.2, attr description\nerror: Metadata Exception: pkg ebuild src: x11-themes/qtcurve-0.65.2, attr data\nerror: False',), <<class 'pkgcore.ebuild.ebuild_src.package'> cpv='x11-themes/qtcurve-0.65.2' @0x7fd323841690>) +caught exception '%s' while processing '%s'(MetadataException('Metadata Exception: pkg ebuild src: x11-themes/qtcurve-0.65.2, attr description\nerror: Metadata Exception: pkg ebuild src: x11-themes/qtcurve-0.65.2, attr data\nerror: False',), <<class 'pkgcore.ebuild.ebuild_src.package'> cpv='x11-themes/qtcurve-0.65.2' @0x7f3ff7147690>) ERROR pkgcore: returned val from gen_metadata was 'False' -caught exception '%s' while processing '%s'(MetadataException('Metadata Exception: pkg ebuild src: x11-themes/qtcurve-0.68.1, attr description\nerror: Metadata Exception: pkg ebuild src: x11-themes/qtcurve-0.68.1, attr data\nerror: False',), <<class 'pkgcore.ebuild.ebuild_src.package'> cpv='x11-themes/qtcurve-0.68.1' @0x7fd323838e10>) +caught exception '%s' while processing '%s'(MetadataException('Metadata Exception: pkg ebuild src: x11-themes/qtcurve-0.68.1, attr description\nerror: Metadata Exception: pkg ebuild src: x11-themes/qtcurve-0.68.1, attr data\nerror: False',), <<class 'pkgcore.ebuild.ebuild_src.package'> cpv='x11-themes/qtcurve-0.68.1' @0x7f3ff713ee10>) ERROR pkgcore: returned val from gen_metadata was 'False' -caught exception '%s' while processing '%s'(MetadataException('Metadata Exception: pkg ebuild src: x11-themes/qtcurve-0.69.1, attr description\nerror: Metadata Exception: pkg ebuild src: x11-themes/qtcurve-0.69.1, attr data\nerror: False',), <<class 'pkgcore.ebuild.ebuild_src.package'> cpv='x11-themes/qtcurve-0.69.1' @0x7fd323841690>) +caught exception '%s' while processing '%s'(MetadataException('Metadata Exception: pkg ebuild src: x11-themes/qtcurve-0.69.1, attr description\nerror: Metadata Exception: pkg ebuild src: x11-themes/qtcurve-0.69.1, attr data\nerror: False',), <<class 'pkgcore.ebuild.ebuild_src.package'> cpv='x11-themes/qtcurve-0.69.1' @0x7f3ff7147690>) ERROR pkgcore: returned val from gen_metadata was 'False' -caught exception '%s' while processing '%s'(MetadataException('Metadata Exception: pkg ebuild src: kde-base/dcopperl-3.5.10, attr description\nerror: Metadata Exception: pkg ebuild src: kde-base/dcopperl-3.5.10, attr data\nerror: False',), <<class 'pkgcore.ebuild.ebuild_src.package'> cpv='kde-base/dcopperl-3.5.10' @0x7fd3237f92d0>) +caught exception '%s' while processing '%s'(MetadataException('Metadata Exception: pkg ebuild src: kde-base/dcopperl-3.5.10, attr description\nerror: Metadata Exception: pkg ebuild src: kde-base/dcopperl-3.5.10, attr data\nerror: False',), <<class 'pkgcore.ebuild.ebuild_src.package'> cpv='kde-base/dcopperl-3.5.10' @0x7f3ff70ff2d0>) * Cache regen failed with 1 @@ -132,13 +132,13 @@ </pre></td></tr> <tr class="" id="l61"><td><a href="#l61"><span>61</span></a></td><td><pre> </pre></td></tr> - <tr class="" id="l62"><td><a href="#l62"><span>62</span></a></td><td><pre>sandbox:stop caught signal 15 in pid 10710 + <tr class="" id="l62"><td><a href="#l62"><span>62</span></a></td><td><pre>sandbox:stop caught signal 15 in pid 8855 </pre></td></tr> <tr class="" id="l63"><td><a href="#l63"><span>63</span></a></td><td><pre>Sandboxed process killed by signal: Terminated </pre></td></tr> <tr class="err" id="l64"><td><a href="#l64"><span>64</span></a></td><td><pre>!!! caught exception inherit requires an unknown eclass, git cannot be found while processing ebuild src: sys-cluster/kerrighed-9999-r1 </pre></td><td>[FATAL]</td></tr> - <tr class="err" id="l65"><td><a href="#l65"><span>65</span></a></td><td><pre>caught exception '%s' while processing '%s'(MetadataException('Metadata Exception: pkg ebuild src: sys-cluster/kerrighed-9999-r1, attr description\nerror: Metadata Exception: pkg ebuild src: sys-cluster/kerrighed-9999-r1, attr data\nerror: inherit requires an unknown eclass, git cannot be found',), <<class 'pkgcore.ebuild.ebuild_src.package'> cpv='sys-cluster/kerrighed-9999-r1' @0x7fb216531410>) + <tr class="err" id="l65"><td><a href="#l65"><span>65</span></a></td><td><pre>caught exception '%s' while processing '%s'(MetadataException('Metadata Exception: pkg ebuild src: sys-cluster/kerrighed-9999-r1, attr description\nerror: Metadata Exception: pkg ebuild src: sys-cluster/kerrighed-9999-r1, attr data\nerror: inherit requires an unknown eclass, git cannot be found',), <<class 'pkgcore.ebuild.ebuild_src.package'> cpv='sys-cluster/kerrighed-9999-r1' @0x7ffad0b8a410>) </pre></td><td>[FATAL]</td></tr> <tr class="" id="l66"><td><a href="#l66"><span>66</span></a></td><td><pre> * Cache regen failed with 1 </pre></td></tr> @@ -59,8 +59,8 @@ Sandboxed process killed by signal: Broken pipe !!! The die message: !!! inherit for git failed -sandbox:stop caught signal 15 in pid 10710 +sandbox:stop caught signal 15 in pid 8855 Sandboxed process killed by signal: Terminated !!! caught exception inherit requires an unknown eclass, git cannot be found while processing ebuild src: sys-cluster/kerrighed-9999-r1 -caught exception '%s' while processing '%s'(MetadataException('Metadata Exception: pkg ebuild src: sys-cluster/kerrighed-9999-r1, attr description\nerror: Metadata Exception: pkg ebuild src: sys-cluster/kerrighed-9999-r1, attr data\nerror: inherit requires an unknown eclass, git cannot be found',), <<class 'pkgcore.ebuild.ebuild_src.package'> cpv='sys-cluster/kerrighed-9999-r1' @0x7fb216531410>) +caught exception '%s' while processing '%s'(MetadataException('Metadata Exception: pkg ebuild src: sys-cluster/kerrighed-9999-r1, attr description\nerror: Metadata Exception: pkg ebuild src: sys-cluster/kerrighed-9999-r1, attr data\nerror: inherit requires an unknown eclass, git cannot be found',), <<class 'pkgcore.ebuild.ebuild_src.package'> cpv='sys-cluster/kerrighed-9999-r1' @0x7ffad0b8a410>) * Cache regen failed with 1 diff --git a/rebel.html b/rebel.html index 13c45093ff10..2a677bd7f3ac 100644 --- a/rebel.html +++ b/rebel.html @@ -146,7 +146,7 @@ </pre></td><td>[FATAL]</td></tr> <tr class="" id="l68"><td><a href="#l68"><span>68</span></a></td><td><pre>ERROR pkgcore: returned val from gen_metadata was 'False' </pre></td></tr> - <tr class="err" id="l69"><td><a href="#l69"><span>69</span></a></td><td><pre>caught exception '%s' while processing '%s'(MetadataException('Metadata Exception: pkg ebuild src: kde-misc/adjustableclock-9999, attr description\nerror: Metadata Exception: pkg ebuild src: kde-misc/adjustableclock-9999, attr data\nerror: False',), <<class 'pkgcore.ebuild.ebuild_src.package'> cpv='kde-misc/adjustableclock-9999' @0x7fe6870b6410>) + <tr class="err" id="l69"><td><a href="#l69"><span>69</span></a></td><td><pre>caught exception '%s' while processing '%s'(MetadataException('Metadata Exception: pkg ebuild src: kde-misc/adjustableclock-9999, attr description\nerror: Metadata Exception: pkg ebuild src: kde-misc/adjustableclock-9999, attr data\nerror: False',), <<class 'pkgcore.ebuild.ebuild_src.package'> cpv='kde-misc/adjustableclock-9999' @0x7f12cf031410>) </pre></td><td>[FATAL]</td></tr> <tr class="" id="l70"><td><a href="#l70"><span>70</span></a></td><td><pre> * Cache regen failed with 1 </pre></td></tr> diff --git a/rebel.txt b/rebel.txt index 3793cf877e6f..2733bf2481db 100644 --- a/rebel.txt +++ b/rebel.txt @@ -66,5 +66,5 @@ WARNING:pkgcore:repository at '/home/mgorny/repos/steveeJ' has unsupported profi ERROR pkgcore: returned val from gen_metadata was 'False' !!! caught exception False while processing ebuild src: kde-misc/adjustableclock-9999 ERROR pkgcore: returned val from gen_metadata was 'False' -caught exception '%s' while processing '%s'(MetadataException('Metadata Exception: pkg ebuild src: kde-misc/adjustableclock-9999, attr description\nerror: Metadata Exception: pkg ebuild src: kde-misc/adjustableclock-9999, attr data\nerror: False',), <<class 'pkgcore.ebuild.ebuild_src.package'> cpv='kde-misc/adjustableclock-9999' @0x7fe6870b6410>) +caught exception '%s' while processing '%s'(MetadataException('Metadata Exception: pkg ebuild src: kde-misc/adjustableclock-9999, attr description\nerror: Metadata Exception: pkg ebuild src: kde-misc/adjustableclock-9999, attr data\nerror: False',), <<class 'pkgcore.ebuild.ebuild_src.package'> cpv='kde-misc/adjustableclock-9999' @0x7f12cf031410>) * Cache regen failed with 1 diff --git a/sigrok.html b/sigrok.html index c4bcfd0ae013..3e3e345a2f43 100644 --- a/sigrok.html +++ b/sigrok.html @@ -530,27 +530,27 @@ </pre></td><td>[FATAL]</td></tr> <tr class="" id="l260"><td><a href="#l260"><span>260</span></a></td><td><pre>ERROR pkgcore: returned val from gen_metadata was 'False' </pre></td></tr> - <tr class="err" id="l261"><td><a href="#l261"><span>261</span></a></td><td><pre>caught exception '%s' while processing '%s'(MetadataException('Metadata Exception: pkg ebuild src: sci-electronics/pulseview-0.2.0, attr description\nerror: Metadata Exception: pkg ebuild src: sci-electronics/pulseview-0.2.0, attr data\nerror: False',), <<class 'pkgcore.ebuild.ebuild_src.package'> cpv='sci-electronics/pulseview-0.2.0' @0x7efc4be11b90>) + <tr class="err" id="l261"><td><a href="#l261"><span>261</span></a></td><td><pre>caught exception '%s' while processing '%s'(MetadataException('Metadata Exception: pkg ebuild src: sci-electronics/pulseview-0.2.0, attr description\nerror: Metadata Exception: pkg ebuild src: sci-electronics/pulseview-0.2.0, attr data\nerror: False',), <<class 'pkgcore.ebuild.ebuild_src.package'> cpv='sci-electronics/pulseview-0.2.0' @0x7fc7c509ab90>) </pre></td><td>[FATAL]</td></tr> <tr class="" id="l262"><td><a href="#l262"><span>262</span></a></td><td><pre>ERROR pkgcore: returned val from gen_metadata was 'False' </pre></td></tr> - <tr class="err" id="l263"><td><a href="#l263"><span>263</span></a></td><td><pre>caught exception '%s' while processing '%s'(MetadataException('Metadata Exception: pkg ebuild src: sci-electronics/pulseview-0.1.0, attr description\nerror: Metadata Exception: pkg ebuild src: sci-electronics/pulseview-0.1.0, attr data\nerror: False',), <<class 'pkgcore.ebuild.ebuild_src.package'> cpv='sci-electronics/pulseview-0.1.0' @0x7efc4be11190>) + <tr class="err" id="l263"><td><a href="#l263"><span>263</span></a></td><td><pre>caught exception '%s' while processing '%s'(MetadataException('Metadata Exception: pkg ebuild src: sci-electronics/pulseview-0.1.0, attr description\nerror: Metadata Exception: pkg ebuild src: sci-electronics/pulseview-0.1.0, attr data\nerror: False',), <<class 'pkgcore.ebuild.ebuild_src.package'> cpv='sci-electronics/pulseview-0.1.0' @0x7fc7c509a190>) </pre></td><td>[FATAL]</td></tr> <tr class="" id="l264"><td><a href="#l264"><span>264</span></a></td><td><pre>ERROR pkgcore: returned val from gen_metadata was 'False' </pre></td></tr> - <tr class="err" id="l265"><td><a href="#l265"><span>265</span></a></td><td><pre>caught exception '%s' while processing '%s'(MetadataException('Metadata Exception: pkg ebuild src: sci-electronics/pulseview-9999, attr description\nerror: Metadata Exception: pkg ebuild src: sci-electronics/pulseview-9999, attr data\nerror: False',), <<class 'pkgcore.ebuild.ebuild_src.package'> cpv='sci-electronics/pulseview-9999' @0x7efc4be11b90>) + <tr class="err" id="l265"><td><a href="#l265"><span>265</span></a></td><td><pre>caught exception '%s' while processing '%s'(MetadataException('Metadata Exception: pkg ebuild src: sci-electronics/pulseview-9999, attr description\nerror: Metadata Exception: pkg ebuild src: sci-electronics/pulseview-9999, attr data\nerror: False',), <<class 'pkgcore.ebuild.ebuild_src.package'> cpv='sci-electronics/pulseview-9999' @0x7fc7c509ab90>) </pre></td><td>[FATAL]</td></tr> <tr class="" id="l266"><td><a href="#l266"><span>266</span></a></td><td><pre>ERROR pkgcore: returned val from gen_metadata was 'False' </pre></td></tr> - <tr class="err" id="l267"><td><a href="#l267"><span>267</span></a></td><td><pre>caught exception '%s' while processing '%s'(MetadataException('Metadata Exception: pkg ebuild src: sci-electronics/sigrok-cli-0.5.0, attr description\nerror: Metadata Exception: pkg ebuild src: sci-electronics/sigrok-cli-0.5.0, attr data\nerror: False',), <<class 'pkgcore.ebuild.ebuild_src.package'> cpv='sci-electronics/sigrok-cli-0.5.0' @0x7efc4be11190>) + <tr class="err" id="l267"><td><a href="#l267"><span>267</span></a></td><td><pre>caught exception '%s' while processing '%s'(MetadataException('Metadata Exception: pkg ebuild src: sci-electronics/sigrok-cli-0.5.0, attr description\nerror: Metadata Exception: pkg ebuild src: sci-electronics/sigrok-cli-0.5.0, attr data\nerror: False',), <<class 'pkgcore.ebuild.ebuild_src.package'> cpv='sci-electronics/sigrok-cli-0.5.0' @0x7fc7c509a190>) </pre></td><td>[FATAL]</td></tr> <tr class="" id="l268"><td><a href="#l268"><span>268</span></a></td><td><pre>ERROR pkgcore: returned val from gen_metadata was 'False' </pre></td></tr> - <tr class="err" id="l269"><td><a href="#l269"><span>269</span></a></td><td><pre>caught exception '%s' while processing '%s'(MetadataException('Metadata Exception: pkg ebuild src: sci-electronics/sigrok-cli-0.4.0, attr description\nerror: Metadata Exception: pkg ebuild src: sci-electronics/sigrok-cli-0.4.0, attr data\nerror: False',), <<class 'pkgcore.ebuild.ebuild_src.package'> cpv='sci-electronics/sigrok-cli-0.4.0' @0x7efc4be11b90>) + <tr class="err" id="l269"><td><a href="#l269"><span>269</span></a></td><td><pre>caught exception '%s' while processing '%s'(MetadataException('Metadata Exception: pkg ebuild src: sci-electronics/sigrok-cli-0.4.0, attr description\nerror: Metadata Exception: pkg ebuild src: sci-electronics/sigrok-cli-0.4.0, attr data\nerror: False',), <<class 'pkgcore.ebuild.ebuild_src.package'> cpv='sci-electronics/sigrok-cli-0.4.0' @0x7fc7c509ab90>) </pre></td><td>[FATAL]</td></tr> <tr class="" id="l270"><td><a href="#l270"><span>270</span></a></td><td><pre>ERROR pkgcore: returned val from gen_metadata was 'False' </pre></td></tr> - <tr class="err" id="l271"><td><a href="#l271"><span>271</span></a></td><td><pre>caught exception '%s' while processing '%s'(MetadataException('Metadata Exception: pkg ebuild src: sci-electronics/sigrok-cli-9999, attr description\nerror: Metadata Exception: pkg ebuild src: sci-electronics/sigrok-cli-9999, attr data\nerror: False',), <<class 'pkgcore.ebuild.ebuild_src.package'> cpv='sci-electronics/sigrok-cli-9999' @0x7efc4be11190>) + <tr class="err" id="l271"><td><a href="#l271"><span>271</span></a></td><td><pre>caught exception '%s' while processing '%s'(MetadataException('Metadata Exception: pkg ebuild src: sci-electronics/sigrok-cli-9999, attr description\nerror: Metadata Exception: pkg ebuild src: sci-electronics/sigrok-cli-9999, attr data\nerror: False',), <<class 'pkgcore.ebuild.ebuild_src.package'> cpv='sci-electronics/sigrok-cli-9999' @0x7fc7c509a190>) </pre></td><td>[FATAL]</td></tr> <tr class="" id="l272"><td><a href="#l272"><span>272</span></a></td><td><pre> * Cache regen failed with 1 </pre></td></tr> diff --git a/sigrok.txt b/sigrok.txt index 84a708aafe3b..1f83bfa74b4d 100644 --- a/sigrok.txt +++ b/sigrok.txt @@ -258,15 +258,15 @@ ERROR pkgcore: returned val from gen_metadata was 'False' ERROR pkgcore: returned val from gen_metadata was 'False' !!! caught exception False while processing ebuild src: sci-electronics/sigrok-cli-9999 ERROR pkgcore: returned val from gen_metadata was 'False' -caught exception '%s' while processing '%s'(MetadataException('Metadata Exception: pkg ebuild src: sci-electronics/pulseview-0.2.0, attr description\nerror: Metadata Exception: pkg ebuild src: sci-electronics/pulseview-0.2.0, attr data\nerror: False',), <<class 'pkgcore.ebuild.ebuild_src.package'> cpv='sci-electronics/pulseview-0.2.0' @0x7efc4be11b90>) +caught exception '%s' while processing '%s'(MetadataException('Metadata Exception: pkg ebuild src: sci-electronics/pulseview-0.2.0, attr description\nerror: Metadata Exception: pkg ebuild src: sci-electronics/pulseview-0.2.0, attr data\nerror: False',), <<class 'pkgcore.ebuild.ebuild_src.package'> cpv='sci-electronics/pulseview-0.2.0' @0x7fc7c509ab90>) ERROR pkgcore: returned val from gen_metadata was 'False' -caught exception '%s' while processing '%s'(MetadataException('Metadata Exception: pkg ebuild src: sci-electronics/pulseview-0.1.0, attr description\nerror: Metadata Exception: pkg ebuild src: sci-electronics/pulseview-0.1.0, attr data\nerror: False',), <<class 'pkgcore.ebuild.ebuild_src.package'> cpv='sci-electronics/pulseview-0.1.0' @0x7efc4be11190>) +caught exception '%s' while processing '%s'(MetadataException('Metadata Exception: pkg ebuild src: sci-electronics/pulseview-0.1.0, attr description\nerror: Metadata Exception: pkg ebuild src: sci-electronics/pulseview-0.1.0, attr data\nerror: False',), <<class 'pkgcore.ebuild.ebuild_src.package'> cpv='sci-electronics/pulseview-0.1.0' @0x7fc7c509a190>) ERROR pkgcore: returned val from gen_metadata was 'False' -caught exception '%s' while processing '%s'(MetadataException('Metadata Exception: pkg ebuild src: sci-electronics/pulseview-9999, attr description\nerror: Metadata Exception: pkg ebuild src: sci-electronics/pulseview-9999, attr data\nerror: False',), <<class 'pkgcore.ebuild.ebuild_src.package'> cpv='sci-electronics/pulseview-9999' @0x7efc4be11b90>) +caught exception '%s' while processing '%s'(MetadataException('Metadata Exception: pkg ebuild src: sci-electronics/pulseview-9999, attr description\nerror: Metadata Exception: pkg ebuild src: sci-electronics/pulseview-9999, attr data\nerror: False',), <<class 'pkgcore.ebuild.ebuild_src.package'> cpv='sci-electronics/pulseview-9999' @0x7fc7c509ab90>) ERROR pkgcore: returned val from gen_metadata was 'False' -caught exception '%s' while processing '%s'(MetadataException('Metadata Exception: pkg ebuild src: sci-electronics/sigrok-cli-0.5.0, attr description\nerror: Metadata Exception: pkg ebuild src: sci-electronics/sigrok-cli-0.5.0, attr data\nerror: False',), <<class 'pkgcore.ebuild.ebuild_src.package'> cpv='sci-electronics/sigrok-cli-0.5.0' @0x7efc4be11190>) +caught exception '%s' while processing '%s'(MetadataException('Metadata Exception: pkg ebuild src: sci-electronics/sigrok-cli-0.5.0, attr description\nerror: Metadata Exception: pkg ebuild src: sci-electronics/sigrok-cli-0.5.0, attr data\nerror: False',), <<class 'pkgcore.ebuild.ebuild_src.package'> cpv='sci-electronics/sigrok-cli-0.5.0' @0x7fc7c509a190>) ERROR pkgcore: returned val from gen_metadata was 'False' -caught exception '%s' while processing '%s'(MetadataException('Metadata Exception: pkg ebuild src: sci-electronics/sigrok-cli-0.4.0, attr description\nerror: Metadata Exception: pkg ebuild src: sci-electronics/sigrok-cli-0.4.0, attr data\nerror: False',), <<class 'pkgcore.ebuild.ebuild_src.package'> cpv='sci-electronics/sigrok-cli-0.4.0' @0x7efc4be11b90>) +caught exception '%s' while processing '%s'(MetadataException('Metadata Exception: pkg ebuild src: sci-electronics/sigrok-cli-0.4.0, attr description\nerror: Metadata Exception: pkg ebuild src: sci-electronics/sigrok-cli-0.4.0, attr data\nerror: False',), <<class 'pkgcore.ebuild.ebuild_src.package'> cpv='sci-electronics/sigrok-cli-0.4.0' @0x7fc7c509ab90>) ERROR pkgcore: returned val from gen_metadata was 'False' -caught exception '%s' while processing '%s'(MetadataException('Metadata Exception: pkg ebuild src: sci-electronics/sigrok-cli-9999, attr description\nerror: Metadata Exception: pkg ebuild src: sci-electronics/sigrok-cli-9999, attr data\nerror: False',), <<class 'pkgcore.ebuild.ebuild_src.package'> cpv='sci-electronics/sigrok-cli-9999' @0x7efc4be11190>) +caught exception '%s' while processing '%s'(MetadataException('Metadata Exception: pkg ebuild src: sci-electronics/sigrok-cli-9999, attr description\nerror: Metadata Exception: pkg ebuild src: sci-electronics/sigrok-cli-9999, attr data\nerror: False',), <<class 'pkgcore.ebuild.ebuild_src.package'> cpv='sci-electronics/sigrok-cli-9999' @0x7fc7c509a190>) * Cache regen failed with 1 diff --git a/sunrise.html b/sunrise.html index 598d0ccc88c7..8c5823d4133e 100644 --- a/sunrise.html +++ b/sunrise.html @@ -216,11 +216,11 @@ </pre></td><td>[FATAL]</td></tr> <tr class="" id="l103"><td><a href="#l103"><span>103</span></a></td><td><pre>ERROR pkgcore: returned val from gen_metadata was 'False' </pre></td></tr> - <tr class="err" id="l104"><td><a href="#l104"><span>104</span></a></td><td><pre>caught exception '%s' while processing '%s'(MetadataException('Metadata Exception: pkg ebuild src: games-rpg/lipsofsuna-0.5.0, attr description\nerror: Metadata Exception: pkg ebuild src: games-rpg/lipsofsuna-0.5.0, attr data\nerror: False',), <<class 'pkgcore.ebuild.ebuild_src.package'> cpv='games-rpg/lipsofsuna-0.5.0' @0x7f606a3827d0>) + <tr class="err" id="l104"><td><a href="#l104"><span>104</span></a></td><td><pre>caught exception '%s' while processing '%s'(MetadataException('Metadata Exception: pkg ebuild src: games-rpg/lipsofsuna-0.5.0, attr description\nerror: Metadata Exception: pkg ebuild src: games-rpg/lipsofsuna-0.5.0, attr data\nerror: False',), <<class 'pkgcore.ebuild.ebuild_src.package'> cpv='games-rpg/lipsofsuna-0.5.0' @0x7f12d96da7d0>) </pre></td><td>[FATAL]</td></tr> <tr class="" id="l105"><td><a href="#l105"><span>105</span></a></td><td><pre>ERROR pkgcore: returned val from gen_metadata was 'False' </pre></td></tr> - <tr class="err" id="l106"><td><a href="#l106"><span>106</span></a></td><td><pre>caught exception '%s' while processing '%s'(MetadataException('Metadata Exception: pkg ebuild src: games-rpg/lipsofsuna-9999, attr description\nerror: Metadata Exception: pkg ebuild src: games-rpg/lipsofsuna-9999, attr data\nerror: False',), <<class 'pkgcore.ebuild.ebuild_src.package'> cpv='games-rpg/lipsofsuna-9999' @0x7f606a382910>) + <tr class="err" id="l106"><td><a href="#l106"><span>106</span></a></td><td><pre>caught exception '%s' while processing '%s'(MetadataException('Metadata Exception: pkg ebuild src: games-rpg/lipsofsuna-9999, attr description\nerror: Metadata Exception: pkg ebuild src: games-rpg/lipsofsuna-9999, attr data\nerror: False',), <<class 'pkgcore.ebuild.ebuild_src.package'> cpv='games-rpg/lipsofsuna-9999' @0x7f12d96da910>) </pre></td><td>[FATAL]</td></tr> <tr class="" id="l107"><td><a href="#l107"><span>107</span></a></td><td><pre> * Cache regen failed with 1 </pre></td></tr> diff --git a/sunrise.txt b/sunrise.txt index 41bd998b4063..6923028b8b96 100644 --- a/sunrise.txt +++ b/sunrise.txt @@ -101,7 +101,7 @@ ERROR pkgcore: returned val from gen_metadata was 'False' ERROR pkgcore: returned val from gen_metadata was 'False' !!! caught exception False while processing ebuild src: games-rpg/lipsofsuna-9999 ERROR pkgcore: returned val from gen_metadata was 'False' -caught exception '%s' while processing '%s'(MetadataException('Metadata Exception: pkg ebuild src: games-rpg/lipsofsuna-0.5.0, attr description\nerror: Metadata Exception: pkg ebuild src: games-rpg/lipsofsuna-0.5.0, attr data\nerror: False',), <<class 'pkgcore.ebuild.ebuild_src.package'> cpv='games-rpg/lipsofsuna-0.5.0' @0x7f606a3827d0>) +caught exception '%s' while processing '%s'(MetadataException('Metadata Exception: pkg ebuild src: games-rpg/lipsofsuna-0.5.0, attr description\nerror: Metadata Exception: pkg ebuild src: games-rpg/lipsofsuna-0.5.0, attr data\nerror: False',), <<class 'pkgcore.ebuild.ebuild_src.package'> cpv='games-rpg/lipsofsuna-0.5.0' @0x7f12d96da7d0>) ERROR pkgcore: returned val from gen_metadata was 'False' -caught exception '%s' while processing '%s'(MetadataException('Metadata Exception: pkg ebuild src: games-rpg/lipsofsuna-9999, attr description\nerror: Metadata Exception: pkg ebuild src: games-rpg/lipsofsuna-9999, attr data\nerror: False',), <<class 'pkgcore.ebuild.ebuild_src.package'> cpv='games-rpg/lipsofsuna-9999' @0x7f606a382910>) +caught exception '%s' while processing '%s'(MetadataException('Metadata Exception: pkg ebuild src: games-rpg/lipsofsuna-9999, attr description\nerror: Metadata Exception: pkg ebuild src: games-rpg/lipsofsuna-9999, attr data\nerror: False',), <<class 'pkgcore.ebuild.ebuild_src.package'> cpv='games-rpg/lipsofsuna-9999' @0x7f12d96da910>) * Cache regen failed with 1 diff --git a/swegener.html b/swegener.html index 4faf78403fe4..e8591cbb407a 100644 --- a/swegener.html +++ b/swegener.html @@ -206,7 +206,7 @@ </pre></td><td>[FATAL]</td></tr> <tr class="" id="l98"><td><a href="#l98"><span>98</span></a></td><td><pre>ERROR pkgcore: returned val from gen_metadata was 'False' </pre></td></tr> - <tr class="err" id="l99"><td><a href="#l99"><span>99</span></a></td><td><pre>caught exception '%s' while processing '%s'(MetadataException('Metadata Exception: pkg ebuild src: gnome-extra/brightside-1.4.0, attr description\nerror: Metadata Exception: pkg ebuild src: gnome-extra/brightside-1.4.0, attr data\nerror: False',), <<class 'pkgcore.ebuild.ebuild_src.package'> cpv='gnome-extra/brightside-1.4.0' @0x7fcf485fe410>) + <tr class="err" id="l99"><td><a href="#l99"><span>99</span></a></td><td><pre>caught exception '%s' while processing '%s'(MetadataException('Metadata Exception: pkg ebuild src: gnome-extra/brightside-1.4.0, attr description\nerror: Metadata Exception: pkg ebuild src: gnome-extra/brightside-1.4.0, attr data\nerror: False',), <<class 'pkgcore.ebuild.ebuild_src.package'> cpv='gnome-extra/brightside-1.4.0' @0x7ff34b4cf410>) </pre></td><td>[FATAL]</td></tr> <tr class="" id="l100"><td><a href="#l100"><span>100</span></a></td><td><pre> * Cache regen failed with 1 </pre></td></tr> diff --git a/swegener.txt b/swegener.txt index 393655d2aee4..f274ec17623e 100644 --- a/swegener.txt +++ b/swegener.txt @@ -96,5 +96,5 @@ WARNING:pkgcore:repository at '/home/mgorny/repos/steveeJ' has unsupported profi ERROR pkgcore: returned val from gen_metadata was 'False' !!! caught exception False while processing ebuild src: gnome-extra/brightside-1.4.0 ERROR pkgcore: returned val from gen_metadata was 'False' -caught exception '%s' while processing '%s'(MetadataException('Metadata Exception: pkg ebuild src: gnome-extra/brightside-1.4.0, attr description\nerror: Metadata Exception: pkg ebuild src: gnome-extra/brightside-1.4.0, attr data\nerror: False',), <<class 'pkgcore.ebuild.ebuild_src.package'> cpv='gnome-extra/brightside-1.4.0' @0x7fcf485fe410>) +caught exception '%s' while processing '%s'(MetadataException('Metadata Exception: pkg ebuild src: gnome-extra/brightside-1.4.0, attr description\nerror: Metadata Exception: pkg ebuild src: gnome-extra/brightside-1.4.0, attr data\nerror: False',), <<class 'pkgcore.ebuild.ebuild_src.package'> cpv='gnome-extra/brightside-1.4.0' @0x7ff34b4cf410>) * Cache regen failed with 1 diff --git a/vdr-testing.html b/vdr-testing.html index 596443432d71..4d40d92f5d3c 100644 --- a/vdr-testing.html +++ b/vdr-testing.html @@ -62,9 +62,9 @@ </pre></td><td>[FATAL]</td></tr> <tr class="" id="l26"><td><a href="#l26"><span>26</span></a></td><td><pre>error: parsed eapi '0' doesn't match sourced eapi '2' while processing ebuild src: media-tv/s2-liplianin-0.1 </pre></td></tr> - <tr class="err" id="l27"><td><a href="#l27"><span>27</span></a></td><td><pre>caught exception '%s' while processing '%s'(MetadataException("Metadata Exception: pkg ebuild src: media-tv/mantis-v4l-dvb-hg-0.1, attr description\nerror: Metadata Exception: pkg ebuild src: media-tv/mantis-v4l-dvb-hg-0.1, attr data\nerror: Metadata Exception: pkg ebuild src: media-tv/mantis-v4l-dvb-hg-0.1, attr eapi\nerror: parsed eapi '0' doesn't match sourced eapi '2'",), <<class 'pkgcore.ebuild.ebuild_src.package'> cpv='media-tv/mantis-v4l-dvb-hg-0.1' @0x7feb135fd2d0>) + <tr class="err" id="l27"><td><a href="#l27"><span>27</span></a></td><td><pre>caught exception '%s' while processing '%s'(MetadataException("Metadata Exception: pkg ebuild src: media-tv/mantis-v4l-dvb-hg-0.1, attr description\nerror: Metadata Exception: pkg ebuild src: media-tv/mantis-v4l-dvb-hg-0.1, attr data\nerror: Metadata Exception: pkg ebuild src: media-tv/mantis-v4l-dvb-hg-0.1, attr eapi\nerror: parsed eapi '0' doesn't match sourced eapi '2'",), <<class 'pkgcore.ebuild.ebuild_src.package'> cpv='media-tv/mantis-v4l-dvb-hg-0.1' @0x7fe7190fa2d0>) </pre></td><td>[FATAL]</td></tr> - <tr class="err" id="l28"><td><a href="#l28"><span>28</span></a></td><td><pre>caught exception '%s' while processing '%s'(MetadataException("Metadata Exception: pkg ebuild src: media-tv/s2-liplianin-0.1, attr description\nerror: Metadata Exception: pkg ebuild src: media-tv/s2-liplianin-0.1, attr data\nerror: Metadata Exception: pkg ebuild src: media-tv/s2-liplianin-0.1, attr eapi\nerror: parsed eapi '0' doesn't match sourced eapi '2'",), <<class 'pkgcore.ebuild.ebuild_src.package'> cpv='media-tv/s2-liplianin-0.1' @0x7feb135fd410>) + <tr class="err" id="l28"><td><a href="#l28"><span>28</span></a></td><td><pre>caught exception '%s' while processing '%s'(MetadataException("Metadata Exception: pkg ebuild src: media-tv/s2-liplianin-0.1, attr description\nerror: Metadata Exception: pkg ebuild src: media-tv/s2-liplianin-0.1, attr data\nerror: Metadata Exception: pkg ebuild src: media-tv/s2-liplianin-0.1, attr eapi\nerror: parsed eapi '0' doesn't match sourced eapi '2'",), <<class 'pkgcore.ebuild.ebuild_src.package'> cpv='media-tv/s2-liplianin-0.1' @0x7fe7190fa410>) </pre></td><td>[FATAL]</td></tr> <tr class="" id="l29"><td><a href="#l29"><span>29</span></a></td><td><pre> * Cache regen failed with 1 </pre></td></tr> diff --git a/vdr-testing.txt b/vdr-testing.txt index c3570e7f3c6b..23b2ba091997 100644 --- a/vdr-testing.txt +++ b/vdr-testing.txt @@ -24,6 +24,6 @@ WARNING:pkgcore:repository at '/home/mgorny/repos/steveeJ' has unsupported profi error: parsed eapi '0' doesn't match sourced eapi '2' while processing ebuild src: media-tv/mantis-v4l-dvb-hg-0.1 !!! caught exception Metadata Exception: pkg ebuild src: media-tv/s2-liplianin-0.1, attr eapi error: parsed eapi '0' doesn't match sourced eapi '2' while processing ebuild src: media-tv/s2-liplianin-0.1 -caught exception '%s' while processing '%s'(MetadataException("Metadata Exception: pkg ebuild src: media-tv/mantis-v4l-dvb-hg-0.1, attr description\nerror: Metadata Exception: pkg ebuild src: media-tv/mantis-v4l-dvb-hg-0.1, attr data\nerror: Metadata Exception: pkg ebuild src: media-tv/mantis-v4l-dvb-hg-0.1, attr eapi\nerror: parsed eapi '0' doesn't match sourced eapi '2'",), <<class 'pkgcore.ebuild.ebuild_src.package'> cpv='media-tv/mantis-v4l-dvb-hg-0.1' @0x7feb135fd2d0>) -caught exception '%s' while processing '%s'(MetadataException("Metadata Exception: pkg ebuild src: media-tv/s2-liplianin-0.1, attr description\nerror: Metadata Exception: pkg ebuild src: media-tv/s2-liplianin-0.1, attr data\nerror: Metadata Exception: pkg ebuild src: media-tv/s2-liplianin-0.1, attr eapi\nerror: parsed eapi '0' doesn't match sourced eapi '2'",), <<class 'pkgcore.ebuild.ebuild_src.package'> cpv='media-tv/s2-liplianin-0.1' @0x7feb135fd410>) +caught exception '%s' while processing '%s'(MetadataException("Metadata Exception: pkg ebuild src: media-tv/mantis-v4l-dvb-hg-0.1, attr description\nerror: Metadata Exception: pkg ebuild src: media-tv/mantis-v4l-dvb-hg-0.1, attr data\nerror: Metadata Exception: pkg ebuild src: media-tv/mantis-v4l-dvb-hg-0.1, attr eapi\nerror: parsed eapi '0' doesn't match sourced eapi '2'",), <<class 'pkgcore.ebuild.ebuild_src.package'> cpv='media-tv/mantis-v4l-dvb-hg-0.1' @0x7fe7190fa2d0>) +caught exception '%s' while processing '%s'(MetadataException("Metadata Exception: pkg ebuild src: media-tv/s2-liplianin-0.1, attr description\nerror: Metadata Exception: pkg ebuild src: media-tv/s2-liplianin-0.1, attr data\nerror: Metadata Exception: pkg ebuild src: media-tv/s2-liplianin-0.1, attr eapi\nerror: parsed eapi '0' doesn't match sourced eapi '2'",), <<class 'pkgcore.ebuild.ebuild_src.package'> cpv='media-tv/s2-liplianin-0.1' @0x7fe7190fa410>) * Cache regen failed with 1 diff --git a/vincent.html b/vincent.html index 9cb2226d270a..949e709f58ae 100644 --- a/vincent.html +++ b/vincent.html @@ -158,7 +158,7 @@ </pre></td></tr> <tr class="" id="l74"><td><a href="#l74"><span>74</span></a></td><td><pre> </pre></td></tr> - <tr class="" id="l75"><td><a href="#l75"><span>75</span></a></td><td><pre>sandbox:stop caught signal 15 in pid 18728 + <tr class="" id="l75"><td><a href="#l75"><span>75</span></a></td><td><pre>sandbox:stop caught signal 15 in pid 16984 </pre></td></tr> <tr class="" id="l76"><td><a href="#l76"><span>76</span></a></td><td><pre>Sandboxed process killed by signal: Terminated </pre></td></tr> @@ -196,7 +196,7 @@ </pre></td></tr> <tr class="" id="l93"><td><a href="#l93"><span>93</span></a></td><td><pre> </pre></td></tr> - <tr class="" id="l94"><td><a href="#l94"><span>94</span></a></td><td><pre>sandbox:stop caught signal 15 in pid 18878 + <tr class="" id="l94"><td><a href="#l94"><span>94</span></a></td><td><pre>sandbox:stop caught signal 15 in pid 17163 </pre></td></tr> <tr class="" id="l95"><td><a href="#l95"><span>95</span></a></td><td><pre>Sandboxed process killed by signal: Terminated </pre></td></tr> @@ -206,9 +206,9 @@ </pre></td></tr> <tr class="err" id="l98"><td><a href="#l98"><span>98</span></a></td><td><pre>!!! caught exception False while processing ebuild src: app-emulation/emul-linux-x86-wxGTK-2.8.12.1 </pre></td><td>[FATAL]</td></tr> - <tr class="err" id="l99"><td><a href="#l99"><span>99</span></a></td><td><pre>caught exception '%s' while processing '%s'(MetadataException('Metadata Exception: pkg ebuild src: app-emulation/emul-linux-x86-libsoundtouch-1.7.1, attr description\nerror: Metadata Exception: pkg ebuild src: app-emulation/emul-linux-x86-libsoundtouch-1.7.1, attr data\nerror: inherit requires an unknown eclass, emul-linux-x86 cannot be found',), <<class 'pkgcore.ebuild.ebuild_src.package'> cpv='app-emulation/emul-linux-x86-libsoundtouch-1.7.1' @0x7f4795ef52d0>) + <tr class="err" id="l99"><td><a href="#l99"><span>99</span></a></td><td><pre>caught exception '%s' while processing '%s'(MetadataException('Metadata Exception: pkg ebuild src: app-emulation/emul-linux-x86-libsoundtouch-1.7.1, attr description\nerror: Metadata Exception: pkg ebuild src: app-emulation/emul-linux-x86-libsoundtouch-1.7.1, attr data\nerror: inherit requires an unknown eclass, emul-linux-x86 cannot be found',), <<class 'pkgcore.ebuild.ebuild_src.package'> cpv='app-emulation/emul-linux-x86-libsoundtouch-1.7.1' @0x7fb1162c12d0>) </pre></td><td>[FATAL]</td></tr> - <tr class="err" id="l100"><td><a href="#l100"><span>100</span></a></td><td><pre>caught exception '%s' while processing '%s'(MetadataException('Metadata Exception: pkg ebuild src: app-emulation/emul-linux-x86-wxGTK-2.8.12.1, attr description\nerror: Metadata Exception: pkg ebuild src: app-emulation/emul-linux-x86-wxGTK-2.8.12.1, attr data\nerror: inherit requires an unknown eclass, emul-linux-x86 cannot be found',), <<class 'pkgcore.ebuild.ebuild_src.package'> cpv='app-emulation/emul-linux-x86-wxGTK-2.8.12.1' @0x7f4795ef5550>) + <tr class="err" id="l100"><td><a href="#l100"><span>100</span></a></td><td><pre>caught exception '%s' while processing '%s'(MetadataException('Metadata Exception: pkg ebuild src: app-emulation/emul-linux-x86-wxGTK-2.8.12.1, attr description\nerror: Metadata Exception: pkg ebuild src: app-emulation/emul-linux-x86-wxGTK-2.8.12.1, attr data\nerror: inherit requires an unknown eclass, emul-linux-x86 cannot be found',), <<class 'pkgcore.ebuild.ebuild_src.package'> cpv='app-emulation/emul-linux-x86-wxGTK-2.8.12.1' @0x7fb1162c1550>) </pre></td><td>[FATAL]</td></tr> <tr class="" id="l101"><td><a href="#l101"><span>101</span></a></td><td><pre> * Cache regen failed with 1 </pre></td></tr> diff --git a/vincent.txt b/vincent.txt index d509690aa83b..33551e52ba95 100644 --- a/vincent.txt +++ b/vincent.txt @@ -72,7 +72,7 @@ WARNING:pkgcore:repository at '/home/mgorny/repos/steveeJ' has unsupported profi !!! The die message: !!! inherit for emul-linux-x86 failed -sandbox:stop caught signal 15 in pid 18728 +sandbox:stop caught signal 15 in pid 16984 Sandboxed process killed by signal: Terminated !!! ERROR: app-emulation/emul-linux-x86-wxGTK-2.8.12.1 failed. @@ -91,11 +91,11 @@ Sandboxed process killed by signal: Terminated !!! The die message: !!! inherit for emul-linux-x86 failed -sandbox:stop caught signal 15 in pid 18878 +sandbox:stop caught signal 15 in pid 17163 Sandboxed process killed by signal: Terminated !!! caught exception inherit requires an unknown eclass, emul-linux-x86 cannot be found while processing ebuild src: app-emulation/emul-linux-x86-libsoundtouch-1.7.1 ERROR pkgcore: returned val from gen_metadata was 'False' !!! caught exception False while processing ebuild src: app-emulation/emul-linux-x86-wxGTK-2.8.12.1 -caught exception '%s' while processing '%s'(MetadataException('Metadata Exception: pkg ebuild src: app-emulation/emul-linux-x86-libsoundtouch-1.7.1, attr description\nerror: Metadata Exception: pkg ebuild src: app-emulation/emul-linux-x86-libsoundtouch-1.7.1, attr data\nerror: inherit requires an unknown eclass, emul-linux-x86 cannot be found',), <<class 'pkgcore.ebuild.ebuild_src.package'> cpv='app-emulation/emul-linux-x86-libsoundtouch-1.7.1' @0x7f4795ef52d0>) -caught exception '%s' while processing '%s'(MetadataException('Metadata Exception: pkg ebuild src: app-emulation/emul-linux-x86-wxGTK-2.8.12.1, attr description\nerror: Metadata Exception: pkg ebuild src: app-emulation/emul-linux-x86-wxGTK-2.8.12.1, attr data\nerror: inherit requires an unknown eclass, emul-linux-x86 cannot be found',), <<class 'pkgcore.ebuild.ebuild_src.package'> cpv='app-emulation/emul-linux-x86-wxGTK-2.8.12.1' @0x7f4795ef5550>) +caught exception '%s' while processing '%s'(MetadataException('Metadata Exception: pkg ebuild src: app-emulation/emul-linux-x86-libsoundtouch-1.7.1, attr description\nerror: Metadata Exception: pkg ebuild src: app-emulation/emul-linux-x86-libsoundtouch-1.7.1, attr data\nerror: inherit requires an unknown eclass, emul-linux-x86 cannot be found',), <<class 'pkgcore.ebuild.ebuild_src.package'> cpv='app-emulation/emul-linux-x86-libsoundtouch-1.7.1' @0x7fb1162c12d0>) +caught exception '%s' while processing '%s'(MetadataException('Metadata Exception: pkg ebuild src: app-emulation/emul-linux-x86-wxGTK-2.8.12.1, attr description\nerror: Metadata Exception: pkg ebuild src: app-emulation/emul-linux-x86-wxGTK-2.8.12.1, attr data\nerror: inherit requires an unknown eclass, emul-linux-x86 cannot be found',), <<class 'pkgcore.ebuild.ebuild_src.package'> cpv='app-emulation/emul-linux-x86-wxGTK-2.8.12.1' @0x7fb1162c1550>) * Cache regen failed with 1 diff --git a/voip.html b/voip.html index 050b4130f288..a3b2d6ad422a 100644 --- a/voip.html +++ b/voip.html @@ -136,71 +136,73 @@ </pre></td></tr> <tr class="err" id="l63"><td><a href="#l63"><span>63</span></a></td><td><pre>!!! caught exception False while processing ebuild src: net-misc/bayonne2-1.1.0 </pre></td><td>[FATAL]</td></tr> - <tr class="" id="l64"><td><a href="#l64"><span>64</span></a></td><td><pre>Traceback (most recent call last): + <tr class="err" id="l64"><td><a href="#l64"><span>64</span></a></td><td><pre>!!! caught exception ("Expected command; instead got nothing from ''", None) while processing ebuild src: net-misc/bayonne2-2.0.1 +</pre></td><td>[FATAL]</td></tr> + <tr class="" id="l65"><td><a href="#l65"><span>65</span></a></td><td><pre>Traceback (most recent call last): </pre></td></tr> - <tr class="" id="l65"><td><a href="#l65"><span>65</span></a></td><td><pre> File "/home/mgorny/pkgcore-venv/bin/pmaint", line 4, in <module> + <tr class="" id="l66"><td><a href="#l66"><span>66</span></a></td><td><pre> File "/home/mgorny/pkgcore-venv/bin/pmaint", line 4, in <module> </pre></td></tr> - <tr class="" id="l66"><td><a href="#l66"><span>66</span></a></td><td><pre> scripts.main(basename(__file__)) + <tr class="" id="l67"><td><a href="#l67"><span>67</span></a></td><td><pre> scripts.main(basename(__file__)) </pre></td></tr> - <tr class="" id="l67"><td><a href="#l67"><span>67</span></a></td><td><pre> File "/home/mgorny/pkgcore-venv/lib/python2.7/site-packages/pkgcore/scripts/__init__.py", line 42, in main + <tr class="" id="l68"><td><a href="#l68"><span>68</span></a></td><td><pre> File "/home/mgorny/pkgcore-venv/lib/python2.7/site-packages/pkgcore/scripts/__init__.py", line 42, in main </pre></td></tr> - <tr class="" id="l68"><td><a href="#l68"><span>68</span></a></td><td><pre> commandline.main(argparser) + <tr class="" id="l69"><td><a href="#l69"><span>69</span></a></td><td><pre> commandline.main(argparser) </pre></td></tr> - <tr class="" id="l69"><td><a href="#l69"><span>69</span></a></td><td><pre> File "/home/mgorny/pkgcore-venv/lib/python2.7/site-packages/pkgcore/util/commandline.py", line 983, in main + <tr class="" id="l70"><td><a href="#l70"><span>70</span></a></td><td><pre> File "/home/mgorny/pkgcore-venv/lib/python2.7/site-packages/pkgcore/util/commandline.py", line 983, in main </pre></td></tr> - <tr class="" id="l70"><td><a href="#l70"><span>70</span></a></td><td><pre> exitstatus = main_func(options, out, err) + <tr class="" id="l71"><td><a href="#l71"><span>71</span></a></td><td><pre> exitstatus = main_func(options, out, err) </pre></td></tr> - <tr class="" id="l71"><td><a href="#l71"><span>71</span></a></td><td><pre> File "/home/mgorny/pkgcore-venv/lib/python2.7/site-packages/pkgcore/scripts/pmaint.py", line 286, in regen_main + <tr class="" id="l72"><td><a href="#l72"><span>72</span></a></td><td><pre> File "/home/mgorny/pkgcore-venv/lib/python2.7/site-packages/pkgcore/scripts/pmaint.py", line 286, in regen_main </pre></td></tr> - <tr class="" id="l72"><td><a href="#l72"><span>72</span></a></td><td><pre> eclass_caching=(not options.disable_eclass_caching)) + <tr class="" id="l73"><td><a href="#l73"><span>73</span></a></td><td><pre> eclass_caching=(not options.disable_eclass_caching)) </pre></td></tr> - <tr class="" id="l73"><td><a href="#l73"><span>73</span></a></td><td><pre> File "/home/mgorny/pkgcore-venv/lib/python2.7/site-packages/pkgcore/operations/__init__.py", line 68, in _recast_exception_decorator + <tr class="" id="l74"><td><a href="#l74"><span>74</span></a></td><td><pre> File "/home/mgorny/pkgcore-venv/lib/python2.7/site-packages/pkgcore/operations/__init__.py", line 68, in _recast_exception_decorator </pre></td></tr> - <tr class="" id="l74"><td><a href="#l74"><span>74</span></a></td><td><pre> return functor(*args, **kwds) + <tr class="" id="l75"><td><a href="#l75"><span>75</span></a></td><td><pre> return functor(*args, **kwds) </pre></td></tr> - <tr class="" id="l75"><td><a href="#l75"><span>75</span></a></td><td><pre> File "/home/mgorny/pkgcore-venv/lib/python2.7/site-packages/pkgcore/operations/repo.py", line 247, in _cmd_api_regen_cache + <tr class="" id="l76"><td><a href="#l76"><span>76</span></a></td><td><pre> File "/home/mgorny/pkgcore-venv/lib/python2.7/site-packages/pkgcore/operations/repo.py", line 247, in _cmd_api_regen_cache </pre></td></tr> - <tr class="" id="l76"><td><a href="#l76"><span>76</span></a></td><td><pre> self._get_observer(observer), threads=threads, **options) + <tr class="" id="l77"><td><a href="#l77"><span>77</span></a></td><td><pre> self._get_observer(observer), threads=threads, **options) </pre></td></tr> - <tr class="" id="l77"><td><a href="#l77"><span>77</span></a></td><td><pre> File "/home/mgorny/pkgcore-venv/lib/python2.7/site-packages/pkgcore/operations/regen.py", line 37, in regen_repository + <tr class="" id="l78"><td><a href="#l78"><span>78</span></a></td><td><pre> File "/home/mgorny/pkgcore-venv/lib/python2.7/site-packages/pkgcore/operations/regen.py", line 37, in regen_repository </pre></td></tr> - <tr class="" id="l78"><td><a href="#l78"><span>78</span></a></td><td><pre> regen_iter(iter(repo), _get_repo_helper(), observer) + <tr class="" id="l79"><td><a href="#l79"><span>79</span></a></td><td><pre> regen_iter(iter(repo), _get_repo_helper(), observer) </pre></td></tr> - <tr class="" id="l79"><td><a href="#l79"><span>79</span></a></td><td><pre> File "/home/mgorny/pkgcore-venv/lib/python2.7/site-packages/pkgcore/operations/regen.py", line 15, in regen_iter + <tr class="" id="l80"><td><a href="#l80"><span>80</span></a></td><td><pre> File "/home/mgorny/pkgcore-venv/lib/python2.7/site-packages/pkgcore/operations/regen.py", line 15, in regen_iter </pre></td></tr> - <tr class="" id="l80"><td><a href="#l80"><span>80</span></a></td><td><pre> regen_func(x) + <tr class="" id="l81"><td><a href="#l81"><span>81</span></a></td><td><pre> regen_func(x) </pre></td></tr> - <tr class="" id="l81"><td><a href="#l81"><span>81</span></a></td><td><pre> File "/home/mgorny/pkgcore-venv/lib/python2.7/site-packages/pkgcore/ebuild/repository.py", line 520, in __call__ + <tr class="" id="l82"><td><a href="#l82"><span>82</span></a></td><td><pre> File "/home/mgorny/pkgcore-venv/lib/python2.7/site-packages/pkgcore/ebuild/repository.py", line 520, in __call__ </pre></td></tr> - <tr class="" id="l82"><td><a href="#l82"><span>82</span></a></td><td><pre> return pkg._fetch_metadata(ebp=self.ebp, force_regen=self.force) + <tr class="" id="l83"><td><a href="#l83"><span>83</span></a></td><td><pre> return pkg._fetch_metadata(ebp=self.ebp, force_regen=self.force) </pre></td></tr> - <tr class="" id="l83"><td><a href="#l83"><span>83</span></a></td><td><pre> File "/home/mgorny/pkgcore-venv/lib/python2.7/site-packages/pkgcore/ebuild/ebuild_src.py", line 277, in _fetch_metadata + <tr class="" id="l84"><td><a href="#l84"><span>84</span></a></td><td><pre> File "/home/mgorny/pkgcore-venv/lib/python2.7/site-packages/pkgcore/ebuild/ebuild_src.py", line 277, in _fetch_metadata </pre></td></tr> - <tr class="" id="l84"><td><a href="#l84"><span>84</span></a></td><td><pre> return self._parent._get_metadata(self, ebp=ebp, force_regen=force_regen) + <tr class="" id="l85"><td><a href="#l85"><span>85</span></a></td><td><pre> return self._parent._get_metadata(self, ebp=ebp, force_regen=force_regen) </pre></td></tr> - <tr class="" id="l85"><td><a href="#l85"><span>85</span></a></td><td><pre> File "/home/mgorny/pkgcore-venv/lib/python2.7/site-packages/pkgcore/ebuild/ebuild_src.py", line 366, in _get_metadata + <tr class="" id="l86"><td><a href="#l86"><span>86</span></a></td><td><pre> File "/home/mgorny/pkgcore-venv/lib/python2.7/site-packages/pkgcore/ebuild/ebuild_src.py", line 366, in _get_metadata </pre></td></tr> - <tr class="" id="l86"><td><a href="#l86"><span>86</span></a></td><td><pre> return self._update_metadata(pkg, ebp=ebp) + <tr class="" id="l87"><td><a href="#l87"><span>87</span></a></td><td><pre> return self._update_metadata(pkg, ebp=ebp) </pre></td></tr> - <tr class="" id="l87"><td><a href="#l87"><span>87</span></a></td><td><pre> File "/home/mgorny/pkgcore-venv/lib/python2.7/site-packages/pkgcore/ebuild/ebuild_src.py", line 374, in _update_metadata + <tr class="" id="l88"><td><a href="#l88"><span>88</span></a></td><td><pre> File "/home/mgorny/pkgcore-venv/lib/python2.7/site-packages/pkgcore/ebuild/ebuild_src.py", line 374, in _update_metadata </pre></td></tr> - <tr class="" id="l88"><td><a href="#l88"><span>88</span></a></td><td><pre> mydata = my_proc.get_keys(pkg, self._ecache) + <tr class="" id="l89"><td><a href="#l89"><span>89</span></a></td><td><pre> mydata = my_proc.get_keys(pkg, self._ecache) </pre></td></tr> - <tr class="" id="l89"><td><a href="#l89"><span>89</span></a></td><td><pre> File "/home/mgorny/pkgcore-venv/lib/python2.7/site-packages/pkgcore/ebuild/processor.py", line 788, in get_keys + <tr class="" id="l90"><td><a href="#l90"><span>90</span></a></td><td><pre> File "/home/mgorny/pkgcore-venv/lib/python2.7/site-packages/pkgcore/ebuild/processor.py", line 788, in get_keys </pre></td></tr> - <tr class="" id="l90"><td><a href="#l90"><span>90</span></a></td><td><pre> {"key": receive_key}) + <tr class="" id="l91"><td><a href="#l91"><span>91</span></a></td><td><pre> {"key": receive_key}) </pre></td></tr> - <tr class="" id="l91"><td><a href="#l91"><span>91</span></a></td><td><pre> File "/home/mgorny/pkgcore-venv/lib/python2.7/site-packages/pkgcore/ebuild/processor.py", line 721, in _run_depend_like_phase + <tr class="" id="l92"><td><a href="#l92"><span>92</span></a></td><td><pre> File "/home/mgorny/pkgcore-venv/lib/python2.7/site-packages/pkgcore/ebuild/processor.py", line 721, in _run_depend_like_phase </pre></td></tr> - <tr class="" id="l92"><td><a href="#l92"><span>92</span></a></td><td><pre> self.write("%s %i\n%s" % (command, len(data), data), append_newline=False) + <tr class="" id="l93"><td><a href="#l93"><span>93</span></a></td><td><pre> self.write("%s %i\n%s" % (command, len(data), data), append_newline=False) </pre></td></tr> - <tr class="" id="l93"><td><a href="#l93"><span>93</span></a></td><td><pre> File "/home/mgorny/pkgcore-venv/lib/python2.7/site-packages/pkgcore/ebuild/processor.py", line 419, in write + <tr class="" id="l94"><td><a href="#l94"><span>94</span></a></td><td><pre> File "/home/mgorny/pkgcore-venv/lib/python2.7/site-packages/pkgcore/ebuild/processor.py", line 419, in write </pre></td></tr> - <tr class="" id="l94"><td><a href="#l94"><span>94</span></a></td><td><pre> raise RuntimeError(ie) + <tr class="" id="l95"><td><a href="#l95"><span>95</span></a></td><td><pre> raise RuntimeError(ie) </pre></td></tr> - <tr class="" id="l95"><td><a href="#l95"><span>95</span></a></td><td><pre>RuntimeError: [Errno 32] Broken pipe + <tr class="" id="l96"><td><a href="#l96"><span>96</span></a></td><td><pre>RuntimeError: [Errno 32] Broken pipe </pre></td></tr> - <tr class="" id="l96"><td><a href="#l96"><span>96</span></a></td><td><pre> * Cache regen failed with 1 + <tr class="" id="l97"><td><a href="#l97"><span>97</span></a></td><td><pre> * Cache regen failed with 1 </pre></td></tr> </table> @@ -61,6 +61,7 @@ ERROR pkgcore: returned val from gen_metadata was 'False' !!! caught exception False while processing ebuild src: net-misc/asterisk-1.4.22.1 ERROR pkgcore: returned val from gen_metadata was 'False' !!! caught exception False while processing ebuild src: net-misc/bayonne2-1.1.0 +!!! caught exception ("Expected command; instead got nothing from ''", None) while processing ebuild src: net-misc/bayonne2-2.0.1 Traceback (most recent call last): File "/home/mgorny/pkgcore-venv/bin/pmaint", line 4, in <module> scripts.main(basename(__file__)) @@ -292,15 +292,15 @@ </pre></td><td>[FATAL]</td></tr> <tr class="" id="l141"><td><a href="#l141"><span>141</span></a></td><td><pre>ERROR pkgcore: returned val from gen_metadata was 'False' </pre></td></tr> - <tr class="err" id="l142"><td><a href="#l142"><span>142</span></a></td><td><pre>caught exception '%s' while processing '%s'(MetadataException('Metadata Exception: pkg ebuild src: perl-gcpan/Crypt-X509-0.51, attr description\nerror: Metadata Exception: pkg ebuild src: perl-gcpan/Crypt-X509-0.51, attr data\nerror: False',), <<class 'pkgcore.ebuild.ebuild_src.package'> cpv='perl-gcpan/Crypt-X509-0.51' @0x7f67f9edc410>) + <tr class="err" id="l142"><td><a href="#l142"><span>142</span></a></td><td><pre>caught exception '%s' while processing '%s'(MetadataException('Metadata Exception: pkg ebuild src: perl-gcpan/Crypt-X509-0.51, attr description\nerror: Metadata Exception: pkg ebuild src: perl-gcpan/Crypt-X509-0.51, attr data\nerror: False',), <<class 'pkgcore.ebuild.ebuild_src.package'> cpv='perl-gcpan/Crypt-X509-0.51' @0x7fd4f22f4410>) </pre></td><td>[FATAL]</td></tr> <tr class="" id="l143"><td><a href="#l143"><span>143</span></a></td><td><pre>ERROR pkgcore: returned val from gen_metadata was 'False' </pre></td></tr> - <tr class="err" id="l144"><td><a href="#l144"><span>144</span></a></td><td><pre>caught exception '%s' while processing '%s'(MetadataException('Metadata Exception: pkg ebuild src: perl-gcpan/MathML-Entities-0.17, attr description\nerror: Metadata Exception: pkg ebuild src: perl-gcpan/MathML-Entities-0.17, attr data\nerror: False',), <<class 'pkgcore.ebuild.ebuild_src.package'> cpv='perl-gcpan/MathML-Entities-0.17' @0x7f67f9edc550>) + <tr class="err" id="l144"><td><a href="#l144"><span>144</span></a></td><td><pre>caught exception '%s' while processing '%s'(MetadataException('Metadata Exception: pkg ebuild src: perl-gcpan/MathML-Entities-0.17, attr description\nerror: Metadata Exception: pkg ebuild src: perl-gcpan/MathML-Entities-0.17, attr data\nerror: False',), <<class 'pkgcore.ebuild.ebuild_src.package'> cpv='perl-gcpan/MathML-Entities-0.17' @0x7fd4f22f4550>) </pre></td><td>[FATAL]</td></tr> <tr class="" id="l145"><td><a href="#l145"><span>145</span></a></td><td><pre>ERROR pkgcore: returned val from gen_metadata was 'False' </pre></td></tr> - <tr class="err" id="l146"><td><a href="#l146"><span>146</span></a></td><td><pre>caught exception '%s' while processing '%s'(MetadataException('Metadata Exception: pkg ebuild src: app-crypt/msva-perl-9999, attr description\nerror: Metadata Exception: pkg ebuild src: app-crypt/msva-perl-9999, attr data\nerror: False',), <<class 'pkgcore.ebuild.ebuild_src.package'> cpv='app-crypt/msva-perl-9999' @0x7f67f9a3d050>) + <tr class="err" id="l146"><td><a href="#l146"><span>146</span></a></td><td><pre>caught exception '%s' while processing '%s'(MetadataException('Metadata Exception: pkg ebuild src: app-crypt/msva-perl-9999, attr description\nerror: Metadata Exception: pkg ebuild src: app-crypt/msva-perl-9999, attr data\nerror: False',), <<class 'pkgcore.ebuild.ebuild_src.package'> cpv='app-crypt/msva-perl-9999' @0x7fd4f1e55050>) </pre></td><td>[FATAL]</td></tr> <tr class="" id="l147"><td><a href="#l147"><span>147</span></a></td><td><pre> * Cache regen failed with 1 </pre></td></tr> @@ -139,9 +139,9 @@ ERROR pkgcore: returned val from gen_metadata was 'False' ERROR pkgcore: returned val from gen_metadata was 'False' !!! caught exception False while processing ebuild src: app-crypt/msva-perl-9999 ERROR pkgcore: returned val from gen_metadata was 'False' -caught exception '%s' while processing '%s'(MetadataException('Metadata Exception: pkg ebuild src: perl-gcpan/Crypt-X509-0.51, attr description\nerror: Metadata Exception: pkg ebuild src: perl-gcpan/Crypt-X509-0.51, attr data\nerror: False',), <<class 'pkgcore.ebuild.ebuild_src.package'> cpv='perl-gcpan/Crypt-X509-0.51' @0x7f67f9edc410>) +caught exception '%s' while processing '%s'(MetadataException('Metadata Exception: pkg ebuild src: perl-gcpan/Crypt-X509-0.51, attr description\nerror: Metadata Exception: pkg ebuild src: perl-gcpan/Crypt-X509-0.51, attr data\nerror: False',), <<class 'pkgcore.ebuild.ebuild_src.package'> cpv='perl-gcpan/Crypt-X509-0.51' @0x7fd4f22f4410>) ERROR pkgcore: returned val from gen_metadata was 'False' -caught exception '%s' while processing '%s'(MetadataException('Metadata Exception: pkg ebuild src: perl-gcpan/MathML-Entities-0.17, attr description\nerror: Metadata Exception: pkg ebuild src: perl-gcpan/MathML-Entities-0.17, attr data\nerror: False',), <<class 'pkgcore.ebuild.ebuild_src.package'> cpv='perl-gcpan/MathML-Entities-0.17' @0x7f67f9edc550>) +caught exception '%s' while processing '%s'(MetadataException('Metadata Exception: pkg ebuild src: perl-gcpan/MathML-Entities-0.17, attr description\nerror: Metadata Exception: pkg ebuild src: perl-gcpan/MathML-Entities-0.17, attr data\nerror: False',), <<class 'pkgcore.ebuild.ebuild_src.package'> cpv='perl-gcpan/MathML-Entities-0.17' @0x7fd4f22f4550>) ERROR pkgcore: returned val from gen_metadata was 'False' -caught exception '%s' while processing '%s'(MetadataException('Metadata Exception: pkg ebuild src: app-crypt/msva-perl-9999, attr description\nerror: Metadata Exception: pkg ebuild src: app-crypt/msva-perl-9999, attr data\nerror: False',), <<class 'pkgcore.ebuild.ebuild_src.package'> cpv='app-crypt/msva-perl-9999' @0x7f67f9a3d050>) +caught exception '%s' while processing '%s'(MetadataException('Metadata Exception: pkg ebuild src: app-crypt/msva-perl-9999, attr description\nerror: Metadata Exception: pkg ebuild src: app-crypt/msva-perl-9999, attr data\nerror: False',), <<class 'pkgcore.ebuild.ebuild_src.package'> cpv='app-crypt/msva-perl-9999' @0x7fd4f1e55050>) * Cache regen failed with 1 @@ -150,7 +150,7 @@ </pre></td><td>[FATAL]</td></tr> <tr class="" id="l70"><td><a href="#l70"><span>70</span></a></td><td><pre>ERROR pkgcore: returned val from gen_metadata was 'False' </pre></td></tr> - <tr class="err" id="l71"><td><a href="#l71"><span>71</span></a></td><td><pre>caught exception '%s' while processing '%s'(MetadataException('Metadata Exception: pkg ebuild src: app-accessibility/florence-0.6.0, attr description\nerror: Metadata Exception: pkg ebuild src: app-accessibility/florence-0.6.0, attr data\nerror: False',), <<class 'pkgcore.ebuild.ebuild_src.package'> cpv='app-accessibility/florence-0.6.0' @0x7f3ce4821550>) + <tr class="err" id="l71"><td><a href="#l71"><span>71</span></a></td><td><pre>caught exception '%s' while processing '%s'(MetadataException('Metadata Exception: pkg ebuild src: app-accessibility/florence-0.6.0, attr description\nerror: Metadata Exception: pkg ebuild src: app-accessibility/florence-0.6.0, attr data\nerror: False',), <<class 'pkgcore.ebuild.ebuild_src.package'> cpv='app-accessibility/florence-0.6.0' @0x7f1d7e479550>) </pre></td><td>[FATAL]</td></tr> <tr class="" id="l72"><td><a href="#l72"><span>72</span></a></td><td><pre> * Cache regen failed with 1 </pre></td></tr> @@ -68,5 +68,5 @@ WARNING:pkgcore:repository at '/home/mgorny/repos/steveeJ' has unsupported profi ERROR pkgcore: returned val from gen_metadata was 'False' !!! caught exception False while processing ebuild src: app-accessibility/florence-0.6.0 ERROR pkgcore: returned val from gen_metadata was 'False' -caught exception '%s' while processing '%s'(MetadataException('Metadata Exception: pkg ebuild src: app-accessibility/florence-0.6.0, attr description\nerror: Metadata Exception: pkg ebuild src: app-accessibility/florence-0.6.0, attr data\nerror: False',), <<class 'pkgcore.ebuild.ebuild_src.package'> cpv='app-accessibility/florence-0.6.0' @0x7f3ce4821550>) +caught exception '%s' while processing '%s'(MetadataException('Metadata Exception: pkg ebuild src: app-accessibility/florence-0.6.0, attr description\nerror: Metadata Exception: pkg ebuild src: app-accessibility/florence-0.6.0, attr data\nerror: False',), <<class 'pkgcore.ebuild.ebuild_src.package'> cpv='app-accessibility/florence-0.6.0' @0x7f1d7e479550>) * Cache regen failed with 1 diff --git a/xwing.html b/xwing.html index 7f251fd7d749..01c8624347c2 100644 --- a/xwing.html +++ b/xwing.html @@ -74,27 +74,79 @@ </pre></td></tr> <tr class="" id="l32"><td><a href="#l32"><span>32</span></a></td><td><pre>Total bytes sent: 85 </pre></td></tr> - <tr class="" id="l33"><td><a href="#l33"><span>33</span></a></td><td><pre>Total bytes received: 133 + <tr class="" id="l33"><td><a href="#l33"><span>33</span></a></td><td><pre>Total bytes received: 131 </pre></td></tr> <tr class="" id="l34"><td><a href="#l34"><span>34</span></a></td><td><pre> </pre></td></tr> - <tr class="" id="l35"><td><a href="#l35"><span>35</span></a></td><td><pre>sent 85 bytes received 133 bytes 145.33 bytes/sec + <tr class="" id="l35"><td><a href="#l35"><span>35</span></a></td><td><pre>sent 85 bytes received 131 bytes 25.41 bytes/sec </pre></td></tr> <tr class="" id="l36"><td><a href="#l36"><span>36</span></a></td><td><pre>total size is 32 speedup is 0.15 </pre></td></tr> - <tr class="" id="l37"><td><a href="#l37"><span>37</span></a></td><td><pre>*** syncing xwing + <tr class="" id="l37"><td><a href="#l37"><span>37</span></a></td><td><pre>This is xwing.info / coruscant.xwing.info </pre></td></tr> - <tr class="" id="l38"><td><a href="#l38"><span>38</span></a></td><td><pre>*** synced xwing + <tr class="" id="l38"><td><a href="#l38"><span>38</span></a></td><td><pre> </pre></td></tr> - <tr class="" id="l39"><td><a href="#l39"><span>39</span></a></td><td><pre> * Sync succeeded + <tr class="" id="l39"><td><a href="#l39"><span>39</span></a></td><td><pre>Server Address : 62.212.103.27 / 2001:7a8:2b1b::254 </pre></td></tr> - <tr class="" id="l40"><td><a href="#l40"><span>40</span></a></td><td><pre>$ pmaint regen --use-local-desc --pkg-desc-index -t 1 xwing + <tr class="" id="l40"><td><a href="#l40"><span>40</span></a></td><td><pre>Contact Name : webmaster@xwing.info </pre></td></tr> - <tr class="" id="l41"><td><a href="#l41"><span>41</span></a></td><td><pre>WARNING:pkgcore:repository at '/home/mgorny/repos/steveeJ' has unsupported profile format(s): 'profile-set' + <tr class="" id="l41"><td><a href="#l41"><span>41</span></a></td><td><pre>Hardware : Intel Atom D510 @ 1.66GHz, 2048MB RAM </pre></td></tr> - <tr class="" id="l42"><td><a href="#l42"><span>42</span></a></td><td><pre>WARNING:pkgcore:repository at '/home/mgorny/repos/steveeJ' has unsupported profile format(s): 'profile-set' + <tr class="" id="l42"><td><a href="#l42"><span>42</span></a></td><td><pre> </pre></td></tr> - <tr class="" id="l43"><td><a href="#l43"><span>43</span></a></td><td><pre> * Cache regenerated successfully + <tr class="" id="l43"><td><a href="#l43"><span>43</span></a></td><td><pre>receiving incremental file list +</pre></td></tr> + <tr class="" id="l44"><td><a href="#l44"><span>44</span></a></td><td><pre>metadata/ +</pre></td></tr> + <tr class="" id="l45"><td><a href="#l45"><span>45</span></a></td><td><pre>metadata/timestamp.chk +</pre></td></tr> + <tr class="" id="l46"><td><a href="#l46"><span>46</span></a></td><td><pre> +</pre></td></tr> + <tr class="" id="l47"><td><a href="#l47"><span>47</span></a></td><td><pre>Number of files: 131 (reg: 84, dir: 45, link: 2) +</pre></td></tr> + <tr class="" id="l48"><td><a href="#l48"><span>48</span></a></td><td><pre>Number of created files: 0 +</pre></td></tr> + <tr class="" id="l49"><td><a href="#l49"><span>49</span></a></td><td><pre>Number of deleted files: 0 +</pre></td></tr> + <tr class="" id="l50"><td><a href="#l50"><span>50</span></a></td><td><pre>Number of regular files transferred: 1 +</pre></td></tr> + <tr class="" id="l51"><td><a href="#l51"><span>51</span></a></td><td><pre>Total file size: 182.06K bytes +</pre></td></tr> + <tr class="" id="l52"><td><a href="#l52"><span>52</span></a></td><td><pre>Total transferred file size: 32 bytes +</pre></td></tr> + <tr class="" id="l53"><td><a href="#l53"><span>53</span></a></td><td><pre>Literal data: 32 bytes +</pre></td></tr> + <tr class="" id="l54"><td><a href="#l54"><span>54</span></a></td><td><pre>Matched data: 0 bytes +</pre></td></tr> + <tr class="" id="l55"><td><a href="#l55"><span>55</span></a></td><td><pre>File list size: 4.21K +</pre></td></tr> + <tr class="" id="l56"><td><a href="#l56"><span>56</span></a></td><td><pre>File list generation time: 0.001 seconds +</pre></td></tr> + <tr class="" id="l57"><td><a href="#l57"><span>57</span></a></td><td><pre>File list transfer time: 0.000 seconds +</pre></td></tr> + <tr class="" id="l58"><td><a href="#l58"><span>58</span></a></td><td><pre>Total bytes sent: 136 +</pre></td></tr> + <tr class="" id="l59"><td><a href="#l59"><span>59</span></a></td><td><pre>Total bytes received: 4.34K +</pre></td></tr> + <tr class="" id="l60"><td><a href="#l60"><span>60</span></a></td><td><pre> +</pre></td></tr> + <tr class="" id="l61"><td><a href="#l61"><span>61</span></a></td><td><pre>sent 136 bytes received 4.34K bytes 471.26 bytes/sec +</pre></td></tr> + <tr class="" id="l62"><td><a href="#l62"><span>62</span></a></td><td><pre>total size is 182.06K speedup is 40.67 +</pre></td></tr> + <tr class="" id="l63"><td><a href="#l63"><span>63</span></a></td><td><pre>*** syncing xwing +</pre></td></tr> + <tr class="" id="l64"><td><a href="#l64"><span>64</span></a></td><td><pre>*** synced xwing +</pre></td></tr> + <tr class="" id="l65"><td><a href="#l65"><span>65</span></a></td><td><pre> * Sync succeeded +</pre></td></tr> + <tr class="" id="l66"><td><a href="#l66"><span>66</span></a></td><td><pre>$ pmaint regen --use-local-desc --pkg-desc-index -t 1 xwing +</pre></td></tr> + <tr class="" id="l67"><td><a href="#l67"><span>67</span></a></td><td><pre>WARNING:pkgcore:repository at '/home/mgorny/repos/steveeJ' has unsupported profile format(s): 'profile-set' +</pre></td></tr> + <tr class="" id="l68"><td><a href="#l68"><span>68</span></a></td><td><pre>WARNING:pkgcore:repository at '/home/mgorny/repos/steveeJ' has unsupported profile format(s): 'profile-set' +</pre></td></tr> + <tr class="" id="l69"><td><a href="#l69"><span>69</span></a></td><td><pre> * Cache regenerated successfully </pre></td></tr> </table> diff --git a/xwing.txt b/xwing.txt index 9a2731b760a9..b4d86bb46830 100644 --- a/xwing.txt +++ b/xwing.txt @@ -30,10 +30,36 @@ File list size: 47 File list generation time: 0.001 seconds File list transfer time: 0.000 seconds Total bytes sent: 85 -Total bytes received: 133 +Total bytes received: 131 -sent 85 bytes received 133 bytes 145.33 bytes/sec +sent 85 bytes received 131 bytes 25.41 bytes/sec total size is 32 speedup is 0.15 +This is xwing.info / coruscant.xwing.info + +Server Address : 62.212.103.27 / 2001:7a8:2b1b::254 +Contact Name : webmaster@xwing.info +Hardware : Intel Atom D510 @ 1.66GHz, 2048MB RAM + +receiving incremental file list +metadata/ +metadata/timestamp.chk + +Number of files: 131 (reg: 84, dir: 45, link: 2) +Number of created files: 0 +Number of deleted files: 0 +Number of regular files transferred: 1 +Total file size: 182.06K bytes +Total transferred file size: 32 bytes +Literal data: 32 bytes +Matched data: 0 bytes +File list size: 4.21K +File list generation time: 0.001 seconds +File list transfer time: 0.000 seconds +Total bytes sent: 136 +Total bytes received: 4.34K + +sent 136 bytes received 4.34K bytes 471.26 bytes/sec +total size is 182.06K speedup is 40.67 *** syncing xwing *** synced xwing * Sync succeeded diff --git a/y2kbadbug.html b/y2kbadbug.html index 8714347a764f..4e1516e5fa9b 100644 --- a/y2kbadbug.html +++ b/y2kbadbug.html @@ -130,7 +130,7 @@ </pre></td><td>[FATAL]</td></tr> <tr class="" id="l60"><td><a href="#l60"><span>60</span></a></td><td><pre>ERROR pkgcore: returned val from gen_metadata was 'False' </pre></td></tr> - <tr class="err" id="l61"><td><a href="#l61"><span>61</span></a></td><td><pre>caught exception '%s' while processing '%s'(MetadataException('Metadata Exception: pkg ebuild src: x11-misc/kdocker-5.0, attr description\nerror: Metadata Exception: pkg ebuild src: x11-misc/kdocker-5.0, attr data\nerror: False',), <<class 'pkgcore.ebuild.ebuild_src.package'> cpv='x11-misc/kdocker-5.0' @0x7f5bb5871e10>) + <tr class="err" id="l61"><td><a href="#l61"><span>61</span></a></td><td><pre>caught exception '%s' while processing '%s'(MetadataException('Metadata Exception: pkg ebuild src: x11-misc/kdocker-5.0, attr description\nerror: Metadata Exception: pkg ebuild src: x11-misc/kdocker-5.0, attr data\nerror: False',), <<class 'pkgcore.ebuild.ebuild_src.package'> cpv='x11-misc/kdocker-5.0' @0x7eff01081e10>) </pre></td><td>[FATAL]</td></tr> <tr class="" id="l62"><td><a href="#l62"><span>62</span></a></td><td><pre> * Cache regen failed with 1 </pre></td></tr> diff --git a/y2kbadbug.txt b/y2kbadbug.txt index 78e7015ad469..d9d19910bf83 100644 --- a/y2kbadbug.txt +++ b/y2kbadbug.txt @@ -58,5 +58,5 @@ WARNING:pkgcore:repository at '/home/mgorny/repos/steveeJ' has unsupported profi ERROR pkgcore: returned val from gen_metadata was 'False' !!! caught exception False while processing ebuild src: x11-misc/kdocker-5.0 ERROR pkgcore: returned val from gen_metadata was 'False' -caught exception '%s' while processing '%s'(MetadataException('Metadata Exception: pkg ebuild src: x11-misc/kdocker-5.0, attr description\nerror: Metadata Exception: pkg ebuild src: x11-misc/kdocker-5.0, attr data\nerror: False',), <<class 'pkgcore.ebuild.ebuild_src.package'> cpv='x11-misc/kdocker-5.0' @0x7f5bb5871e10>) +caught exception '%s' while processing '%s'(MetadataException('Metadata Exception: pkg ebuild src: x11-misc/kdocker-5.0, attr description\nerror: Metadata Exception: pkg ebuild src: x11-misc/kdocker-5.0, attr data\nerror: False',), <<class 'pkgcore.ebuild.ebuild_src.package'> cpv='x11-misc/kdocker-5.0' @0x7eff01081e10>) * Cache regen failed with 1 diff --git a/zugaina.html b/zugaina.html index 2fe516dccaec..c28178e1e1d4 100644 --- a/zugaina.html +++ b/zugaina.html @@ -58,15 +58,15 @@ </pre></td></tr> <tr class="" id="l24"><td><a href="#l24"><span>24</span></a></td><td><pre>File list transfer time: 0.000 seconds </pre></td></tr> - <tr class="" id="l25"><td><a href="#l25"><span>25</span></a></td><td><pre>Total bytes sent: 717 + <tr class="" id="l25"><td><a href="#l25"><span>25</span></a></td><td><pre>Total bytes sent: 721 </pre></td></tr> <tr class="" id="l26"><td><a href="#l26"><span>26</span></a></td><td><pre>Total bytes received: 64.07K </pre></td></tr> <tr class="" id="l27"><td><a href="#l27"><span>27</span></a></td><td><pre> </pre></td></tr> - <tr class="" id="l28"><td><a href="#l28"><span>28</span></a></td><td><pre>sent 717 bytes received 64.07K bytes 25.91K bytes/sec + <tr class="" id="l28"><td><a href="#l28"><span>28</span></a></td><td><pre>sent 721 bytes received 64.07K bytes 25.92K bytes/sec </pre></td></tr> - <tr class="" id="l29"><td><a href="#l29"><span>29</span></a></td><td><pre>total size is 3.19M speedup is 49.29 + <tr class="" id="l29"><td><a href="#l29"><span>29</span></a></td><td><pre>total size is 3.19M speedup is 49.28 </pre></td></tr> <tr class="" id="l30"><td><a href="#l30"><span>30</span></a></td><td><pre>*** syncing zugaina </pre></td></tr> diff --git a/zugaina.txt b/zugaina.txt index 78f09caa1945..63331cf38ecc 100644 --- a/zugaina.txt +++ b/zugaina.txt @@ -22,11 +22,11 @@ Matched data: 0 bytes File list size: 54.75K File list generation time: 0.001 seconds File list transfer time: 0.000 seconds -Total bytes sent: 717 +Total bytes sent: 721 Total bytes received: 64.07K -sent 717 bytes received 64.07K bytes 25.91K bytes/sec -total size is 3.19M speedup is 49.29 +sent 721 bytes received 64.07K bytes 25.92K bytes/sec +total size is 3.19M speedup is 49.28 *** syncing zugaina *** synced zugaina * Sync succeeded |