From 9eb6dd1b04ca4e34d76f6c096e015f9f1cdfc7b2 Mon Sep 17 00:00:00 2001 From: Repository QA checks Date: Thu, 15 Oct 2015 22:42:02 -0400 Subject: 2015-10-16T02:40:01 --- graveyard.html | 196 +++++++++++++++++++++++++++++++-------------------------- 1 file changed, 108 insertions(+), 88 deletions(-) (limited to 'graveyard.html') diff --git a/graveyard.html b/graveyard.html index 832312ae39f5..211ea59a8903 100644 --- a/graveyard.html +++ b/graveyard.html @@ -32,181 +32,201 @@ 11
$ pmaint sync graveyard
 
- 12
WARNING:pkgcore:repository at '/home/mgorny/sync/steveeJ' has unsupported profile format(s): 'profile-set'
+            12
WARNING:pkgcore:repository at location '/home/mgorny/sync/bitcoin' lacks a defined repo_name
 
- 13
Already up-to-date.
+            13
WARNING:pkgcore:repository at '/home/mgorny/sync/bitcoin', named 'bitcoin', doesn't specify masters in metadata/layout.conf. Defaulting to whatever repository is defined as 'default' (gentoo usually). Please explicitly set the masters, or set masters = '' if the repository is standalone.
 
- 14
*** syncing graveyard
+            14
WARNING:pkgcore:repository at location '/home/mgorny/sync/abadonna-overlay' lacks a defined repo_name
 
- 15
*** synced graveyard
+            15
WARNING:pkgcore:repository at '/home/mgorny/sync/abadonna-overlay', named 'abadonna-overlay', doesn't specify masters in metadata/layout.conf. Defaulting to whatever repository is defined as 'default' (gentoo usually). Please explicitly set the masters, or set masters = '' if the repository is standalone.
 
- 16
 * Sync succeeded
+            16
WARNING:pkgcore:repository at '/home/mgorny/sync/steveeJ' has unsupported profile format(s): 'profile-set'
 
- 17
$ pmaint regen --use-local-desc --pkg-desc-index -t 1 graveyard
+            17
WARNING:pkgcore:repository at location '/home/mgorny/sync/flow' lacks a defined repo_name
 
- 18
WARNING:pkgcore:repository at '/home/mgorny/repos/steveeJ' has unsupported profile format(s): 'profile-set'
+            18
WARNING:pkgcore:repository at '/home/mgorny/sync/flow', named 'flow', doesn't specify masters in metadata/layout.conf. Defaulting to whatever repository is defined as 'default' (gentoo usually). Please explicitly set the masters, or set masters = '' if the repository is standalone.
 
- 19
WARNING:pkgcore:repository at '/home/mgorny/repos/steveeJ' has unsupported profile format(s): 'profile-set'
+            19
WARNING:pkgcore:repository at location '/home/mgorny/sync/abadonna-overlay' lacks a defined repo_name
 
- 20
+            20
WARNING:pkgcore:repository at '/home/mgorny/sync/abadonna-overlay', named 'abadonna-overlay', doesn't specify masters in metadata/layout.conf. Defaulting to whatever repository is defined as 'default' (gentoo usually). Please explicitly set the masters, or set masters = '' if the repository is standalone.
 
- 21
!!! ERROR: media-plugins/xmms-kde-3.1 failed.
+            21
WARNING:pkgcore:repository at location '/home/mgorny/sync/bitcoin' lacks a defined repo_name
+
+ 22
WARNING:pkgcore:repository at '/home/mgorny/sync/bitcoin', named 'bitcoin', doesn't specify masters in metadata/layout.conf. Defaulting to whatever repository is defined as 'default' (gentoo usually). Please explicitly set the masters, or set masters = '' if the repository is standalone.
+
+ 23
Already up-to-date.
+
+ 24
*** syncing graveyard
+
+ 25
*** synced graveyard
+
+ 26
 * Sync succeeded
+
+ 27
$ pmaint regen --use-local-desc --pkg-desc-index -t 1 graveyard
+
+ 28
WARNING:pkgcore:repository at '/home/mgorny/repos/steveeJ' has unsupported profile format(s): 'profile-set'
+
+ 29
WARNING:pkgcore:repository at '/home/mgorny/repos/steveeJ' has unsupported profile format(s): 'profile-set'
+
+ 30
+
+ 31
!!! ERROR: media-plugins/xmms-kde-3.1 failed.
 
[FATAL] - 22
!!! die invoked from directory /home/mgorny/pkgcore-venv/lib/pkgcore
+            32
!!! die invoked from directory /home/mgorny/pkgcore-venv/lib/pkgcore
 
- 23
!!! Call stack:
+            33
!!! Call stack:
 
- 24
!!!             ebuild-daemon.bash, line 458:  Called __ebd_exec_main 'daemonize'
+            34
!!!             ebuild-daemon.bash, line 458:  Called __ebd_exec_main 'daemonize'
 
- 25
!!!             ebuild-daemon.bash, line 210:  Called __ebd_main_loop
+            35
!!!             ebuild-daemon.bash, line 210:  Called __ebd_main_loop
 
- 26
!!!             ebuild-daemon.bash, line 441:  Called __ebd_process_metadata '186' 'depend'
+            36
!!!             ebuild-daemon.bash, line 441:  Called __ebd_process_metadata '186' 'depend'
 
- 27
!!!             ebuild-daemon.bash, line 374:  Called __execute_phases 'depend'
+            37
!!!             ebuild-daemon.bash, line 374:  Called __execute_phases 'depend'
 
- 28
!!!                     ebuild.lib, line 431:  Called __load_ebuild '/home/mgorny/repos/graveyard/media-plugins/xmms-kde/xmms-kde-3.1.ebuild'
+            38
!!!                     ebuild.lib, line 431:  Called __load_ebuild '/home/mgorny/repos/graveyard/media-plugins/xmms-kde/xmms-kde-3.1.ebuild'
 
- 29
!!!                     ebuild.lib, line 252:  Called __qa_invoke 'source' '/home/mgorny/repos/graveyard/media-plugins/xmms-kde/xmms-kde-3.1.ebuild'
+            39
!!!                     ebuild.lib, line 252:  Called __qa_invoke 'source' '/home/mgorny/repos/graveyard/media-plugins/xmms-kde/xmms-kde-3.1.ebuild'
 
- 30
!!!         isolated-functions.lib, line 286:  Called source '/home/mgorny/repos/graveyard/media-plugins/xmms-kde/xmms-kde-3.1.ebuild'
+            40
!!!         isolated-functions.lib, line 286:  Called source '/home/mgorny/repos/graveyard/media-plugins/xmms-kde/xmms-kde-3.1.ebuild'
 
- 31
!!!            xmms-kde-3.1.ebuild, line   7:  Called inherit 'kde' 'eutils'
+            41
!!!            xmms-kde-3.1.ebuild, line   7:  Called inherit 'kde' 'eutils'
 
- 32
!!!   ebuild-default-functions.lib, line 230:  Called __internal_inherit 'kde'
+            42
!!!   ebuild-default-functions.lib, line 230:  Called __internal_inherit 'kde'
 
- 33
!!!              ebuild-daemon.lib, line  30:  Called __qa_invoke 'source' '/home/mgorny/repos/graveyard/eclass/kde.eclass'
+            43
!!!              ebuild-daemon.lib, line  30:  Called __qa_invoke 'source' '/home/mgorny/repos/graveyard/eclass/kde.eclass'
 
- 34
!!!         isolated-functions.lib, line 286:  Called source '/home/mgorny/repos/graveyard/eclass/kde.eclass'
+            44
!!!         isolated-functions.lib, line 286:  Called source '/home/mgorny/repos/graveyard/eclass/kde.eclass'
 
- 35
!!!                     kde.eclass, line  18:  Called inherit 'base' 'eutils' 'kde-functions' 'flag-o-matic' 'libtool' 'autotools'
+            45
!!!                     kde.eclass, line  18:  Called inherit 'base' 'eutils' 'kde-functions' 'flag-o-matic' 'libtool' 'autotools'
 
- 36
!!!   ebuild-default-functions.lib, line 230:  Called __internal_inherit 'kde-functions'
+            46
!!!   ebuild-default-functions.lib, line 230:  Called __internal_inherit 'kde-functions'
 
- 37
!!!              ebuild-daemon.lib, line  35:  Called die
+            47
!!!              ebuild-daemon.lib, line  35:  Called die
 
- 38
!!! The die message:
+            48
!!! The die message:
 
[FATAL] - 39
!!!  inherit for kde-functions failed
+            49
!!!  inherit for kde-functions failed
 
- 40
+            50
 
- 41
+            51
 
- 42
!!! ERROR: media-plugins/xmms-scivi-0.2.0_rc3 failed.
+            52
!!! ERROR: media-plugins/xmms-scivi-0.2.0_rc3 failed.
 
[FATAL] - 43
!!! die invoked from directory /home/mgorny/pkgcore-venv/lib/pkgcore
+            53
!!! die invoked from directory /home/mgorny/pkgcore-venv/lib/pkgcore
 
- 44
!!! Call stack:
+            54
!!! Call stack:
 
- 45
!!!             ebuild-daemon.bash, line 458:  Called __ebd_exec_main 'daemonize'
+            55
!!!             ebuild-daemon.bash, line 458:  Called __ebd_exec_main 'daemonize'
 
- 46
!!!             ebuild-daemon.bash, line 210:  Called __ebd_main_loop
+            56
!!!             ebuild-daemon.bash, line 210:  Called __ebd_main_loop
 
- 47
!!!             ebuild-daemon.bash, line 441:  Called __ebd_process_metadata '226' 'depend'
+            57
!!!             ebuild-daemon.bash, line 441:  Called __ebd_process_metadata '226' 'depend'
 
- 48
!!!             ebuild-daemon.bash, line 374:  Called __execute_phases 'depend'
+            58
!!!             ebuild-daemon.bash, line 374:  Called __execute_phases 'depend'
 
- 49
!!!                     ebuild.lib, line 431:  Called __load_ebuild '/home/mgorny/repos/graveyard/media-plugins/xmms-scivi/xmms-scivi-0.2.0_rc3.ebuild'
+            59
!!!                     ebuild.lib, line 431:  Called __load_ebuild '/home/mgorny/repos/graveyard/media-plugins/xmms-scivi/xmms-scivi-0.2.0_rc3.ebuild'
 
- 50
!!!                     ebuild.lib, line 252:  Called __qa_invoke 'source' '/home/mgorny/repos/graveyard/media-plugins/xmms-scivi/xmms-scivi-0.2.0_rc3.ebuild'
+            60
!!!                     ebuild.lib, line 252:  Called __qa_invoke 'source' '/home/mgorny/repos/graveyard/media-plugins/xmms-scivi/xmms-scivi-0.2.0_rc3.ebuild'
 
- 51
!!!         isolated-functions.lib, line 286:  Called source '/home/mgorny/repos/graveyard/media-plugins/xmms-scivi/xmms-scivi-0.2.0_rc3.ebuild'
+            61
!!!         isolated-functions.lib, line 286:  Called source '/home/mgorny/repos/graveyard/media-plugins/xmms-scivi/xmms-scivi-0.2.0_rc3.ebuild'
 
- 52
!!!    xmms-scivi-0.2.0_rc3.ebuild, line   7:  Called inherit 'base' 'autotools'
+            62
!!!    xmms-scivi-0.2.0_rc3.ebuild, line   7:  Called inherit 'base' 'autotools'
 
- 53
!!!   ebuild-default-functions.lib, line 230:  Called __internal_inherit 'base'
+            63
!!!   ebuild-default-functions.lib, line 230:  Called __internal_inherit 'base'
 
- 54
!!!              ebuild-daemon.lib, line  37:  Called die
+            64
!!!              ebuild-daemon.lib, line  37:  Called die
 
- 55
!!! The die message:
+            65
!!! The die message:
 
[FATAL] - 56
!!!  unknown inherit command from pythonic side, 'gen_metadata 226' for eclass base
+            66
!!!  unknown inherit command from pythonic side, 'gen_metadata 226' for eclass base
 
- 57
+            67
 
- 58
received unknown com: export CATEGORY='media-plugins' PR=r0 PVR='0.3.6' PV='0.3.6' EBUILD='/home/mgorny/repos/graveyard/media-plugins/xmms-scrobbler/xmms-scrobbler-0.3.6.ebuild' P='xmms-scrobbler-0.3.6' PF='xmms-scrobbler-0.3.6' PN='xmms-scrobbler'path
+            68
received unknown com: export CATEGORY='media-plugins' PR=r0 PVR='0.3.6' PV='0.3.6' EBUILD='/home/mgorny/repos/graveyard/media-plugins/xmms-scrobbler/xmms-scrobbler-0.3.6.ebuild' P='xmms-scrobbler-0.3.6' PF='xmms-scrobbler-0.3.6' PN='xmms-scrobbler'path
 
- 59
!!! caught exception inherit requires an unknown eclass, kde-functions cannot be found while processing ebuild src: media-plugins/xmms-kde-3.1
+            69
!!! caught exception inherit requires an unknown eclass, kde-functions cannot be found while processing ebuild src: media-plugins/xmms-kde-3.1
 
[FATAL] - 60
ERROR pkgcore: returned val from gen_metadata was 'False'
+            70
ERROR pkgcore: returned val from gen_metadata was 'False'
 
- 61
!!! caught exception False while processing ebuild src: media-plugins/xmms-kjofol-0.95
+            71
!!! caught exception False while processing ebuild src: media-plugins/xmms-kjofol-0.95
 
[FATAL] - 62
!!! caught exception Metadata Exception: pkg ebuild src: media-plugins/xmms-scivi-0.2.0_rc3, attr eapi
+            72
!!! caught exception Metadata Exception: pkg ebuild src: media-plugins/xmms-scivi-0.2.0_rc3, attr eapi
 
[FATAL] - 63
error: parsed eapi '2' doesn't match sourced eapi '0' while processing ebuild src: media-plugins/xmms-scivi-0.2.0_rc3
+            73
error: parsed eapi '2' doesn't match sourced eapi '0' while processing ebuild src: media-plugins/xmms-scivi-0.2.0_rc3
 
- 64
ERROR pkgcore: returned val from gen_metadata was 'False'
+            74
ERROR pkgcore: returned val from gen_metadata was 'False'
 
- 65
!!! caught exception False while processing ebuild src: media-plugins/xmms-scrobbler-0.3.6
+            75
!!! caught exception False while processing ebuild src: media-plugins/xmms-scrobbler-0.3.6
 
[FATAL] - 66
!!! caught exception ("Expected command; instead got nothing from ''", None) while processing ebuild src: media-plugins/xmms-scrobbler-0.3.7
+            76
!!! caught exception ("Expected command; instead got nothing from ''", None) while processing ebuild src: media-plugins/xmms-scrobbler-0.3.7
 
[FATAL] - 67
Traceback (most recent call last):
+            77
Traceback (most recent call last):
 
- 68
  File "/home/mgorny/pkgcore-venv/bin/pmaint", line 4, in <module>
+            78
  File "/home/mgorny/pkgcore-venv/bin/pmaint", line 4, in <module>
 
- 69
    scripts.main(basename(__file__))
+            79
    scripts.main(basename(__file__))
 
- 70
  File "/home/mgorny/pkgcore-venv/lib/python2.7/site-packages/pkgcore/scripts/__init__.py", line 43, in main
+            80
  File "/home/mgorny/pkgcore-venv/lib/python2.7/site-packages/pkgcore/scripts/__init__.py", line 43, in main
 
- 71
    commandline.main(subcommands)
+            81
    commandline.main(subcommands)
 
- 72
  File "/home/mgorny/pkgcore-venv/lib/python2.7/site-packages/pkgcore/util/commandline.py", line 925, in main
+            82
  File "/home/mgorny/pkgcore-venv/lib/python2.7/site-packages/pkgcore/util/commandline.py", line 925, in main
 
- 73
    exitstatus = main_func(options, out, err)
+            83
    exitstatus = main_func(options, out, err)
 
- 74
  File "/home/mgorny/pkgcore-venv/lib/python2.7/site-packages/pkgcore/scripts/pmaint.py", line 283, in regen_main
+            84
  File "/home/mgorny/pkgcore-venv/lib/python2.7/site-packages/pkgcore/scripts/pmaint.py", line 283, in regen_main
 
- 75
    eclass_caching=(not options.disable_eclass_caching))
+            85
    eclass_caching=(not options.disable_eclass_caching))
 
- 76
  File "/home/mgorny/pkgcore-venv/lib/python2.7/site-packages/pkgcore/operations/__init__.py", line 68, in _recast_exception_decorator
+            86
  File "/home/mgorny/pkgcore-venv/lib/python2.7/site-packages/pkgcore/operations/__init__.py", line 68, in _recast_exception_decorator
 
- 77
    return functor(*args, **kwds)
+            87
    return functor(*args, **kwds)
 
- 78
  File "/home/mgorny/pkgcore-venv/lib/python2.7/site-packages/pkgcore/operations/repo.py", line 248, in _cmd_api_regen_cache
+            88
  File "/home/mgorny/pkgcore-venv/lib/python2.7/site-packages/pkgcore/operations/repo.py", line 248, in _cmd_api_regen_cache
 
- 79
    self._get_observer(observer), threads=threads, **options)
+            89
    self._get_observer(observer), threads=threads, **options)
 
- 80
  File "/home/mgorny/pkgcore-venv/lib/python2.7/site-packages/pkgcore/operations/regen.py", line 37, in regen_repository
+            90
  File "/home/mgorny/pkgcore-venv/lib/python2.7/site-packages/pkgcore/operations/regen.py", line 37, in regen_repository
 
- 81
    regen_iter(iter(repo), _get_repo_helper(), observer)
+            91
    regen_iter(iter(repo), _get_repo_helper(), observer)
 
- 82
  File "/home/mgorny/pkgcore-venv/lib/python2.7/site-packages/pkgcore/operations/regen.py", line 15, in regen_iter
+            92
  File "/home/mgorny/pkgcore-venv/lib/python2.7/site-packages/pkgcore/operations/regen.py", line 15, in regen_iter
 
- 83
    regen_func(x)
+            93
    regen_func(x)
 
- 84
  File "/home/mgorny/pkgcore-venv/lib/python2.7/site-packages/pkgcore/ebuild/repository.py", line 529, in __call__
+            94
  File "/home/mgorny/pkgcore-venv/lib/python2.7/site-packages/pkgcore/ebuild/repository.py", line 529, in __call__
 
- 85
    return pkg._fetch_metadata(ebp=self.ebp, force_regen=self.force)
+            95
    return pkg._fetch_metadata(ebp=self.ebp, force_regen=self.force)
 
- 86
  File "/home/mgorny/pkgcore-venv/lib/python2.7/site-packages/pkgcore/ebuild/ebuild_src.py", line 269, in _fetch_metadata
+            96
  File "/home/mgorny/pkgcore-venv/lib/python2.7/site-packages/pkgcore/ebuild/ebuild_src.py", line 269, in _fetch_metadata
 
- 87
    return self._parent._get_metadata(self, ebp=ebp, force_regen=force_regen)
+            97
    return self._parent._get_metadata(self, ebp=ebp, force_regen=force_regen)
 
- 88
  File "/home/mgorny/pkgcore-venv/lib/python2.7/site-packages/pkgcore/ebuild/ebuild_src.py", line 360, in _get_metadata
+            98
  File "/home/mgorny/pkgcore-venv/lib/python2.7/site-packages/pkgcore/ebuild/ebuild_src.py", line 360, in _get_metadata
 
- 89
    return self._update_metadata(pkg, ebp=ebp)
+            99
    return self._update_metadata(pkg, ebp=ebp)
 
- 90
  File "/home/mgorny/pkgcore-venv/lib/python2.7/site-packages/pkgcore/ebuild/ebuild_src.py", line 368, in _update_metadata
+            100
  File "/home/mgorny/pkgcore-venv/lib/python2.7/site-packages/pkgcore/ebuild/ebuild_src.py", line 368, in _update_metadata
 
- 91
    mydata = my_proc.get_keys(pkg, self._ecache)
+            101
    mydata = my_proc.get_keys(pkg, self._ecache)
 
- 92
  File "/home/mgorny/pkgcore-venv/lib/python2.7/site-packages/pkgcore/ebuild/processor.py", line 825, in get_keys
+            102
  File "/home/mgorny/pkgcore-venv/lib/python2.7/site-packages/pkgcore/ebuild/processor.py", line 825, in get_keys
 
- 93
    {"key": receive_key})
+            103
    {"key": receive_key})
 
- 94
  File "/home/mgorny/pkgcore-venv/lib/python2.7/site-packages/pkgcore/ebuild/processor.py", line 758, in _run_depend_like_phase
+            104
  File "/home/mgorny/pkgcore-venv/lib/python2.7/site-packages/pkgcore/ebuild/processor.py", line 758, in _run_depend_like_phase
 
- 95
    self.write("%s %i\n%s" % (command, len(data), data), append_newline=False)
+            105
    self.write("%s %i\n%s" % (command, len(data), data), append_newline=False)
 
- 96
  File "/home/mgorny/pkgcore-venv/lib/python2.7/site-packages/pkgcore/ebuild/processor.py", line 456, in write
+            106
  File "/home/mgorny/pkgcore-venv/lib/python2.7/site-packages/pkgcore/ebuild/processor.py", line 456, in write
 
- 97
    raise RuntimeError(ie)
+            107
    raise RuntimeError(ie)
 
- 98
RuntimeError: [Errno 32] Broken pipe
+            108
RuntimeError: [Errno 32] Broken pipe
 
- 99
 * Cache regen failed with 1
+            109
 * Cache regen failed with 1
 
-- cgit v1.2.3-65-gdbad