From 0316a2816585635569d7227883079a000bcd5b2f Mon Sep 17 00:00:00 2001 From: Repository QA checks Date: Sat, 23 Jan 2016 20:01:41 +0000 Subject: 2016-01-23T20:00:01 --- R_Overlay.html | 8 +++--- R_Overlay.txt | 8 +++--- alexcepoi.html | 28 +++++++++++++++------ alexcepoi.txt | 11 +++++++-- belak.html | 4 +-- belak.txt | 4 +-- betelgeuse.html | 4 +-- betelgeuse.txt | 4 +-- eatnumber1.html | 68 +++++++++++++++++++++++++-------------------------- eatnumber1.txt | 1 - embedded-cross.html | 68 +++++++++++++++++++++++++-------------------------- embedded-cross.txt | 1 - ephemeral.html | 18 +++++++------- ephemeral.txt | 18 +++++++------- fidonet.html | 2 +- fidonet.txt | 2 +- gbin.html | 6 ++--- gbin.txt | 6 ++--- gentoo-el.html | 10 ++++---- gentoo-el.txt | 10 ++++---- gentoo.html | 62 ++++++----------------------------------------- gentoo.txt | 26 +------------------- graveyard.html | 68 ++++++++++++++++++++++++++------------------------- graveyard.txt | 1 + hacking-gentoo.html | 8 +++--- hacking-gentoo.txt | 8 +++--- index.html | 2 +- jensp.html | 4 +-- jensp.txt | 4 +-- jkolo.html | 68 ++++++++++++++++++++++++++------------------------- jkolo.txt | 1 + jtriley.html | 68 +++++++++++++++++++++++++-------------------------- jtriley.txt | 1 - loongson.html | 10 ++++---- loongson.txt | 10 ++++---- lordvan.html | 2 +- lordvan.txt | 2 +- luke-jr.html | 68 +++++++++++++++++++++++++-------------------------- luke-jr.txt | 1 - n4g.html | 2 +- n4g.txt | 2 +- n8x0.html | 6 ++--- n8x0.txt | 6 ++--- n900.html | 68 ++++++++++++++++++++++++++------------------------- n900.txt | 1 + o11c.html | 2 +- o11c.txt | 2 +- quantumsummers.html | 4 +-- quantumsummers.txt | 4 +-- rainyday.html | 46 +++++++++++++++++------------------ rainyday.txt | 46 +++++++++++++++++------------------ raw.html | 4 +-- raw.txt | 4 +-- rebel.html | 2 +- rebel.txt | 2 +- robbat2.html | 68 ++++++++++++++++++++++++++------------------------- robbat2.txt | 1 + sigrok.html | 12 ++++----- sigrok.txt | 12 ++++----- stuge.html | 68 ++++++++++++++++++++++++++------------------------- stuge.txt | 1 + sunrise.html | 4 +-- sunrise.txt | 4 +-- swegener.html | 2 +- swegener.txt | 2 +- vdr-testing.html | 4 +-- vdr-testing.txt | 4 +-- wtk.html | 6 ++--- wtk.txt | 6 ++--- wuodan.html | 2 +- wuodan.txt | 2 +- xmw.html | 2 +- xmw.txt | 2 +- xwing.html | 70 ++++++++++++++++++++++++++++++++++++++++++++++------- xwing.txt | 30 +++++++++++++++++++++-- zugaina.html | 2 +- zugaina.txt | 2 +- 77 files changed, 616 insertions(+), 586 deletions(-) diff --git a/R_Overlay.html b/R_Overlay.html index 5be9d6821bcb..0b33de02be35 100644 --- a/R_Overlay.html +++ b/R_Overlay.html @@ -54,21 +54,21 @@ 22
Matched data: 0 bytes
 
- 23
File list size: 2.66M
+            23
File list size: 2.69M
 
24
File list generation time: 0.001 seconds
 
25
File list transfer time: 0.000 seconds
 
- 26
Total bytes sent: 13.64K
+            26
Total bytes sent: 14.15K
 
27
Total bytes received: 2.89M
 
28
 
- 29
sent 13.64K bytes  received 2.89M bytes  187.06K bytes/sec
+            29
sent 14.15K bytes  received 2.89M bytes  165.72K bytes/sec
 
- 30
total size is 71.55M  speedup is 24.68
+            30
total size is 71.55M  speedup is 24.67
 
31
*** syncing R_Overlay
 
diff --git a/R_Overlay.txt b/R_Overlay.txt index 0b604184408e..3baf16b234bd 100644 --- a/R_Overlay.txt +++ b/R_Overlay.txt @@ -20,14 +20,14 @@ Total file size: 71.55M bytes Total transferred file size: 0 bytes Literal data: 0 bytes Matched data: 0 bytes -File list size: 2.66M +File list size: 2.69M File list generation time: 0.001 seconds File list transfer time: 0.000 seconds -Total bytes sent: 13.64K +Total bytes sent: 14.15K Total bytes received: 2.89M -sent 13.64K bytes received 2.89M bytes 187.06K bytes/sec -total size is 71.55M speedup is 24.68 +sent 14.15K bytes received 2.89M bytes 165.72K bytes/sec +total size is 71.55M speedup is 24.67 *** syncing R_Overlay *** synced R_Overlay * Sync succeeded diff --git a/alexcepoi.html b/alexcepoi.html index 877447de5fb9..db2e1fb3043d 100644 --- a/alexcepoi.html +++ b/alexcepoi.html @@ -44,21 +44,35 @@
17
WARNING:pkgcore:repository at '/home/mgorny/sync/steveeJ' has unsupported profile format(s): 'profile-set'
 
- 18
Already up-to-date.
+            18
fatal: read error: Connection reset by peer
 
19
*** syncing alexcepoi
 
- 20
*** synced alexcepoi
+            20
*** failed syncing alexcepoi
 
- 21
 * Sync succeeded
+            21
 * Sync failed with 1
+
[FATAL] + 22
 * Will try to re-create
 
- 22
$ pmaint regen --use-local-desc --pkg-desc-index -t 1 alexcepoi
+            23
$ pmaint sync alexcepoi
 
- 23
WARNING:pkgcore:repository at '/home/mgorny/repos/steveeJ' has unsupported profile format(s): 'profile-set'
+            24
WARNING:pkgcore:repository at '/home/mgorny/sync/steveeJ' has unsupported profile format(s): 'profile-set'
 
- 24
WARNING:pkgcore:repository at '/home/mgorny/repos/steveeJ' has unsupported profile format(s): 'profile-set'
+            25
Cloning into '/home/mgorny/sync/alexcepoi'...
 
- 25
 * Cache regenerated successfully
+            26
*** syncing alexcepoi
+
+ 27
*** synced alexcepoi
+
+ 28
 * Sync succeeded after re-adding
+
+ 29
$ pmaint regen --use-local-desc --pkg-desc-index -t 1 alexcepoi
+
+ 30
WARNING:pkgcore:repository at '/home/mgorny/repos/steveeJ' has unsupported profile format(s): 'profile-set'
+
+ 31
WARNING:pkgcore:repository at '/home/mgorny/repos/steveeJ' has unsupported profile format(s): 'profile-set'
+
+ 32
 * Cache regenerated successfully
 
diff --git a/alexcepoi.txt b/alexcepoi.txt index 084ae9ac1853..1c6be888df53 100644 --- a/alexcepoi.txt +++ b/alexcepoi.txt @@ -15,10 +15,17 @@ 'status': 'unofficial'} $ pmaint sync alexcepoi WARNING:pkgcore:repository at '/home/mgorny/sync/steveeJ' has unsupported profile format(s): 'profile-set' -Already up-to-date. +fatal: read error: Connection reset by peer +*** syncing alexcepoi +*** failed syncing alexcepoi + * Sync failed with 1 + * Will try to re-create +$ pmaint sync alexcepoi +WARNING:pkgcore:repository at '/home/mgorny/sync/steveeJ' has unsupported profile format(s): 'profile-set' +Cloning into '/home/mgorny/sync/alexcepoi'... *** syncing alexcepoi *** synced alexcepoi - * Sync succeeded + * Sync succeeded after re-adding $ pmaint regen --use-local-desc --pkg-desc-index -t 1 alexcepoi WARNING:pkgcore:repository at '/home/mgorny/repos/steveeJ' has unsupported profile format(s): 'profile-set' WARNING:pkgcore:repository at '/home/mgorny/repos/steveeJ' has unsupported profile format(s): 'profile-set' diff --git a/belak.html b/belak.html index f9475572264c..9be3a687f36a 100644 --- a/belak.html +++ b/belak.html @@ -246,11 +246,11 @@
[FATAL] 118
ERROR pkgcore: returned val from gen_metadata was 'False'
 
- 119
caught exception '%s' while processing '%s'(MetadataException('Metadata Exception: pkg ebuild src: app-editors/scribes-0.4-r954, attr description\nerror: Metadata Exception: pkg ebuild src: app-editors/scribes-0.4-r954, attr data\nerror: False',), <<class 'pkgcore.ebuild.ebuild_src.package'> cpv='app-editors/scribes-0.4-r954' @0x7f23e1751410>)
+            119
caught exception '%s' while processing '%s'(MetadataException('Metadata Exception: pkg ebuild src: app-editors/scribes-0.4-r954, attr description\nerror: Metadata Exception: pkg ebuild src: app-editors/scribes-0.4-r954, attr data\nerror: False',), <<class 'pkgcore.ebuild.ebuild_src.package'> cpv='app-editors/scribes-0.4-r954' @0x7fcfa6f73410>)
 
[FATAL] 120
ERROR pkgcore: returned val from gen_metadata was 'False'
 
- 121
caught exception '%s' while processing '%s'(MetadataException('Metadata Exception: pkg ebuild src: app-editors/scribes-9999, attr description\nerror: Metadata Exception: pkg ebuild src: app-editors/scribes-9999, attr data\nerror: False',), <<class 'pkgcore.ebuild.ebuild_src.package'> cpv='app-editors/scribes-9999' @0x7f23e17512d0>)
+            121
caught exception '%s' while processing '%s'(MetadataException('Metadata Exception: pkg ebuild src: app-editors/scribes-9999, attr description\nerror: Metadata Exception: pkg ebuild src: app-editors/scribes-9999, attr data\nerror: False',), <<class 'pkgcore.ebuild.ebuild_src.package'> cpv='app-editors/scribes-9999' @0x7fcfa6f732d0>)
 
[FATAL] 122
 * Cache regen failed with 1
 
diff --git a/belak.txt b/belak.txt index cc74834ff27e..b49652deedfa 100644 --- a/belak.txt +++ b/belak.txt @@ -116,7 +116,7 @@ ERROR pkgcore: returned val from gen_metadata was 'False' ERROR pkgcore: returned val from gen_metadata was 'False' !!! caught exception False while processing ebuild src: app-editors/scribes-9999 ERROR pkgcore: returned val from gen_metadata was 'False' -caught exception '%s' while processing '%s'(MetadataException('Metadata Exception: pkg ebuild src: app-editors/scribes-0.4-r954, attr description\nerror: Metadata Exception: pkg ebuild src: app-editors/scribes-0.4-r954, attr data\nerror: False',), < cpv='app-editors/scribes-0.4-r954' @0x7f23e1751410>) +caught exception '%s' while processing '%s'(MetadataException('Metadata Exception: pkg ebuild src: app-editors/scribes-0.4-r954, attr description\nerror: Metadata Exception: pkg ebuild src: app-editors/scribes-0.4-r954, attr data\nerror: False',), < cpv='app-editors/scribes-0.4-r954' @0x7fcfa6f73410>) ERROR pkgcore: returned val from gen_metadata was 'False' -caught exception '%s' while processing '%s'(MetadataException('Metadata Exception: pkg ebuild src: app-editors/scribes-9999, attr description\nerror: Metadata Exception: pkg ebuild src: app-editors/scribes-9999, attr data\nerror: False',), < cpv='app-editors/scribes-9999' @0x7f23e17512d0>) +caught exception '%s' while processing '%s'(MetadataException('Metadata Exception: pkg ebuild src: app-editors/scribes-9999, attr description\nerror: Metadata Exception: pkg ebuild src: app-editors/scribes-9999, attr data\nerror: False',), < cpv='app-editors/scribes-9999' @0x7fcfa6f732d0>) * Cache regen failed with 1 diff --git a/betelgeuse.html b/betelgeuse.html index 7046a6937c5f..2148371ea9e9 100644 --- a/betelgeuse.html +++ b/betelgeuse.html @@ -248,11 +248,11 @@
[FATAL] 119
ERROR pkgcore: returned val from gen_metadata was 'False'
 
- 120
caught exception '%s' while processing '%s'(MetadataException('Metadata Exception: pkg ebuild src: x11-libs/pango-1.14.10, attr description\nerror: Metadata Exception: pkg ebuild src: x11-libs/pango-1.14.10, attr data\nerror: False',), <<class 'pkgcore.ebuild.ebuild_src.package'> cpv='x11-libs/pango-1.14.10' @0x7fae06704190>)
+            120
caught exception '%s' while processing '%s'(MetadataException('Metadata Exception: pkg ebuild src: x11-libs/pango-1.14.10, attr description\nerror: Metadata Exception: pkg ebuild src: x11-libs/pango-1.14.10, attr data\nerror: False',), <<class 'pkgcore.ebuild.ebuild_src.package'> cpv='x11-libs/pango-1.14.10' @0x7f32c401e190>)
 
[FATAL] 121
ERROR pkgcore: returned val from gen_metadata was 'False'
 
- 122
caught exception '%s' while processing '%s'(MetadataException('Metadata Exception: pkg ebuild src: x11-libs/pango-1.16.3, attr description\nerror: Metadata Exception: pkg ebuild src: x11-libs/pango-1.16.3, attr data\nerror: False',), <<class 'pkgcore.ebuild.ebuild_src.package'> cpv='x11-libs/pango-1.16.3' @0x7fae067042d0>)
+            122
caught exception '%s' while processing '%s'(MetadataException('Metadata Exception: pkg ebuild src: x11-libs/pango-1.16.3, attr description\nerror: Metadata Exception: pkg ebuild src: x11-libs/pango-1.16.3, attr data\nerror: False',), <<class 'pkgcore.ebuild.ebuild_src.package'> cpv='x11-libs/pango-1.16.3' @0x7f32c401e2d0>)
 
[FATAL] 123
 * Cache regen failed with 1
 
diff --git a/betelgeuse.txt b/betelgeuse.txt index 6d1c8495e454..b570e8e60741 100644 --- a/betelgeuse.txt +++ b/betelgeuse.txt @@ -117,7 +117,7 @@ ERROR pkgcore: returned val from gen_metadata was 'False' ERROR pkgcore: returned val from gen_metadata was 'False' !!! caught exception False while processing ebuild src: x11-libs/pango-1.16.3 ERROR pkgcore: returned val from gen_metadata was 'False' -caught exception '%s' while processing '%s'(MetadataException('Metadata Exception: pkg ebuild src: x11-libs/pango-1.14.10, attr description\nerror: Metadata Exception: pkg ebuild src: x11-libs/pango-1.14.10, attr data\nerror: False',), < cpv='x11-libs/pango-1.14.10' @0x7fae06704190>) +caught exception '%s' while processing '%s'(MetadataException('Metadata Exception: pkg ebuild src: x11-libs/pango-1.14.10, attr description\nerror: Metadata Exception: pkg ebuild src: x11-libs/pango-1.14.10, attr data\nerror: False',), < cpv='x11-libs/pango-1.14.10' @0x7f32c401e190>) ERROR pkgcore: returned val from gen_metadata was 'False' -caught exception '%s' while processing '%s'(MetadataException('Metadata Exception: pkg ebuild src: x11-libs/pango-1.16.3, attr description\nerror: Metadata Exception: pkg ebuild src: x11-libs/pango-1.16.3, attr data\nerror: False',), < cpv='x11-libs/pango-1.16.3' @0x7fae067042d0>) +caught exception '%s' while processing '%s'(MetadataException('Metadata Exception: pkg ebuild src: x11-libs/pango-1.16.3, attr description\nerror: Metadata Exception: pkg ebuild src: x11-libs/pango-1.16.3, attr data\nerror: False',), < cpv='x11-libs/pango-1.16.3' @0x7f32c401e2d0>) * Cache regen failed with 1 diff --git a/eatnumber1.html b/eatnumber1.html index 61d4680727b4..2ed46c409974 100644 --- a/eatnumber1.html +++ b/eatnumber1.html @@ -138,73 +138,71 @@
64
!!! caught exception False while processing ebuild src: x11-wm/wmname-0.1
 
[FATAL] - 65
!!! caught exception ("Expected command; instead got nothing from ''", None) while processing ebuild src: dev-java/commons-ssl-0.3.9
-
[FATAL] - 66
Traceback (most recent call last):
+            65
Traceback (most recent call last):
 
- 67
  File "/home/mgorny/pkgcore-venv/bin/pmaint", line 4, in <module>
+            66
  File "/home/mgorny/pkgcore-venv/bin/pmaint", line 4, in <module>
 
- 68
    scripts.main(basename(__file__))
+            67
    scripts.main(basename(__file__))
 
- 69
  File "/home/mgorny/pkgcore-venv/lib/python2.7/site-packages/pkgcore/scripts/__init__.py", line 40, in main
+            68
  File "/home/mgorny/pkgcore-venv/lib/python2.7/site-packages/pkgcore/scripts/__init__.py", line 40, in main
 
- 70
    commandline.main(argparser)
+            69
    commandline.main(argparser)
 
- 71
  File "/home/mgorny/pkgcore-venv/lib/python2.7/site-packages/pkgcore/util/commandline.py", line 969, in main
+            70
  File "/home/mgorny/pkgcore-venv/lib/python2.7/site-packages/pkgcore/util/commandline.py", line 969, in main
 
- 72
    exitstatus = main_func(options, out, err)
+            71
    exitstatus = main_func(options, out, err)
 
- 73
  File "/home/mgorny/pkgcore-venv/lib/python2.7/site-packages/pkgcore/scripts/pmaint.py", line 283, in regen_main
+            72
  File "/home/mgorny/pkgcore-venv/lib/python2.7/site-packages/pkgcore/scripts/pmaint.py", line 283, in regen_main
 
- 74
    eclass_caching=(not options.disable_eclass_caching))
+            73
    eclass_caching=(not options.disable_eclass_caching))
 
- 75
  File "/home/mgorny/pkgcore-venv/lib/python2.7/site-packages/pkgcore/operations/__init__.py", line 68, in _recast_exception_decorator
+            74
  File "/home/mgorny/pkgcore-venv/lib/python2.7/site-packages/pkgcore/operations/__init__.py", line 68, in _recast_exception_decorator
 
- 76
    return functor(*args, **kwds)
+            75
    return functor(*args, **kwds)
 
- 77
  File "/home/mgorny/pkgcore-venv/lib/python2.7/site-packages/pkgcore/operations/repo.py", line 247, in _cmd_api_regen_cache
+            76
  File "/home/mgorny/pkgcore-venv/lib/python2.7/site-packages/pkgcore/operations/repo.py", line 247, in _cmd_api_regen_cache
 
- 78
    self._get_observer(observer), threads=threads, **options)
+            77
    self._get_observer(observer), threads=threads, **options)
 
- 79
  File "/home/mgorny/pkgcore-venv/lib/python2.7/site-packages/pkgcore/operations/regen.py", line 37, in regen_repository
+            78
  File "/home/mgorny/pkgcore-venv/lib/python2.7/site-packages/pkgcore/operations/regen.py", line 37, in regen_repository
 
- 80
    regen_iter(iter(repo), _get_repo_helper(), observer)
+            79
    regen_iter(iter(repo), _get_repo_helper(), observer)
 
- 81
  File "/home/mgorny/pkgcore-venv/lib/python2.7/site-packages/pkgcore/operations/regen.py", line 15, in regen_iter
+            80
  File "/home/mgorny/pkgcore-venv/lib/python2.7/site-packages/pkgcore/operations/regen.py", line 15, in regen_iter
 
- 82
    regen_func(x)
+            81
    regen_func(x)
 
- 83
  File "/home/mgorny/pkgcore-venv/lib/python2.7/site-packages/pkgcore/ebuild/repository.py", line 521, in __call__
+            82
  File "/home/mgorny/pkgcore-venv/lib/python2.7/site-packages/pkgcore/ebuild/repository.py", line 521, in __call__
 
- 84
    return pkg._fetch_metadata(ebp=self.ebp, force_regen=self.force)
+            83
    return pkg._fetch_metadata(ebp=self.ebp, force_regen=self.force)
 
- 85
  File "/home/mgorny/pkgcore-venv/lib/python2.7/site-packages/pkgcore/ebuild/ebuild_src.py", line 277, in _fetch_metadata
+            84
  File "/home/mgorny/pkgcore-venv/lib/python2.7/site-packages/pkgcore/ebuild/ebuild_src.py", line 277, in _fetch_metadata
 
- 86
    return self._parent._get_metadata(self, ebp=ebp, force_regen=force_regen)
+            85
    return self._parent._get_metadata(self, ebp=ebp, force_regen=force_regen)
 
- 87
  File "/home/mgorny/pkgcore-venv/lib/python2.7/site-packages/pkgcore/ebuild/ebuild_src.py", line 367, in _get_metadata
+            86
  File "/home/mgorny/pkgcore-venv/lib/python2.7/site-packages/pkgcore/ebuild/ebuild_src.py", line 367, in _get_metadata
 
- 88
    return self._update_metadata(pkg, ebp=ebp)
+            87
    return self._update_metadata(pkg, ebp=ebp)
 
- 89
  File "/home/mgorny/pkgcore-venv/lib/python2.7/site-packages/pkgcore/ebuild/ebuild_src.py", line 375, in _update_metadata
+            88
  File "/home/mgorny/pkgcore-venv/lib/python2.7/site-packages/pkgcore/ebuild/ebuild_src.py", line 375, in _update_metadata
 
- 90
    mydata = my_proc.get_keys(pkg, self._ecache)
+            89
    mydata = my_proc.get_keys(pkg, self._ecache)
 
- 91
  File "/home/mgorny/pkgcore-venv/lib/python2.7/site-packages/pkgcore/ebuild/processor.py", line 788, in get_keys
+            90
  File "/home/mgorny/pkgcore-venv/lib/python2.7/site-packages/pkgcore/ebuild/processor.py", line 788, in get_keys
 
- 92
    {"key": receive_key})
+            91
    {"key": receive_key})
 
- 93
  File "/home/mgorny/pkgcore-venv/lib/python2.7/site-packages/pkgcore/ebuild/processor.py", line 721, in _run_depend_like_phase
+            92
  File "/home/mgorny/pkgcore-venv/lib/python2.7/site-packages/pkgcore/ebuild/processor.py", line 721, in _run_depend_like_phase
 
- 94
    self.write("%s %i\n%s" % (command, len(data), data), append_newline=False)
+            93
    self.write("%s %i\n%s" % (command, len(data), data), append_newline=False)
 
- 95
  File "/home/mgorny/pkgcore-venv/lib/python2.7/site-packages/pkgcore/ebuild/processor.py", line 419, in write
+            94
  File "/home/mgorny/pkgcore-venv/lib/python2.7/site-packages/pkgcore/ebuild/processor.py", line 419, in write
 
- 96
    raise RuntimeError(ie)
+            95
    raise RuntimeError(ie)
 
- 97
RuntimeError: [Errno 32] Broken pipe
+            96
RuntimeError: [Errno 32] Broken pipe
 
- 98
 * Cache regen failed with 1
+            97
 * Cache regen failed with 1
 
diff --git a/eatnumber1.txt b/eatnumber1.txt index 4c92387f6d1f..93bd4a6041eb 100644 --- a/eatnumber1.txt +++ b/eatnumber1.txt @@ -62,7 +62,6 @@ ERROR pkgcore: returned val from gen_metadata was 'False' !!! caught exception False while processing ebuild src: games-strategy/rftg-0.6.1 ERROR pkgcore: returned val from gen_metadata was 'False' !!! caught exception False while processing ebuild src: x11-wm/wmname-0.1 -!!! caught exception ("Expected command; instead got nothing from ''", None) while processing ebuild src: dev-java/commons-ssl-0.3.9 Traceback (most recent call last): File "/home/mgorny/pkgcore-venv/bin/pmaint", line 4, in scripts.main(basename(__file__)) diff --git a/embedded-cross.html b/embedded-cross.html index e9ee339d2aa9..73216853f806 100644 --- a/embedded-cross.html +++ b/embedded-cross.html @@ -182,73 +182,71 @@
86
!!! caught exception False while processing ebuild src: app-editors/vim-core-7.1.330
 
[FATAL] - 87
!!! caught exception ("Expected command; instead got nothing from ''", None) while processing ebuild src: app-editors/vim-core-7.2.303
-
[FATAL] - 88
Traceback (most recent call last):
+            87
Traceback (most recent call last):
 
- 89
  File "/home/mgorny/pkgcore-venv/bin/pmaint", line 4, in <module>
+            88
  File "/home/mgorny/pkgcore-venv/bin/pmaint", line 4, in <module>
 
- 90
    scripts.main(basename(__file__))
+            89
    scripts.main(basename(__file__))
 
- 91
  File "/home/mgorny/pkgcore-venv/lib/python2.7/site-packages/pkgcore/scripts/__init__.py", line 40, in main
+            90
  File "/home/mgorny/pkgcore-venv/lib/python2.7/site-packages/pkgcore/scripts/__init__.py", line 40, in main
 
- 92
    commandline.main(argparser)
+            91
    commandline.main(argparser)
 
- 93
  File "/home/mgorny/pkgcore-venv/lib/python2.7/site-packages/pkgcore/util/commandline.py", line 969, in main
+            92
  File "/home/mgorny/pkgcore-venv/lib/python2.7/site-packages/pkgcore/util/commandline.py", line 969, in main
 
- 94
    exitstatus = main_func(options, out, err)
+            93
    exitstatus = main_func(options, out, err)
 
- 95
  File "/home/mgorny/pkgcore-venv/lib/python2.7/site-packages/pkgcore/scripts/pmaint.py", line 283, in regen_main
+            94
  File "/home/mgorny/pkgcore-venv/lib/python2.7/site-packages/pkgcore/scripts/pmaint.py", line 283, in regen_main
 
- 96
    eclass_caching=(not options.disable_eclass_caching))
+            95
    eclass_caching=(not options.disable_eclass_caching))
 
- 97
  File "/home/mgorny/pkgcore-venv/lib/python2.7/site-packages/pkgcore/operations/__init__.py", line 68, in _recast_exception_decorator
+            96
  File "/home/mgorny/pkgcore-venv/lib/python2.7/site-packages/pkgcore/operations/__init__.py", line 68, in _recast_exception_decorator
 
- 98
    return functor(*args, **kwds)
+            97
    return functor(*args, **kwds)
 
- 99
  File "/home/mgorny/pkgcore-venv/lib/python2.7/site-packages/pkgcore/operations/repo.py", line 247, in _cmd_api_regen_cache
+            98
  File "/home/mgorny/pkgcore-venv/lib/python2.7/site-packages/pkgcore/operations/repo.py", line 247, in _cmd_api_regen_cache
 
- 100
    self._get_observer(observer), threads=threads, **options)
+            99
    self._get_observer(observer), threads=threads, **options)
 
- 101
  File "/home/mgorny/pkgcore-venv/lib/python2.7/site-packages/pkgcore/operations/regen.py", line 37, in regen_repository
+            100
  File "/home/mgorny/pkgcore-venv/lib/python2.7/site-packages/pkgcore/operations/regen.py", line 37, in regen_repository
 
- 102
    regen_iter(iter(repo), _get_repo_helper(), observer)
+            101
    regen_iter(iter(repo), _get_repo_helper(), observer)
 
- 103
  File "/home/mgorny/pkgcore-venv/lib/python2.7/site-packages/pkgcore/operations/regen.py", line 15, in regen_iter
+            102
  File "/home/mgorny/pkgcore-venv/lib/python2.7/site-packages/pkgcore/operations/regen.py", line 15, in regen_iter
 
- 104
    regen_func(x)
+            103
    regen_func(x)
 
- 105
  File "/home/mgorny/pkgcore-venv/lib/python2.7/site-packages/pkgcore/ebuild/repository.py", line 521, in __call__
+            104
  File "/home/mgorny/pkgcore-venv/lib/python2.7/site-packages/pkgcore/ebuild/repository.py", line 521, in __call__
 
- 106
    return pkg._fetch_metadata(ebp=self.ebp, force_regen=self.force)
+            105
    return pkg._fetch_metadata(ebp=self.ebp, force_regen=self.force)
 
- 107
  File "/home/mgorny/pkgcore-venv/lib/python2.7/site-packages/pkgcore/ebuild/ebuild_src.py", line 277, in _fetch_metadata
+            106
  File "/home/mgorny/pkgcore-venv/lib/python2.7/site-packages/pkgcore/ebuild/ebuild_src.py", line 277, in _fetch_metadata
 
- 108
    return self._parent._get_metadata(self, ebp=ebp, force_regen=force_regen)
+            107
    return self._parent._get_metadata(self, ebp=ebp, force_regen=force_regen)
 
- 109
  File "/home/mgorny/pkgcore-venv/lib/python2.7/site-packages/pkgcore/ebuild/ebuild_src.py", line 367, in _get_metadata
+            108
  File "/home/mgorny/pkgcore-venv/lib/python2.7/site-packages/pkgcore/ebuild/ebuild_src.py", line 367, in _get_metadata
 
- 110
    return self._update_metadata(pkg, ebp=ebp)
+            109
    return self._update_metadata(pkg, ebp=ebp)
 
- 111
  File "/home/mgorny/pkgcore-venv/lib/python2.7/site-packages/pkgcore/ebuild/ebuild_src.py", line 375, in _update_metadata
+            110
  File "/home/mgorny/pkgcore-venv/lib/python2.7/site-packages/pkgcore/ebuild/ebuild_src.py", line 375, in _update_metadata
 
- 112
    mydata = my_proc.get_keys(pkg, self._ecache)
+            111
    mydata = my_proc.get_keys(pkg, self._ecache)
 
- 113
  File "/home/mgorny/pkgcore-venv/lib/python2.7/site-packages/pkgcore/ebuild/processor.py", line 788, in get_keys
+            112
  File "/home/mgorny/pkgcore-venv/lib/python2.7/site-packages/pkgcore/ebuild/processor.py", line 788, in get_keys
 
- 114
    {"key": receive_key})
+            113
    {"key": receive_key})
 
- 115
  File "/home/mgorny/pkgcore-venv/lib/python2.7/site-packages/pkgcore/ebuild/processor.py", line 721, in _run_depend_like_phase
+            114
  File "/home/mgorny/pkgcore-venv/lib/python2.7/site-packages/pkgcore/ebuild/processor.py", line 721, in _run_depend_like_phase
 
- 116
    self.write("%s %i\n%s" % (command, len(data), data), append_newline=False)
+            115
    self.write("%s %i\n%s" % (command, len(data), data), append_newline=False)
 
- 117
  File "/home/mgorny/pkgcore-venv/lib/python2.7/site-packages/pkgcore/ebuild/processor.py", line 419, in write
+            116
  File "/home/mgorny/pkgcore-venv/lib/python2.7/site-packages/pkgcore/ebuild/processor.py", line 419, in write
 
- 118
    raise RuntimeError(ie)
+            117
    raise RuntimeError(ie)
 
- 119
RuntimeError: [Errno 32] Broken pipe
+            118
RuntimeError: [Errno 32] Broken pipe
 
- 120
 * Cache regen failed with 1
+            119
 * Cache regen failed with 1
 
diff --git a/embedded-cross.txt b/embedded-cross.txt index fe4acd0ec783..e7f8b1c6db2b 100644 --- a/embedded-cross.txt +++ b/embedded-cross.txt @@ -84,7 +84,6 @@ ERROR pkgcore: returned val from gen_metadata was 'False' !!! caught exception inherit requires an unknown eclass, vim cannot be found while processing ebuild src: app-editors/vim-core-7.1.123 ERROR pkgcore: returned val from gen_metadata was 'False' !!! caught exception False while processing ebuild src: app-editors/vim-core-7.1.330 -!!! caught exception ("Expected command; instead got nothing from ''", None) while processing ebuild src: app-editors/vim-core-7.2.303 Traceback (most recent call last): File "/home/mgorny/pkgcore-venv/bin/pmaint", line 4, in scripts.main(basename(__file__)) diff --git a/ephemeral.html b/ephemeral.html index 90e9a01f0c8e..12eb42273f6b 100644 --- a/ephemeral.html +++ b/ephemeral.html @@ -748,27 +748,27 @@
[FATAL] 369
ERROR pkgcore: returned val from gen_metadata was 'False'
 
- 370
caught exception '%s' while processing '%s'(MetadataException('Metadata Exception: pkg ebuild src: app-emulation/virt-v2v-0.8.9-r1, attr description\nerror: Metadata Exception: pkg ebuild src: app-emulation/virt-v2v-0.8.9-r1, attr data\nerror: False',), <<class 'pkgcore.ebuild.ebuild_src.package'> cpv='app-emulation/virt-v2v-0.8.9-r1' @0x7f30f3be9550>)
+            370
caught exception '%s' while processing '%s'(MetadataException('Metadata Exception: pkg ebuild src: app-emulation/virt-v2v-0.8.9-r1, attr description\nerror: Metadata Exception: pkg ebuild src: app-emulation/virt-v2v-0.8.9-r1, attr data\nerror: False',), <<class 'pkgcore.ebuild.ebuild_src.package'> cpv='app-emulation/virt-v2v-0.8.9-r1' @0x7f7af74d7550>)
 
[FATAL] 371
ERROR pkgcore: returned val from gen_metadata was 'False'
 
- 372
caught exception '%s' while processing '%s'(MetadataException('Metadata Exception: pkg ebuild src: app-emulation/virt-v2v-0.9.0, attr description\nerror: Metadata Exception: pkg ebuild src: app-emulation/virt-v2v-0.9.0, attr data\nerror: False',), <<class 'pkgcore.ebuild.ebuild_src.package'> cpv='app-emulation/virt-v2v-0.9.0' @0x7f30f3be9690>)
+            372
caught exception '%s' while processing '%s'(MetadataException('Metadata Exception: pkg ebuild src: app-emulation/virt-v2v-0.9.0, attr description\nerror: Metadata Exception: pkg ebuild src: app-emulation/virt-v2v-0.9.0, attr data\nerror: False',), <<class 'pkgcore.ebuild.ebuild_src.package'> cpv='app-emulation/virt-v2v-0.9.0' @0x7f7af74d7690>)
 
[FATAL] 373
ERROR pkgcore: returned val from gen_metadata was 'False'
 
- 374
caught exception '%s' while processing '%s'(MetadataException('Metadata Exception: pkg ebuild src: dev-perl/Archive-Extract-0.72, attr description\nerror: Metadata Exception: pkg ebuild src: dev-perl/Archive-Extract-0.72, attr data\nerror: False',), <<class 'pkgcore.ebuild.ebuild_src.package'> cpv='dev-perl/Archive-Extract-0.72' @0x7f30f3bf87d0>)
+            374
caught exception '%s' while processing '%s'(MetadataException('Metadata Exception: pkg ebuild src: dev-perl/Archive-Extract-0.72, attr description\nerror: Metadata Exception: pkg ebuild src: dev-perl/Archive-Extract-0.72, attr data\nerror: False',), <<class 'pkgcore.ebuild.ebuild_src.package'> cpv='dev-perl/Archive-Extract-0.72' @0x7f7af74e67d0>)
 
[FATAL] 375
ERROR pkgcore: returned val from gen_metadata was 'False'
 
- 376
caught exception '%s' while processing '%s'(MetadataException('Metadata Exception: pkg ebuild src: dev-perl/DateTime-Format-Epoch-0.13, attr description\nerror: Metadata Exception: pkg ebuild src: dev-perl/DateTime-Format-Epoch-0.13, attr data\nerror: False',), <<class 'pkgcore.ebuild.ebuild_src.package'> cpv='dev-perl/DateTime-Format-Epoch-0.13' @0x7f30f3be9690>)
+            376
caught exception '%s' while processing '%s'(MetadataException('Metadata Exception: pkg ebuild src: dev-perl/DateTime-Format-Epoch-0.13, attr description\nerror: Metadata Exception: pkg ebuild src: dev-perl/DateTime-Format-Epoch-0.13, attr data\nerror: False',), <<class 'pkgcore.ebuild.ebuild_src.package'> cpv='dev-perl/DateTime-Format-Epoch-0.13' @0x7f7af74d7690>)
 
[FATAL] 377
ERROR pkgcore: returned val from gen_metadata was 'False'
 
- 378
caught exception '%s' while processing '%s'(MetadataException('Metadata Exception: pkg ebuild src: dev-perl/Proc-ParallelLoop-0.5, attr description\nerror: Metadata Exception: pkg ebuild src: dev-perl/Proc-ParallelLoop-0.5, attr data\nerror: False',), <<class 'pkgcore.ebuild.ebuild_src.package'> cpv='dev-perl/Proc-ParallelLoop-0.5' @0x7f30f3bf87d0>)
+            378
caught exception '%s' while processing '%s'(MetadataException('Metadata Exception: pkg ebuild src: dev-perl/Proc-ParallelLoop-0.5, attr description\nerror: Metadata Exception: pkg ebuild src: dev-perl/Proc-ParallelLoop-0.5, attr data\nerror: False',), <<class 'pkgcore.ebuild.ebuild_src.package'> cpv='dev-perl/Proc-ParallelLoop-0.5' @0x7f7af74e67d0>)
 
[FATAL] 379
ERROR pkgcore: returned val from gen_metadata was 'False'
 
- 380
caught exception '%s' while processing '%s'(MetadataException('Metadata Exception: pkg ebuild src: dev-perl/Term-Prompt-1.04, attr description\nerror: Metadata Exception: pkg ebuild src: dev-perl/Term-Prompt-1.04, attr data\nerror: False',), <<class 'pkgcore.ebuild.ebuild_src.package'> cpv='dev-perl/Term-Prompt-1.04' @0x7f30f3be9690>)
+            380
caught exception '%s' while processing '%s'(MetadataException('Metadata Exception: pkg ebuild src: dev-perl/Term-Prompt-1.04, attr description\nerror: Metadata Exception: pkg ebuild src: dev-perl/Term-Prompt-1.04, attr data\nerror: False',), <<class 'pkgcore.ebuild.ebuild_src.package'> cpv='dev-perl/Term-Prompt-1.04' @0x7f7af74d7690>)
 
[FATAL] 381
ERROR pkgcore: returned val from gen_metadata was 'False'
 
@@ -864,15 +864,15 @@
427
 
- 428
rc.package'> cpv='media-sound/phonoripper-0.10.1-r3' @0x7f30f3c03190>)
+            428
rc.package'> cpv='media-sound/phonoripper-0.10.1-r3' @0x7f7af74f1190>)
 
429
ERROR pkgcore: returned val from gen_metadata was 'False'
 
- 430
caught exception '%s' while processing '%s'(MetadataException('Metadata Exception: pkg ebuild src: dev-libs/libconcord-0.23, attr description\nerror: Metadata Exception: pkg ebuild src: dev-libs/libconcord-0.23, attr data\nerror: False',), <<class 'pkgcore.ebuild.ebuild_src.package'> cpv='dev-libs/libconcord-0.23' @0x7f30f3c03410>)
+            430
caught exception '%s' while processing '%s'(MetadataException('Metadata Exception: pkg ebuild src: dev-libs/libconcord-0.23, attr description\nerror: Metadata Exception: pkg ebuild src: dev-libs/libconcord-0.23, attr data\nerror: False',), <<class 'pkgcore.ebuild.ebuild_src.package'> cpv='dev-libs/libconcord-0.23' @0x7f7af74f1410>)
 
[FATAL] 431
ERROR pkgcore: returned val from gen_metadata was 'False'
 
- 432
caught exception '%s' while processing '%s'(MetadataException('Metadata Exception: pkg ebuild src: dev-libs/libconcord-0.24, attr description\nerror: Metadata Exception: pkg ebuild src: dev-libs/libconcord-0.24, attr data\nerror: False',), <<class 'pkgcore.ebuild.ebuild_src.package'> cpv='dev-libs/libconcord-0.24' @0x7f30f3c03190>)
+            432
caught exception '%s' while processing '%s'(MetadataException('Metadata Exception: pkg ebuild src: dev-libs/libconcord-0.24, attr description\nerror: Metadata Exception: pkg ebuild src: dev-libs/libconcord-0.24, attr data\nerror: False',), <<class 'pkgcore.ebuild.ebuild_src.package'> cpv='dev-libs/libconcord-0.24' @0x7f7af74f1190>)
 
[FATAL] 433
 * Cache regen failed with 1
 
diff --git a/ephemeral.txt b/ephemeral.txt index e04b78d0777f..c8ca9e06fa8d 100644 --- a/ephemeral.txt +++ b/ephemeral.txt @@ -367,17 +367,17 @@ ERROR pkgcore: returned val from gen_metadata was 'False' ERROR pkgcore: returned val from gen_metadata was 'False' !!! caught exception False while processing ebuild src: dev-libs/libconcord-0.24 ERROR pkgcore: returned val from gen_metadata was 'False' -caught exception '%s' while processing '%s'(MetadataException('Metadata Exception: pkg ebuild src: app-emulation/virt-v2v-0.8.9-r1, attr description\nerror: Metadata Exception: pkg ebuild src: app-emulation/virt-v2v-0.8.9-r1, attr data\nerror: False',), < cpv='app-emulation/virt-v2v-0.8.9-r1' @0x7f30f3be9550>) +caught exception '%s' while processing '%s'(MetadataException('Metadata Exception: pkg ebuild src: app-emulation/virt-v2v-0.8.9-r1, attr description\nerror: Metadata Exception: pkg ebuild src: app-emulation/virt-v2v-0.8.9-r1, attr data\nerror: False',), < cpv='app-emulation/virt-v2v-0.8.9-r1' @0x7f7af74d7550>) ERROR pkgcore: returned val from gen_metadata was 'False' -caught exception '%s' while processing '%s'(MetadataException('Metadata Exception: pkg ebuild src: app-emulation/virt-v2v-0.9.0, attr description\nerror: Metadata Exception: pkg ebuild src: app-emulation/virt-v2v-0.9.0, attr data\nerror: False',), < cpv='app-emulation/virt-v2v-0.9.0' @0x7f30f3be9690>) +caught exception '%s' while processing '%s'(MetadataException('Metadata Exception: pkg ebuild src: app-emulation/virt-v2v-0.9.0, attr description\nerror: Metadata Exception: pkg ebuild src: app-emulation/virt-v2v-0.9.0, attr data\nerror: False',), < cpv='app-emulation/virt-v2v-0.9.0' @0x7f7af74d7690>) ERROR pkgcore: returned val from gen_metadata was 'False' -caught exception '%s' while processing '%s'(MetadataException('Metadata Exception: pkg ebuild src: dev-perl/Archive-Extract-0.72, attr description\nerror: Metadata Exception: pkg ebuild src: dev-perl/Archive-Extract-0.72, attr data\nerror: False',), < cpv='dev-perl/Archive-Extract-0.72' @0x7f30f3bf87d0>) +caught exception '%s' while processing '%s'(MetadataException('Metadata Exception: pkg ebuild src: dev-perl/Archive-Extract-0.72, attr description\nerror: Metadata Exception: pkg ebuild src: dev-perl/Archive-Extract-0.72, attr data\nerror: False',), < cpv='dev-perl/Archive-Extract-0.72' @0x7f7af74e67d0>) ERROR pkgcore: returned val from gen_metadata was 'False' -caught exception '%s' while processing '%s'(MetadataException('Metadata Exception: pkg ebuild src: dev-perl/DateTime-Format-Epoch-0.13, attr description\nerror: Metadata Exception: pkg ebuild src: dev-perl/DateTime-Format-Epoch-0.13, attr data\nerror: False',), < cpv='dev-perl/DateTime-Format-Epoch-0.13' @0x7f30f3be9690>) +caught exception '%s' while processing '%s'(MetadataException('Metadata Exception: pkg ebuild src: dev-perl/DateTime-Format-Epoch-0.13, attr description\nerror: Metadata Exception: pkg ebuild src: dev-perl/DateTime-Format-Epoch-0.13, attr data\nerror: False',), < cpv='dev-perl/DateTime-Format-Epoch-0.13' @0x7f7af74d7690>) ERROR pkgcore: returned val from gen_metadata was 'False' -caught exception '%s' while processing '%s'(MetadataException('Metadata Exception: pkg ebuild src: dev-perl/Proc-ParallelLoop-0.5, attr description\nerror: Metadata Exception: pkg ebuild src: dev-perl/Proc-ParallelLoop-0.5, attr data\nerror: False',), < cpv='dev-perl/Proc-ParallelLoop-0.5' @0x7f30f3bf87d0>) +caught exception '%s' while processing '%s'(MetadataException('Metadata Exception: pkg ebuild src: dev-perl/Proc-ParallelLoop-0.5, attr description\nerror: Metadata Exception: pkg ebuild src: dev-perl/Proc-ParallelLoop-0.5, attr data\nerror: False',), < cpv='dev-perl/Proc-ParallelLoop-0.5' @0x7f7af74e67d0>) ERROR pkgcore: returned val from gen_metadata was 'False' -caught exception '%s' while processing '%s'(MetadataException('Metadata Exception: pkg ebuild src: dev-perl/Term-Prompt-1.04, attr description\nerror: Metadata Exception: pkg ebuild src: dev-perl/Term-Prompt-1.04, attr data\nerror: False',), < cpv='dev-perl/Term-Prompt-1.04' @0x7f30f3be9690>) +caught exception '%s' while processing '%s'(MetadataException('Metadata Exception: pkg ebuild src: dev-perl/Term-Prompt-1.04, attr description\nerror: Metadata Exception: pkg ebuild src: dev-perl/Term-Prompt-1.04, attr data\nerror: False',), < cpv='dev-perl/Term-Prompt-1.04' @0x7f7af74d7690>) ERROR pkgcore: returned val from gen_metadata was 'False' caught exception '%s' while processing '%s'(MetadataException('Metadata Exception: pkg ebuild src: media-sound/phonoripper-0.10.1-r3, attr description\nerror: Metadata Exception: pkg ebuild src: media-sound/phonoripper-0.10.1-r3, attr data\nerror: False',), < cpv='media-sound/phonoripper-0.10.1-r3' @0x7f30f3c03190>) +rc.package'> cpv='media-sound/phonoripper-0.10.1-r3' @0x7f7af74f1190>) ERROR pkgcore: returned val from gen_metadata was 'False' -caught exception '%s' while processing '%s'(MetadataException('Metadata Exception: pkg ebuild src: dev-libs/libconcord-0.23, attr description\nerror: Metadata Exception: pkg ebuild src: dev-libs/libconcord-0.23, attr data\nerror: False',), < cpv='dev-libs/libconcord-0.23' @0x7f30f3c03410>) +caught exception '%s' while processing '%s'(MetadataException('Metadata Exception: pkg ebuild src: dev-libs/libconcord-0.23, attr description\nerror: Metadata Exception: pkg ebuild src: dev-libs/libconcord-0.23, attr data\nerror: False',), < cpv='dev-libs/libconcord-0.23' @0x7f7af74f1410>) ERROR pkgcore: returned val from gen_metadata was 'False' -caught exception '%s' while processing '%s'(MetadataException('Metadata Exception: pkg ebuild src: dev-libs/libconcord-0.24, attr description\nerror: Metadata Exception: pkg ebuild src: dev-libs/libconcord-0.24, attr data\nerror: False',), < cpv='dev-libs/libconcord-0.24' @0x7f30f3c03190>) +caught exception '%s' while processing '%s'(MetadataException('Metadata Exception: pkg ebuild src: dev-libs/libconcord-0.24, attr description\nerror: Metadata Exception: pkg ebuild src: dev-libs/libconcord-0.24, attr data\nerror: False',), < cpv='dev-libs/libconcord-0.24' @0x7f7af74f1190>) * Cache regen failed with 1 diff --git a/fidonet.html b/fidonet.html index 9c9ea9712e3b..1206bec5e7d9 100644 --- a/fidonet.html +++ b/fidonet.html @@ -68,7 +68,7 @@
29
 
- 30
sent 97 bytes  received 2.87K bytes  1.98K bytes/sec
+            30
sent 97 bytes  received 2.87K bytes  1.19K bytes/sec
 
31
total size is 116.61K  speedup is 39.34
 
diff --git a/fidonet.txt b/fidonet.txt index b670306ae870..4a53dc14fd45 100644 --- a/fidonet.txt +++ b/fidonet.txt @@ -27,7 +27,7 @@ File list transfer time: 0.000 seconds Total bytes sent: 97 Total bytes received: 2.87K -sent 97 bytes received 2.87K bytes 1.98K bytes/sec +sent 97 bytes received 2.87K bytes 1.19K bytes/sec total size is 116.61K speedup is 39.34 *** syncing fidonet *** synced fidonet diff --git a/gbin.html b/gbin.html index 5db6deabf697..438083418ccf 100644 --- a/gbin.html +++ b/gbin.html @@ -234,13 +234,13 @@
[FATAL] 112
ERROR pkgcore: returned val from gen_metadata was 'False'
 
- 113
caught exception '%s' while processing '%s'(MetadataException('Metadata Exception: pkg ebuild src: media-tv/xmltv-0.5.61, attr description\nerror: Metadata Exception: pkg ebuild src: media-tv/xmltv-0.5.61, attr data\nerror: False',), <<class 'pkgcore.ebuild.ebuild_src.package'> cpv='media-tv/xmltv-0.5.61' @0x7f5678d29a50>)
+            113
caught exception '%s' while processing '%s'(MetadataException('Metadata Exception: pkg ebuild src: media-tv/xmltv-0.5.61, attr description\nerror: Metadata Exception: pkg ebuild src: media-tv/xmltv-0.5.61, attr data\nerror: False',), <<class 'pkgcore.ebuild.ebuild_src.package'> cpv='media-tv/xmltv-0.5.61' @0x7fe7ebf95a50>)
 
[FATAL] - 114
caught exception '%s' while processing '%s'(MetadataException("Metadata Exception: pkg ebuild src: app-crypt/whitepixel-2, attr description\nerror: Metadata Exception: pkg ebuild src: app-crypt/whitepixel-2, attr data\nerror: Metadata Exception: pkg ebuild src: app-crypt/whitepixel-2, attr eapi\nerror: parsed eapi '0' doesn't match sourced eapi '3'",), <<class 'pkgcore.ebuild.ebuild_src.package'> cpv='app-crypt/whitepixel-2' @0x7f567887f7d0>)
+            114
caught exception '%s' while processing '%s'(MetadataException("Metadata Exception: pkg ebuild src: app-crypt/whitepixel-2, attr description\nerror: Metadata Exception: pkg ebuild src: app-crypt/whitepixel-2, attr data\nerror: Metadata Exception: pkg ebuild src: app-crypt/whitepixel-2, attr eapi\nerror: parsed eapi '0' doesn't match sourced eapi '3'",), <<class 'pkgcore.ebuild.ebuild_src.package'> cpv='app-crypt/whitepixel-2' @0x7fe7ebaeb7d0>)
 
[FATAL] 115
ERROR pkgcore: returned val from gen_metadata was 'False'
 
- 116
caught exception '%s' while processing '%s'(MetadataException('Metadata Exception: pkg ebuild src: games-board/gogui-1.4.6, attr description\nerror: Metadata Exception: pkg ebuild src: games-board/gogui-1.4.6, attr data\nerror: False',), <<class 'pkgcore.ebuild.ebuild_src.package'> cpv='games-board/gogui-1.4.6' @0x7f567887f910>)
+            116
caught exception '%s' while processing '%s'(MetadataException('Metadata Exception: pkg ebuild src: games-board/gogui-1.4.6, attr description\nerror: Metadata Exception: pkg ebuild src: games-board/gogui-1.4.6, attr data\nerror: False',), <<class 'pkgcore.ebuild.ebuild_src.package'> cpv='games-board/gogui-1.4.6' @0x7fe7ebaeb910>)
 
[FATAL] 117
 * Cache regen failed with 1
 
diff --git a/gbin.txt b/gbin.txt index 9645eb14571c..7c4658802ad3 100644 --- a/gbin.txt +++ b/gbin.txt @@ -110,8 +110,8 @@ error: parsed eapi '0' doesn't match sourced eapi '3' while processing ebuild sr ERROR pkgcore: returned val from gen_metadata was 'False' !!! caught exception False while processing ebuild src: games-board/gogui-1.4.6 ERROR pkgcore: returned val from gen_metadata was 'False' -caught exception '%s' while processing '%s'(MetadataException('Metadata Exception: pkg ebuild src: media-tv/xmltv-0.5.61, attr description\nerror: Metadata Exception: pkg ebuild src: media-tv/xmltv-0.5.61, attr data\nerror: False',), < cpv='media-tv/xmltv-0.5.61' @0x7f5678d29a50>) -caught exception '%s' while processing '%s'(MetadataException("Metadata Exception: pkg ebuild src: app-crypt/whitepixel-2, attr description\nerror: Metadata Exception: pkg ebuild src: app-crypt/whitepixel-2, attr data\nerror: Metadata Exception: pkg ebuild src: app-crypt/whitepixel-2, attr eapi\nerror: parsed eapi '0' doesn't match sourced eapi '3'",), < cpv='app-crypt/whitepixel-2' @0x7f567887f7d0>) +caught exception '%s' while processing '%s'(MetadataException('Metadata Exception: pkg ebuild src: media-tv/xmltv-0.5.61, attr description\nerror: Metadata Exception: pkg ebuild src: media-tv/xmltv-0.5.61, attr data\nerror: False',), < cpv='media-tv/xmltv-0.5.61' @0x7fe7ebf95a50>) +caught exception '%s' while processing '%s'(MetadataException("Metadata Exception: pkg ebuild src: app-crypt/whitepixel-2, attr description\nerror: Metadata Exception: pkg ebuild src: app-crypt/whitepixel-2, attr data\nerror: Metadata Exception: pkg ebuild src: app-crypt/whitepixel-2, attr eapi\nerror: parsed eapi '0' doesn't match sourced eapi '3'",), < cpv='app-crypt/whitepixel-2' @0x7fe7ebaeb7d0>) ERROR pkgcore: returned val from gen_metadata was 'False' -caught exception '%s' while processing '%s'(MetadataException('Metadata Exception: pkg ebuild src: games-board/gogui-1.4.6, attr description\nerror: Metadata Exception: pkg ebuild src: games-board/gogui-1.4.6, attr data\nerror: False',), < cpv='games-board/gogui-1.4.6' @0x7f567887f910>) +caught exception '%s' while processing '%s'(MetadataException('Metadata Exception: pkg ebuild src: games-board/gogui-1.4.6, attr description\nerror: Metadata Exception: pkg ebuild src: games-board/gogui-1.4.6, attr data\nerror: False',), < cpv='games-board/gogui-1.4.6' @0x7fe7ebaeb910>) * Cache regen failed with 1 diff --git a/gentoo-el.html b/gentoo-el.html index 5e8e61ff986c..d6b384586b52 100644 --- a/gentoo-el.html +++ b/gentoo-el.html @@ -530,23 +530,23 @@
[FATAL] 260
ERROR pkgcore: returned val from gen_metadata was 'False'
 
- 261
caught exception '%s' while processing '%s'(MetadataException('Metadata Exception: pkg ebuild src: kde-misc/kdiff3-0.9.96, attr description\nerror: Metadata Exception: pkg ebuild src: kde-misc/kdiff3-0.9.96, attr data\nerror: False',), <<class 'pkgcore.ebuild.ebuild_src.package'> cpv='kde-misc/kdiff3-0.9.96' @0x7fc30ed447d0>)
+            261
caught exception '%s' while processing '%s'(MetadataException('Metadata Exception: pkg ebuild src: kde-misc/kdiff3-0.9.96, attr description\nerror: Metadata Exception: pkg ebuild src: kde-misc/kdiff3-0.9.96, attr data\nerror: False',), <<class 'pkgcore.ebuild.ebuild_src.package'> cpv='kde-misc/kdiff3-0.9.96' @0x7f1b9caca7d0>)
 
[FATAL] 262
ERROR pkgcore: returned val from gen_metadata was 'False'
 
- 263
caught exception '%s' while processing '%s'(MetadataException('Metadata Exception: pkg ebuild src: kde-misc/kdiff3-0.9.97, attr description\nerror: Metadata Exception: pkg ebuild src: kde-misc/kdiff3-0.9.97, attr data\nerror: False',), <<class 'pkgcore.ebuild.ebuild_src.package'> cpv='kde-misc/kdiff3-0.9.97' @0x7fc30ed44a50>)
+            263
caught exception '%s' while processing '%s'(MetadataException('Metadata Exception: pkg ebuild src: kde-misc/kdiff3-0.9.97, attr description\nerror: Metadata Exception: pkg ebuild src: kde-misc/kdiff3-0.9.97, attr data\nerror: False',), <<class 'pkgcore.ebuild.ebuild_src.package'> cpv='kde-misc/kdiff3-0.9.97' @0x7f1b9cacaa50>)
 
[FATAL] 264
ERROR pkgcore: returned val from gen_metadata was 'False'
 
- 265
caught exception '%s' while processing '%s'(MetadataException('Metadata Exception: pkg ebuild src: kde-misc/plasma-workflow-0.1.98, attr description\nerror: Metadata Exception: pkg ebuild src: kde-misc/plasma-workflow-0.1.98, attr data\nerror: False',), <<class 'pkgcore.ebuild.ebuild_src.package'> cpv='kde-misc/plasma-workflow-0.1.98' @0x7fc30ed447d0>)
+            265
caught exception '%s' while processing '%s'(MetadataException('Metadata Exception: pkg ebuild src: kde-misc/plasma-workflow-0.1.98, attr description\nerror: Metadata Exception: pkg ebuild src: kde-misc/plasma-workflow-0.1.98, attr data\nerror: False',), <<class 'pkgcore.ebuild.ebuild_src.package'> cpv='kde-misc/plasma-workflow-0.1.98' @0x7f1b9caca7d0>)
 
[FATAL] 266
ERROR pkgcore: returned val from gen_metadata was 'False'
 
- 267
caught exception '%s' while processing '%s'(MetadataException('Metadata Exception: pkg ebuild src: kde-misc/semantik-0.8.2, attr description\nerror: Metadata Exception: pkg ebuild src: kde-misc/semantik-0.8.2, attr data\nerror: False',), <<class 'pkgcore.ebuild.ebuild_src.package'> cpv='kde-misc/semantik-0.8.2' @0x7fc30ed44a50>)
+            267
caught exception '%s' while processing '%s'(MetadataException('Metadata Exception: pkg ebuild src: kde-misc/semantik-0.8.2, attr description\nerror: Metadata Exception: pkg ebuild src: kde-misc/semantik-0.8.2, attr data\nerror: False',), <<class 'pkgcore.ebuild.ebuild_src.package'> cpv='kde-misc/semantik-0.8.2' @0x7f1b9cacaa50>)
 
[FATAL] 268
ERROR pkgcore: returned val from gen_metadata was 'False'
 
- 269
caught exception '%s' while processing '%s'(MetadataException('Metadata Exception: pkg ebuild src: gnome-extra/gnome-globalmenu-9999, attr description\nerror: Metadata Exception: pkg ebuild src: gnome-extra/gnome-globalmenu-9999, attr data\nerror: False',), <<class 'pkgcore.ebuild.ebuild_src.package'> cpv='gnome-extra/gnome-globalmenu-9999' @0x7fc30e89b690>)
+            269
caught exception '%s' while processing '%s'(MetadataException('Metadata Exception: pkg ebuild src: gnome-extra/gnome-globalmenu-9999, attr description\nerror: Metadata Exception: pkg ebuild src: gnome-extra/gnome-globalmenu-9999, attr data\nerror: False',), <<class 'pkgcore.ebuild.ebuild_src.package'> cpv='gnome-extra/gnome-globalmenu-9999' @0x7f1b9c621690>)
 
[FATAL] 270
 * Cache regen failed with 1
 
diff --git a/gentoo-el.txt b/gentoo-el.txt index 0f85d4a9d80f..e94bf4c25461 100644 --- a/gentoo-el.txt +++ b/gentoo-el.txt @@ -258,13 +258,13 @@ ERROR pkgcore: returned val from gen_metadata was 'False' ERROR pkgcore: returned val from gen_metadata was 'False' !!! caught exception False while processing ebuild src: gnome-extra/gnome-globalmenu-9999 ERROR pkgcore: returned val from gen_metadata was 'False' -caught exception '%s' while processing '%s'(MetadataException('Metadata Exception: pkg ebuild src: kde-misc/kdiff3-0.9.96, attr description\nerror: Metadata Exception: pkg ebuild src: kde-misc/kdiff3-0.9.96, attr data\nerror: False',), < cpv='kde-misc/kdiff3-0.9.96' @0x7fc30ed447d0>) +caught exception '%s' while processing '%s'(MetadataException('Metadata Exception: pkg ebuild src: kde-misc/kdiff3-0.9.96, attr description\nerror: Metadata Exception: pkg ebuild src: kde-misc/kdiff3-0.9.96, attr data\nerror: False',), < cpv='kde-misc/kdiff3-0.9.96' @0x7f1b9caca7d0>) ERROR pkgcore: returned val from gen_metadata was 'False' -caught exception '%s' while processing '%s'(MetadataException('Metadata Exception: pkg ebuild src: kde-misc/kdiff3-0.9.97, attr description\nerror: Metadata Exception: pkg ebuild src: kde-misc/kdiff3-0.9.97, attr data\nerror: False',), < cpv='kde-misc/kdiff3-0.9.97' @0x7fc30ed44a50>) +caught exception '%s' while processing '%s'(MetadataException('Metadata Exception: pkg ebuild src: kde-misc/kdiff3-0.9.97, attr description\nerror: Metadata Exception: pkg ebuild src: kde-misc/kdiff3-0.9.97, attr data\nerror: False',), < cpv='kde-misc/kdiff3-0.9.97' @0x7f1b9cacaa50>) ERROR pkgcore: returned val from gen_metadata was 'False' -caught exception '%s' while processing '%s'(MetadataException('Metadata Exception: pkg ebuild src: kde-misc/plasma-workflow-0.1.98, attr description\nerror: Metadata Exception: pkg ebuild src: kde-misc/plasma-workflow-0.1.98, attr data\nerror: False',), < cpv='kde-misc/plasma-workflow-0.1.98' @0x7fc30ed447d0>) +caught exception '%s' while processing '%s'(MetadataException('Metadata Exception: pkg ebuild src: kde-misc/plasma-workflow-0.1.98, attr description\nerror: Metadata Exception: pkg ebuild src: kde-misc/plasma-workflow-0.1.98, attr data\nerror: False',), < cpv='kde-misc/plasma-workflow-0.1.98' @0x7f1b9caca7d0>) ERROR pkgcore: returned val from gen_metadata was 'False' -caught exception '%s' while processing '%s'(MetadataException('Metadata Exception: pkg ebuild src: kde-misc/semantik-0.8.2, attr description\nerror: Metadata Exception: pkg ebuild src: kde-misc/semantik-0.8.2, attr data\nerror: False',), < cpv='kde-misc/semantik-0.8.2' @0x7fc30ed44a50>) +caught exception '%s' while processing '%s'(MetadataException('Metadata Exception: pkg ebuild src: kde-misc/semantik-0.8.2, attr description\nerror: Metadata Exception: pkg ebuild src: kde-misc/semantik-0.8.2, attr data\nerror: False',), < cpv='kde-misc/semantik-0.8.2' @0x7f1b9cacaa50>) ERROR pkgcore: returned val from gen_metadata was 'False' -caught exception '%s' while processing '%s'(MetadataException('Metadata Exception: pkg ebuild src: gnome-extra/gnome-globalmenu-9999, attr description\nerror: Metadata Exception: pkg ebuild src: gnome-extra/gnome-globalmenu-9999, attr data\nerror: False',), < cpv='gnome-extra/gnome-globalmenu-9999' @0x7fc30e89b690>) +caught exception '%s' while processing '%s'(MetadataException('Metadata Exception: pkg ebuild src: gnome-extra/gnome-globalmenu-9999, attr description\nerror: Metadata Exception: pkg ebuild src: gnome-extra/gnome-globalmenu-9999, attr data\nerror: False',), < cpv='gnome-extra/gnome-globalmenu-9999' @0x7f1b9c621690>) * Cache regen failed with 1 diff --git a/gentoo.html b/gentoo.html index e09e5687e57a..b23fda35a27d 100644 --- a/gentoo.html +++ b/gentoo.html @@ -44,67 +44,19 @@
17
WARNING:pkgcore:repository at '/home/mgorny/sync/steveeJ' has unsupported profile format(s): 'profile-set'
 
- 18
From https://anongit.gentoo.org/git/repo/gentoo
+            18
Already up-to-date.
 
- 19
   00fd731..615f52d  master     -> origin/master
+            19
*** syncing gentoo
 
- 20
Updating 00fd731..615f52d
+            20
*** synced gentoo
 
- 21
Fast-forward
+            21
 * Sync succeeded
 
- 22
 app-crypt/gkeys-gen/Manifest                       |  2 +-
+            22
$ pmaint regen --use-local-desc --pkg-desc-index -t 1 gentoo
 
- 23
 ...keys-gen-0.1-r1.ebuild => gkeys-gen-0.2.ebuild} |  4 +-
+            23
WARNING:pkgcore:repository at '/home/mgorny/repos/steveeJ' has unsupported profile format(s): 'profile-set'
 
- 24
 app-crypt/gkeys/Manifest                           |  2 +-
-
- 25
 .../{gkeys-0.1-r1.ebuild => gkeys-0.2.ebuild}      | 10 ++---
-
- 26
 dev-php/pecl-redis/Manifest                        |  2 -
-
- 27
 dev-php/pecl-redis/metadata.xml                    |  7 +---
-
- 28
 dev-php/pecl-redis/pecl-redis-2.2.3.ebuild         | 32 ---------------
-
- 29
 dev-php/pecl-redis/pecl-redis-2.2.5.ebuild         | 32 ---------------
-
- 30
 dev-php/pecl-redis/pecl-redis-2.2.7.ebuild         | 35 ----------------
-
- 31
 dev-python/pyGPG/Manifest                          |  1 +
-
- 32
 dev-python/pyGPG/pyGPG-0.2.ebuild                  | 47 ++++++++++++++++++++++
-
- 33
 dev-python/ssl-fetch/Manifest                      |  1 +
-
- 34
 dev-python/ssl-fetch/ssl-fetch-0.4.ebuild          | 42 +++++++++++++++++++
-
- 35
 13 files changed, 100 insertions(+), 117 deletions(-)
-
- 36
 rename app-crypt/gkeys-gen/{gkeys-gen-0.1-r1.ebuild => gkeys-gen-0.2.ebuild} (92%)
-
- 37
 rename app-crypt/gkeys/{gkeys-0.1-r1.ebuild => gkeys-0.2.ebuild} (80%)
-
- 38
 delete mode 100644 dev-php/pecl-redis/pecl-redis-2.2.3.ebuild
-
- 39
 delete mode 100644 dev-php/pecl-redis/pecl-redis-2.2.5.ebuild
-
- 40
 delete mode 100644 dev-php/pecl-redis/pecl-redis-2.2.7.ebuild
-
- 41
 create mode 100644 dev-python/pyGPG/pyGPG-0.2.ebuild
-
- 42
 create mode 100644 dev-python/ssl-fetch/ssl-fetch-0.4.ebuild
-
- 43
*** syncing gentoo
-
- 44
*** synced gentoo
-
- 45
 * Sync succeeded
-
- 46
$ pmaint regen --use-local-desc --pkg-desc-index -t 1 gentoo
-
- 47
WARNING:pkgcore:repository at '/home/mgorny/repos/steveeJ' has unsupported profile format(s): 'profile-set'
-
- 48
 * Cache regenerated successfully
+            24
 * Cache regenerated successfully
 
diff --git a/gentoo.txt b/gentoo.txt index 6691ac3e8d3c..457c081427af 100644 --- a/gentoo.txt +++ b/gentoo.txt @@ -15,31 +15,7 @@ 'status': 'official'} $ pmaint sync gentoo WARNING:pkgcore:repository at '/home/mgorny/sync/steveeJ' has unsupported profile format(s): 'profile-set' -From https://anongit.gentoo.org/git/repo/gentoo - 00fd731..615f52d master -> origin/master -Updating 00fd731..615f52d -Fast-forward - app-crypt/gkeys-gen/Manifest | 2 +- - ...keys-gen-0.1-r1.ebuild => gkeys-gen-0.2.ebuild} | 4 +- - app-crypt/gkeys/Manifest | 2 +- - .../{gkeys-0.1-r1.ebuild => gkeys-0.2.ebuild} | 10 ++--- - dev-php/pecl-redis/Manifest | 2 - - dev-php/pecl-redis/metadata.xml | 7 +--- - dev-php/pecl-redis/pecl-redis-2.2.3.ebuild | 32 --------------- - dev-php/pecl-redis/pecl-redis-2.2.5.ebuild | 32 --------------- - dev-php/pecl-redis/pecl-redis-2.2.7.ebuild | 35 ---------------- - dev-python/pyGPG/Manifest | 1 + - dev-python/pyGPG/pyGPG-0.2.ebuild | 47 ++++++++++++++++++++++ - dev-python/ssl-fetch/Manifest | 1 + - dev-python/ssl-fetch/ssl-fetch-0.4.ebuild | 42 +++++++++++++++++++ - 13 files changed, 100 insertions(+), 117 deletions(-) - rename app-crypt/gkeys-gen/{gkeys-gen-0.1-r1.ebuild => gkeys-gen-0.2.ebuild} (92%) - rename app-crypt/gkeys/{gkeys-0.1-r1.ebuild => gkeys-0.2.ebuild} (80%) - delete mode 100644 dev-php/pecl-redis/pecl-redis-2.2.3.ebuild - delete mode 100644 dev-php/pecl-redis/pecl-redis-2.2.5.ebuild - delete mode 100644 dev-php/pecl-redis/pecl-redis-2.2.7.ebuild - create mode 100644 dev-python/pyGPG/pyGPG-0.2.ebuild - create mode 100644 dev-python/ssl-fetch/ssl-fetch-0.4.ebuild +Already up-to-date. *** syncing gentoo *** synced gentoo * Sync succeeded diff --git a/graveyard.html b/graveyard.html index 55228342febd..0db2001cc78a 100644 --- a/graveyard.html +++ b/graveyard.html @@ -140,71 +140,73 @@
65
!!! caught exception False while processing ebuild src: media-plugins/xmms-scrobbler-0.3.6
 
[FATAL] - 66
Traceback (most recent call last):
+            66
!!! caught exception ("Expected command; instead got nothing from ''", None) while processing ebuild src: media-plugins/xmms-scrobbler-0.3.7
+
[FATAL] + 67
Traceback (most recent call last):
 
- 67
  File "/home/mgorny/pkgcore-venv/bin/pmaint", line 4, in <module>
+            68
  File "/home/mgorny/pkgcore-venv/bin/pmaint", line 4, in <module>
 
- 68
    scripts.main(basename(__file__))
+            69
    scripts.main(basename(__file__))
 
- 69
  File "/home/mgorny/pkgcore-venv/lib/python2.7/site-packages/pkgcore/scripts/__init__.py", line 40, in main
+            70
  File "/home/mgorny/pkgcore-venv/lib/python2.7/site-packages/pkgcore/scripts/__init__.py", line 40, in main
 
- 70
    commandline.main(argparser)
+            71
    commandline.main(argparser)
 
- 71
  File "/home/mgorny/pkgcore-venv/lib/python2.7/site-packages/pkgcore/util/commandline.py", line 969, in main
+            72
  File "/home/mgorny/pkgcore-venv/lib/python2.7/site-packages/pkgcore/util/commandline.py", line 969, in main
 
- 72
    exitstatus = main_func(options, out, err)
+            73
    exitstatus = main_func(options, out, err)
 
- 73
  File "/home/mgorny/pkgcore-venv/lib/python2.7/site-packages/pkgcore/scripts/pmaint.py", line 283, in regen_main
+            74
  File "/home/mgorny/pkgcore-venv/lib/python2.7/site-packages/pkgcore/scripts/pmaint.py", line 283, in regen_main
 
- 74
    eclass_caching=(not options.disable_eclass_caching))
+            75
    eclass_caching=(not options.disable_eclass_caching))
 
- 75
  File "/home/mgorny/pkgcore-venv/lib/python2.7/site-packages/pkgcore/operations/__init__.py", line 68, in _recast_exception_decorator
+            76
  File "/home/mgorny/pkgcore-venv/lib/python2.7/site-packages/pkgcore/operations/__init__.py", line 68, in _recast_exception_decorator
 
- 76
    return functor(*args, **kwds)
+            77
    return functor(*args, **kwds)
 
- 77
  File "/home/mgorny/pkgcore-venv/lib/python2.7/site-packages/pkgcore/operations/repo.py", line 247, in _cmd_api_regen_cache
+            78
  File "/home/mgorny/pkgcore-venv/lib/python2.7/site-packages/pkgcore/operations/repo.py", line 247, in _cmd_api_regen_cache
 
- 78
    self._get_observer(observer), threads=threads, **options)
+            79
    self._get_observer(observer), threads=threads, **options)
 
- 79
  File "/home/mgorny/pkgcore-venv/lib/python2.7/site-packages/pkgcore/operations/regen.py", line 37, in regen_repository
+            80
  File "/home/mgorny/pkgcore-venv/lib/python2.7/site-packages/pkgcore/operations/regen.py", line 37, in regen_repository
 
- 80
    regen_iter(iter(repo), _get_repo_helper(), observer)
+            81
    regen_iter(iter(repo), _get_repo_helper(), observer)
 
- 81
  File "/home/mgorny/pkgcore-venv/lib/python2.7/site-packages/pkgcore/operations/regen.py", line 15, in regen_iter
+            82
  File "/home/mgorny/pkgcore-venv/lib/python2.7/site-packages/pkgcore/operations/regen.py", line 15, in regen_iter
 
- 82
    regen_func(x)
+            83
    regen_func(x)
 
- 83
  File "/home/mgorny/pkgcore-venv/lib/python2.7/site-packages/pkgcore/ebuild/repository.py", line 521, in __call__
+            84
  File "/home/mgorny/pkgcore-venv/lib/python2.7/site-packages/pkgcore/ebuild/repository.py", line 521, in __call__
 
- 84
    return pkg._fetch_metadata(ebp=self.ebp, force_regen=self.force)
+            85
    return pkg._fetch_metadata(ebp=self.ebp, force_regen=self.force)
 
- 85
  File "/home/mgorny/pkgcore-venv/lib/python2.7/site-packages/pkgcore/ebuild/ebuild_src.py", line 277, in _fetch_metadata
+            86
  File "/home/mgorny/pkgcore-venv/lib/python2.7/site-packages/pkgcore/ebuild/ebuild_src.py", line 277, in _fetch_metadata
 
- 86
    return self._parent._get_metadata(self, ebp=ebp, force_regen=force_regen)
+            87
    return self._parent._get_metadata(self, ebp=ebp, force_regen=force_regen)
 
- 87
  File "/home/mgorny/pkgcore-venv/lib/python2.7/site-packages/pkgcore/ebuild/ebuild_src.py", line 367, in _get_metadata
+            88
  File "/home/mgorny/pkgcore-venv/lib/python2.7/site-packages/pkgcore/ebuild/ebuild_src.py", line 367, in _get_metadata
 
- 88
    return self._update_metadata(pkg, ebp=ebp)
+            89
    return self._update_metadata(pkg, ebp=ebp)
 
- 89
  File "/home/mgorny/pkgcore-venv/lib/python2.7/site-packages/pkgcore/ebuild/ebuild_src.py", line 375, in _update_metadata
+            90
  File "/home/mgorny/pkgcore-venv/lib/python2.7/site-packages/pkgcore/ebuild/ebuild_src.py", line 375, in _update_metadata
 
- 90
    mydata = my_proc.get_keys(pkg, self._ecache)
+            91
    mydata = my_proc.get_keys(pkg, self._ecache)
 
- 91
  File "/home/mgorny/pkgcore-venv/lib/python2.7/site-packages/pkgcore/ebuild/processor.py", line 788, in get_keys
+            92
  File "/home/mgorny/pkgcore-venv/lib/python2.7/site-packages/pkgcore/ebuild/processor.py", line 788, in get_keys
 
- 92
    {"key": receive_key})
+            93
    {"key": receive_key})
 
- 93
  File "/home/mgorny/pkgcore-venv/lib/python2.7/site-packages/pkgcore/ebuild/processor.py", line 721, in _run_depend_like_phase
+            94
  File "/home/mgorny/pkgcore-venv/lib/python2.7/site-packages/pkgcore/ebuild/processor.py", line 721, in _run_depend_like_phase
 
- 94
    self.write("%s %i\n%s" % (command, len(data), data), append_newline=False)
+            95
    self.write("%s %i\n%s" % (command, len(data), data), append_newline=False)
 
- 95
  File "/home/mgorny/pkgcore-venv/lib/python2.7/site-packages/pkgcore/ebuild/processor.py", line 419, in write
+            96
  File "/home/mgorny/pkgcore-venv/lib/python2.7/site-packages/pkgcore/ebuild/processor.py", line 419, in write
 
- 96
    raise RuntimeError(ie)
+            97
    raise RuntimeError(ie)
 
- 97
RuntimeError: [Errno 32] Broken pipe
+            98
RuntimeError: [Errno 32] Broken pipe
 
- 98
 * Cache regen failed with 1
+            99
 * Cache regen failed with 1
 
diff --git a/graveyard.txt b/graveyard.txt index 5d84e4c39b95..89160985a9a5 100644 --- a/graveyard.txt +++ b/graveyard.txt @@ -63,6 +63,7 @@ ERROR pkgcore: returned val from gen_metadata was 'False' error: parsed eapi '2' doesn't match sourced eapi '0' while processing ebuild src: media-plugins/xmms-scivi-0.2.0_rc3 ERROR pkgcore: returned val from gen_metadata was 'False' !!! caught exception False while processing ebuild src: media-plugins/xmms-scrobbler-0.3.6 +!!! caught exception ("Expected command; instead got nothing from ''", None) while processing ebuild src: media-plugins/xmms-scrobbler-0.3.7 Traceback (most recent call last): File "/home/mgorny/pkgcore-venv/bin/pmaint", line 4, in scripts.main(basename(__file__)) diff --git a/hacking-gentoo.html b/hacking-gentoo.html index 12d29870c09e..8c6af0e19b3d 100644 --- a/hacking-gentoo.html +++ b/hacking-gentoo.html @@ -54,21 +54,21 @@
22
Matched data: 0 bytes
 
- 23
File list size: 45.48K
+            23
File list size: 45.10K
 
24
File list generation time: 0.001 seconds
 
25
File list transfer time: 0.000 seconds
 
- 26
Total bytes sent: 439
+            26
Total bytes sent: 415
 
27
Total bytes received: 49.99K
 
28
 
- 29
sent 439 bytes  received 49.99K bytes  33.62K bytes/sec
+            29
sent 415 bytes  received 49.99K bytes  20.16K bytes/sec
 
- 30
total size is 5.29M  speedup is 104.83
+            30
total size is 5.29M  speedup is 104.88
 
31
*** syncing hacking-gentoo
 
diff --git a/hacking-gentoo.txt b/hacking-gentoo.txt index 122ee97ad36d..17904cf8f53f 100644 --- a/hacking-gentoo.txt +++ b/hacking-gentoo.txt @@ -20,14 +20,14 @@ Total file size: 5.29M bytes Total transferred file size: 0 bytes Literal data: 0 bytes Matched data: 0 bytes -File list size: 45.48K +File list size: 45.10K File list generation time: 0.001 seconds File list transfer time: 0.000 seconds -Total bytes sent: 439 +Total bytes sent: 415 Total bytes received: 49.99K -sent 439 bytes received 49.99K bytes 33.62K bytes/sec -total size is 5.29M speedup is 104.83 +sent 415 bytes received 49.99K bytes 20.16K bytes/sec +total size is 5.29M speedup is 104.88 *** syncing hacking-gentoo *** synced hacking-gentoo * Sync succeeded diff --git a/index.html b/index.html index 26880abea0c4..fc348fdb6d96 100644 --- a/index.html +++ b/index.html @@ -448,7 +448,7 @@ -
Generated based on results from 2016-01-23 19:43:08 UTC
+
Generated based on results from 2016-01-23 20:01:40 UTC
\ No newline at end of file diff --git a/jensp.html b/jensp.html index 4269be787b7b..16312120ba69 100644 --- a/jensp.html +++ b/jensp.html @@ -122,13 +122,13 @@
56
 
- 57
sandbox:stop  caught signal 15 in pid 12281
+            57
sandbox:stop  caught signal 15 in pid 12113
 
58
Sandboxed process killed by signal: Terminated
 
59
!!! caught exception inherit requires an unknown eclass, git cannot be found while processing ebuild src: dev-python/pykickstart-9999
 
[FATAL] - 60
caught exception '%s' while processing '%s'(MetadataException('Metadata Exception: pkg ebuild src: dev-python/pykickstart-9999, attr description\nerror: Metadata Exception: pkg ebuild src: dev-python/pykickstart-9999, attr data\nerror: inherit requires an unknown eclass, git cannot be found',), <<class 'pkgcore.ebuild.ebuild_src.package'> cpv='dev-python/pykickstart-9999' @0x7f35043fa050>)
+            60
caught exception '%s' while processing '%s'(MetadataException('Metadata Exception: pkg ebuild src: dev-python/pykickstart-9999, attr description\nerror: Metadata Exception: pkg ebuild src: dev-python/pykickstart-9999, attr data\nerror: inherit requires an unknown eclass, git cannot be found',), <<class 'pkgcore.ebuild.ebuild_src.package'> cpv='dev-python/pykickstart-9999' @0x7fb4fbc2f050>)
 
[FATAL] 61
 * Cache regen failed with 1
 
diff --git a/jensp.txt b/jensp.txt index 65c3369c0080..3848498ddbea 100644 --- a/jensp.txt +++ b/jensp.txt @@ -54,8 +54,8 @@ Sandboxed process killed by signal: Broken pipe !!! The die message: !!! inherit for git failed -sandbox:stop caught signal 15 in pid 12281 +sandbox:stop caught signal 15 in pid 12113 Sandboxed process killed by signal: Terminated !!! caught exception inherit requires an unknown eclass, git cannot be found while processing ebuild src: dev-python/pykickstart-9999 -caught exception '%s' while processing '%s'(MetadataException('Metadata Exception: pkg ebuild src: dev-python/pykickstart-9999, attr description\nerror: Metadata Exception: pkg ebuild src: dev-python/pykickstart-9999, attr data\nerror: inherit requires an unknown eclass, git cannot be found',), < cpv='dev-python/pykickstart-9999' @0x7f35043fa050>) +caught exception '%s' while processing '%s'(MetadataException('Metadata Exception: pkg ebuild src: dev-python/pykickstart-9999, attr description\nerror: Metadata Exception: pkg ebuild src: dev-python/pykickstart-9999, attr data\nerror: inherit requires an unknown eclass, git cannot be found',), < cpv='dev-python/pykickstart-9999' @0x7fb4fbc2f050>) * Cache regen failed with 1 diff --git a/jkolo.html b/jkolo.html index ee579fcbdb11..a4d88d0ace7d 100644 --- a/jkolo.html +++ b/jkolo.html @@ -130,71 +130,73 @@
60
!!! caught exception False while processing ebuild src: media-sound/clementine-1.1.1-r1000
 
[FATAL] - 61
Traceback (most recent call last):
+            61
!!! caught exception ("Expected command; instead got nothing from ''", None) while processing ebuild src: media-sound/clementine-1.2.3-r1000
+
[FATAL] + 62
Traceback (most recent call last):
 
- 62
  File "/home/mgorny/pkgcore-venv/bin/pmaint", line 4, in <module>
+            63
  File "/home/mgorny/pkgcore-venv/bin/pmaint", line 4, in <module>
 
- 63
    scripts.main(basename(__file__))
+            64
    scripts.main(basename(__file__))
 
- 64
  File "/home/mgorny/pkgcore-venv/lib/python2.7/site-packages/pkgcore/scripts/__init__.py", line 40, in main
+            65
  File "/home/mgorny/pkgcore-venv/lib/python2.7/site-packages/pkgcore/scripts/__init__.py", line 40, in main
 
- 65
    commandline.main(argparser)
+            66
    commandline.main(argparser)
 
- 66
  File "/home/mgorny/pkgcore-venv/lib/python2.7/site-packages/pkgcore/util/commandline.py", line 969, in main
+            67
  File "/home/mgorny/pkgcore-venv/lib/python2.7/site-packages/pkgcore/util/commandline.py", line 969, in main
 
- 67
    exitstatus = main_func(options, out, err)
+            68
    exitstatus = main_func(options, out, err)
 
- 68
  File "/home/mgorny/pkgcore-venv/lib/python2.7/site-packages/pkgcore/scripts/pmaint.py", line 283, in regen_main
+            69
  File "/home/mgorny/pkgcore-venv/lib/python2.7/site-packages/pkgcore/scripts/pmaint.py", line 283, in regen_main
 
- 69
    eclass_caching=(not options.disable_eclass_caching))
+            70
    eclass_caching=(not options.disable_eclass_caching))
 
- 70
  File "/home/mgorny/pkgcore-venv/lib/python2.7/site-packages/pkgcore/operations/__init__.py", line 68, in _recast_exception_decorator
+            71
  File "/home/mgorny/pkgcore-venv/lib/python2.7/site-packages/pkgcore/operations/__init__.py", line 68, in _recast_exception_decorator
 
- 71
    return functor(*args, **kwds)
+            72
    return functor(*args, **kwds)
 
- 72
  File "/home/mgorny/pkgcore-venv/lib/python2.7/site-packages/pkgcore/operations/repo.py", line 247, in _cmd_api_regen_cache
+            73
  File "/home/mgorny/pkgcore-venv/lib/python2.7/site-packages/pkgcore/operations/repo.py", line 247, in _cmd_api_regen_cache
 
- 73
    self._get_observer(observer), threads=threads, **options)
+            74
    self._get_observer(observer), threads=threads, **options)
 
- 74
  File "/home/mgorny/pkgcore-venv/lib/python2.7/site-packages/pkgcore/operations/regen.py", line 37, in regen_repository
+            75
  File "/home/mgorny/pkgcore-venv/lib/python2.7/site-packages/pkgcore/operations/regen.py", line 37, in regen_repository
 
- 75
    regen_iter(iter(repo), _get_repo_helper(), observer)
+            76
    regen_iter(iter(repo), _get_repo_helper(), observer)
 
- 76
  File "/home/mgorny/pkgcore-venv/lib/python2.7/site-packages/pkgcore/operations/regen.py", line 15, in regen_iter
+            77
  File "/home/mgorny/pkgcore-venv/lib/python2.7/site-packages/pkgcore/operations/regen.py", line 15, in regen_iter
 
- 77
    regen_func(x)
+            78
    regen_func(x)
 
- 78
  File "/home/mgorny/pkgcore-venv/lib/python2.7/site-packages/pkgcore/ebuild/repository.py", line 521, in __call__
+            79
  File "/home/mgorny/pkgcore-venv/lib/python2.7/site-packages/pkgcore/ebuild/repository.py", line 521, in __call__
 
- 79
    return pkg._fetch_metadata(ebp=self.ebp, force_regen=self.force)
+            80
    return pkg._fetch_metadata(ebp=self.ebp, force_regen=self.force)
 
- 80
  File "/home/mgorny/pkgcore-venv/lib/python2.7/site-packages/pkgcore/ebuild/ebuild_src.py", line 277, in _fetch_metadata
+            81
  File "/home/mgorny/pkgcore-venv/lib/python2.7/site-packages/pkgcore/ebuild/ebuild_src.py", line 277, in _fetch_metadata
 
- 81
    return self._parent._get_metadata(self, ebp=ebp, force_regen=force_regen)
+            82
    return self._parent._get_metadata(self, ebp=ebp, force_regen=force_regen)
 
- 82
  File "/home/mgorny/pkgcore-venv/lib/python2.7/site-packages/pkgcore/ebuild/ebuild_src.py", line 367, in _get_metadata
+            83
  File "/home/mgorny/pkgcore-venv/lib/python2.7/site-packages/pkgcore/ebuild/ebuild_src.py", line 367, in _get_metadata
 
- 83
    return self._update_metadata(pkg, ebp=ebp)
+            84
    return self._update_metadata(pkg, ebp=ebp)
 
- 84
  File "/home/mgorny/pkgcore-venv/lib/python2.7/site-packages/pkgcore/ebuild/ebuild_src.py", line 375, in _update_metadata
+            85
  File "/home/mgorny/pkgcore-venv/lib/python2.7/site-packages/pkgcore/ebuild/ebuild_src.py", line 375, in _update_metadata
 
- 85
    mydata = my_proc.get_keys(pkg, self._ecache)
+            86
    mydata = my_proc.get_keys(pkg, self._ecache)
 
- 86
  File "/home/mgorny/pkgcore-venv/lib/python2.7/site-packages/pkgcore/ebuild/processor.py", line 788, in get_keys
+            87
  File "/home/mgorny/pkgcore-venv/lib/python2.7/site-packages/pkgcore/ebuild/processor.py", line 788, in get_keys
 
- 87
    {"key": receive_key})
+            88
    {"key": receive_key})
 
- 88
  File "/home/mgorny/pkgcore-venv/lib/python2.7/site-packages/pkgcore/ebuild/processor.py", line 721, in _run_depend_like_phase
+            89
  File "/home/mgorny/pkgcore-venv/lib/python2.7/site-packages/pkgcore/ebuild/processor.py", line 721, in _run_depend_like_phase
 
- 89
    self.write("%s %i\n%s" % (command, len(data), data), append_newline=False)
+            90
    self.write("%s %i\n%s" % (command, len(data), data), append_newline=False)
 
- 90
  File "/home/mgorny/pkgcore-venv/lib/python2.7/site-packages/pkgcore/ebuild/processor.py", line 419, in write
+            91
  File "/home/mgorny/pkgcore-venv/lib/python2.7/site-packages/pkgcore/ebuild/processor.py", line 419, in write
 
- 91
    raise RuntimeError(ie)
+            92
    raise RuntimeError(ie)
 
- 92
RuntimeError: [Errno 32] Broken pipe
+            93
RuntimeError: [Errno 32] Broken pipe
 
- 93
 * Cache regen failed with 1
+            94
 * Cache regen failed with 1
 
diff --git a/jkolo.txt b/jkolo.txt index 294eaeff6323..c61b6b5b649a 100644 --- a/jkolo.txt +++ b/jkolo.txt @@ -58,6 +58,7 @@ ERROR pkgcore: returned val from gen_metadata was 'False' !!! caught exception False while processing ebuild src: dev-python/g-pypi-0.4 ERROR pkgcore: returned val from gen_metadata was 'False' !!! caught exception False while processing ebuild src: media-sound/clementine-1.1.1-r1000 +!!! caught exception ("Expected command; instead got nothing from ''", None) while processing ebuild src: media-sound/clementine-1.2.3-r1000 Traceback (most recent call last): File "/home/mgorny/pkgcore-venv/bin/pmaint", line 4, in scripts.main(basename(__file__)) diff --git a/jtriley.html b/jtriley.html index 326a1bf2ebfd..a7cf00916632 100644 --- a/jtriley.html +++ b/jtriley.html @@ -264,73 +264,71 @@
127
!!! caught exception False while processing ebuild src: app-benchmarks/autobench-2.1.2
 
[FATAL] - 128
!!! caught exception ("Expected command; instead got nothing from ''", None) while processing ebuild src: net-im/hipchat-2.2.1309
-
[FATAL] - 129
Traceback (most recent call last):
+            128
Traceback (most recent call last):
 
- 130
  File "/home/mgorny/pkgcore-venv/bin/pmaint", line 4, in <module>
+            129
  File "/home/mgorny/pkgcore-venv/bin/pmaint", line 4, in <module>
 
- 131
    scripts.main(basename(__file__))
+            130
    scripts.main(basename(__file__))
 
- 132
  File "/home/mgorny/pkgcore-venv/lib/python2.7/site-packages/pkgcore/scripts/__init__.py", line 40, in main
+            131
  File "/home/mgorny/pkgcore-venv/lib/python2.7/site-packages/pkgcore/scripts/__init__.py", line 40, in main
 
- 133
    commandline.main(argparser)
+            132
    commandline.main(argparser)
 
- 134
  File "/home/mgorny/pkgcore-venv/lib/python2.7/site-packages/pkgcore/util/commandline.py", line 969, in main
+            133
  File "/home/mgorny/pkgcore-venv/lib/python2.7/site-packages/pkgcore/util/commandline.py", line 969, in main
 
- 135
    exitstatus = main_func(options, out, err)
+            134
    exitstatus = main_func(options, out, err)
 
- 136
  File "/home/mgorny/pkgcore-venv/lib/python2.7/site-packages/pkgcore/scripts/pmaint.py", line 283, in regen_main
+            135
  File "/home/mgorny/pkgcore-venv/lib/python2.7/site-packages/pkgcore/scripts/pmaint.py", line 283, in regen_main
 
- 137
    eclass_caching=(not options.disable_eclass_caching))
+            136
    eclass_caching=(not options.disable_eclass_caching))
 
- 138
  File "/home/mgorny/pkgcore-venv/lib/python2.7/site-packages/pkgcore/operations/__init__.py", line 68, in _recast_exception_decorator
+            137
  File "/home/mgorny/pkgcore-venv/lib/python2.7/site-packages/pkgcore/operations/__init__.py", line 68, in _recast_exception_decorator
 
- 139
    return functor(*args, **kwds)
+            138
    return functor(*args, **kwds)
 
- 140
  File "/home/mgorny/pkgcore-venv/lib/python2.7/site-packages/pkgcore/operations/repo.py", line 247, in _cmd_api_regen_cache
+            139
  File "/home/mgorny/pkgcore-venv/lib/python2.7/site-packages/pkgcore/operations/repo.py", line 247, in _cmd_api_regen_cache
 
- 141
    self._get_observer(observer), threads=threads, **options)
+            140
    self._get_observer(observer), threads=threads, **options)
 
- 142
  File "/home/mgorny/pkgcore-venv/lib/python2.7/site-packages/pkgcore/operations/regen.py", line 37, in regen_repository
+            141
  File "/home/mgorny/pkgcore-venv/lib/python2.7/site-packages/pkgcore/operations/regen.py", line 37, in regen_repository
 
- 143
    regen_iter(iter(repo), _get_repo_helper(), observer)
+            142
    regen_iter(iter(repo), _get_repo_helper(), observer)
 
- 144
  File "/home/mgorny/pkgcore-venv/lib/python2.7/site-packages/pkgcore/operations/regen.py", line 15, in regen_iter
+            143
  File "/home/mgorny/pkgcore-venv/lib/python2.7/site-packages/pkgcore/operations/regen.py", line 15, in regen_iter
 
- 145
    regen_func(x)
+            144
    regen_func(x)
 
- 146
  File "/home/mgorny/pkgcore-venv/lib/python2.7/site-packages/pkgcore/ebuild/repository.py", line 521, in __call__
+            145
  File "/home/mgorny/pkgcore-venv/lib/python2.7/site-packages/pkgcore/ebuild/repository.py", line 521, in __call__
 
- 147
    return pkg._fetch_metadata(ebp=self.ebp, force_regen=self.force)
+            146
    return pkg._fetch_metadata(ebp=self.ebp, force_regen=self.force)
 
- 148
  File "/home/mgorny/pkgcore-venv/lib/python2.7/site-packages/pkgcore/ebuild/ebuild_src.py", line 277, in _fetch_metadata
+            147
  File "/home/mgorny/pkgcore-venv/lib/python2.7/site-packages/pkgcore/ebuild/ebuild_src.py", line 277, in _fetch_metadata
 
- 149
    return self._parent._get_metadata(self, ebp=ebp, force_regen=force_regen)
+            148
    return self._parent._get_metadata(self, ebp=ebp, force_regen=force_regen)
 
- 150
  File "/home/mgorny/pkgcore-venv/lib/python2.7/site-packages/pkgcore/ebuild/ebuild_src.py", line 367, in _get_metadata
+            149
  File "/home/mgorny/pkgcore-venv/lib/python2.7/site-packages/pkgcore/ebuild/ebuild_src.py", line 367, in _get_metadata
 
- 151
    return self._update_metadata(pkg, ebp=ebp)
+            150
    return self._update_metadata(pkg, ebp=ebp)
 
- 152
  File "/home/mgorny/pkgcore-venv/lib/python2.7/site-packages/pkgcore/ebuild/ebuild_src.py", line 375, in _update_metadata
+            151
  File "/home/mgorny/pkgcore-venv/lib/python2.7/site-packages/pkgcore/ebuild/ebuild_src.py", line 375, in _update_metadata
 
- 153
    mydata = my_proc.get_keys(pkg, self._ecache)
+            152
    mydata = my_proc.get_keys(pkg, self._ecache)
 
- 154
  File "/home/mgorny/pkgcore-venv/lib/python2.7/site-packages/pkgcore/ebuild/processor.py", line 788, in get_keys
+            153
  File "/home/mgorny/pkgcore-venv/lib/python2.7/site-packages/pkgcore/ebuild/processor.py", line 788, in get_keys
 
- 155
    {"key": receive_key})
+            154
    {"key": receive_key})
 
- 156
  File "/home/mgorny/pkgcore-venv/lib/python2.7/site-packages/pkgcore/ebuild/processor.py", line 721, in _run_depend_like_phase
+            155
  File "/home/mgorny/pkgcore-venv/lib/python2.7/site-packages/pkgcore/ebuild/processor.py", line 721, in _run_depend_like_phase
 
- 157
    self.write("%s %i\n%s" % (command, len(data), data), append_newline=False)
+            156
    self.write("%s %i\n%s" % (command, len(data), data), append_newline=False)
 
- 158
  File "/home/mgorny/pkgcore-venv/lib/python2.7/site-packages/pkgcore/ebuild/processor.py", line 419, in write
+            157
  File "/home/mgorny/pkgcore-venv/lib/python2.7/site-packages/pkgcore/ebuild/processor.py", line 419, in write
 
- 159
    raise RuntimeError(ie)
+            158
    raise RuntimeError(ie)
 
- 160
RuntimeError: [Errno 32] Broken pipe
+            159
RuntimeError: [Errno 32] Broken pipe
 
- 161
 * Cache regen failed with 1
+            160
 * Cache regen failed with 1
 
diff --git a/jtriley.txt b/jtriley.txt index dcbf60a65b90..a0f675a2535e 100644 --- a/jtriley.txt +++ b/jtriley.txt @@ -125,7 +125,6 @@ ERROR pkgcore: returned val from gen_metadata was 'False' !!! caught exception False while processing ebuild src: x11-wm/awesome-9999 ERROR pkgcore: returned val from gen_metadata was 'False' !!! caught exception False while processing ebuild src: app-benchmarks/autobench-2.1.2 -!!! caught exception ("Expected command; instead got nothing from ''", None) while processing ebuild src: net-im/hipchat-2.2.1309 Traceback (most recent call last): File "/home/mgorny/pkgcore-venv/bin/pmaint", line 4, in scripts.main(basename(__file__)) diff --git a/loongson.html b/loongson.html index 198cf35b7342..95bf1f9e287a 100644 --- a/loongson.html +++ b/loongson.html @@ -456,23 +456,23 @@
[FATAL] 223
ERROR pkgcore: returned val from gen_metadata was 'False'
 
- 224
caught exception '%s' while processing '%s'(MetadataException('Metadata Exception: pkg ebuild src: net-libs/xulrunner-1.9.2.13-r1, attr description\nerror: Metadata Exception: pkg ebuild src: net-libs/xulrunner-1.9.2.13-r1, attr data\nerror: False',), <<class 'pkgcore.ebuild.ebuild_src.package'> cpv='net-libs/xulrunner-1.9.2.13-r1' @0x7f91d3d4b410>)
+            224
caught exception '%s' while processing '%s'(MetadataException('Metadata Exception: pkg ebuild src: net-libs/xulrunner-1.9.2.13-r1, attr description\nerror: Metadata Exception: pkg ebuild src: net-libs/xulrunner-1.9.2.13-r1, attr data\nerror: False',), <<class 'pkgcore.ebuild.ebuild_src.package'> cpv='net-libs/xulrunner-1.9.2.13-r1' @0x7fe1b755b410>)
 
[FATAL] 225
ERROR pkgcore: returned val from gen_metadata was 'False'
 
- 226
caught exception '%s' while processing '%s'(MetadataException('Metadata Exception: pkg ebuild src: net-libs/xulrunner-1.9.2.8-r1, attr description\nerror: Metadata Exception: pkg ebuild src: net-libs/xulrunner-1.9.2.8-r1, attr data\nerror: False',), <<class 'pkgcore.ebuild.ebuild_src.package'> cpv='net-libs/xulrunner-1.9.2.8-r1' @0x7f91d3d4b550>)
+            226
caught exception '%s' while processing '%s'(MetadataException('Metadata Exception: pkg ebuild src: net-libs/xulrunner-1.9.2.8-r1, attr description\nerror: Metadata Exception: pkg ebuild src: net-libs/xulrunner-1.9.2.8-r1, attr data\nerror: False',), <<class 'pkgcore.ebuild.ebuild_src.package'> cpv='net-libs/xulrunner-1.9.2.8-r1' @0x7fe1b755b550>)
 
[FATAL] 227
ERROR pkgcore: returned val from gen_metadata was 'False'
 
- 228
caught exception '%s' while processing '%s'(MetadataException('Metadata Exception: pkg ebuild src: net-libs/xulrunner-2.0_beta5_pre-r2, attr description\nerror: Metadata Exception: pkg ebuild src: net-libs/xulrunner-2.0_beta5_pre-r2, attr data\nerror: False',), <<class 'pkgcore.ebuild.ebuild_src.package'> cpv='net-libs/xulrunner-2.0_beta5_pre-r2' @0x7f91d3d4b690>)
+            228
caught exception '%s' while processing '%s'(MetadataException('Metadata Exception: pkg ebuild src: net-libs/xulrunner-2.0_beta5_pre-r2, attr description\nerror: Metadata Exception: pkg ebuild src: net-libs/xulrunner-2.0_beta5_pre-r2, attr data\nerror: False',), <<class 'pkgcore.ebuild.ebuild_src.package'> cpv='net-libs/xulrunner-2.0_beta5_pre-r2' @0x7fe1b755b690>)
 
[FATAL] 229
ERROR pkgcore: returned val from gen_metadata was 'False'
 
- 230
caught exception '%s' while processing '%s'(MetadataException('Metadata Exception: pkg ebuild src: www-client/firefox-3.6.13, attr description\nerror: Metadata Exception: pkg ebuild src: www-client/firefox-3.6.13, attr data\nerror: False',), <<class 'pkgcore.ebuild.ebuild_src.package'> cpv='www-client/firefox-3.6.13' @0x7f91d3d4b550>)
+            230
caught exception '%s' while processing '%s'(MetadataException('Metadata Exception: pkg ebuild src: www-client/firefox-3.6.13, attr description\nerror: Metadata Exception: pkg ebuild src: www-client/firefox-3.6.13, attr data\nerror: False',), <<class 'pkgcore.ebuild.ebuild_src.package'> cpv='www-client/firefox-3.6.13' @0x7fe1b755b550>)
 
[FATAL] 231
ERROR pkgcore: returned val from gen_metadata was 'False'
 
- 232
caught exception '%s' while processing '%s'(MetadataException('Metadata Exception: pkg ebuild src: www-client/firefox-3.6.8, attr description\nerror: Metadata Exception: pkg ebuild src: www-client/firefox-3.6.8, attr data\nerror: False',), <<class 'pkgcore.ebuild.ebuild_src.package'> cpv='www-client/firefox-3.6.8' @0x7f91d3d4b690>)
+            232
caught exception '%s' while processing '%s'(MetadataException('Metadata Exception: pkg ebuild src: www-client/firefox-3.6.8, attr description\nerror: Metadata Exception: pkg ebuild src: www-client/firefox-3.6.8, attr data\nerror: False',), <<class 'pkgcore.ebuild.ebuild_src.package'> cpv='www-client/firefox-3.6.8' @0x7fe1b755b690>)
 
[FATAL] 233
 * Cache regen failed with 1
 
diff --git a/loongson.txt b/loongson.txt index c4c5dbb6e346..bb125e5abc0f 100644 --- a/loongson.txt +++ b/loongson.txt @@ -221,13 +221,13 @@ ERROR pkgcore: returned val from gen_metadata was 'False' ERROR pkgcore: returned val from gen_metadata was 'False' !!! caught exception False while processing ebuild src: www-client/firefox-3.6.8 ERROR pkgcore: returned val from gen_metadata was 'False' -caught exception '%s' while processing '%s'(MetadataException('Metadata Exception: pkg ebuild src: net-libs/xulrunner-1.9.2.13-r1, attr description\nerror: Metadata Exception: pkg ebuild src: net-libs/xulrunner-1.9.2.13-r1, attr data\nerror: False',), < cpv='net-libs/xulrunner-1.9.2.13-r1' @0x7f91d3d4b410>) +caught exception '%s' while processing '%s'(MetadataException('Metadata Exception: pkg ebuild src: net-libs/xulrunner-1.9.2.13-r1, attr description\nerror: Metadata Exception: pkg ebuild src: net-libs/xulrunner-1.9.2.13-r1, attr data\nerror: False',), < cpv='net-libs/xulrunner-1.9.2.13-r1' @0x7fe1b755b410>) ERROR pkgcore: returned val from gen_metadata was 'False' -caught exception '%s' while processing '%s'(MetadataException('Metadata Exception: pkg ebuild src: net-libs/xulrunner-1.9.2.8-r1, attr description\nerror: Metadata Exception: pkg ebuild src: net-libs/xulrunner-1.9.2.8-r1, attr data\nerror: False',), < cpv='net-libs/xulrunner-1.9.2.8-r1' @0x7f91d3d4b550>) +caught exception '%s' while processing '%s'(MetadataException('Metadata Exception: pkg ebuild src: net-libs/xulrunner-1.9.2.8-r1, attr description\nerror: Metadata Exception: pkg ebuild src: net-libs/xulrunner-1.9.2.8-r1, attr data\nerror: False',), < cpv='net-libs/xulrunner-1.9.2.8-r1' @0x7fe1b755b550>) ERROR pkgcore: returned val from gen_metadata was 'False' -caught exception '%s' while processing '%s'(MetadataException('Metadata Exception: pkg ebuild src: net-libs/xulrunner-2.0_beta5_pre-r2, attr description\nerror: Metadata Exception: pkg ebuild src: net-libs/xulrunner-2.0_beta5_pre-r2, attr data\nerror: False',), < cpv='net-libs/xulrunner-2.0_beta5_pre-r2' @0x7f91d3d4b690>) +caught exception '%s' while processing '%s'(MetadataException('Metadata Exception: pkg ebuild src: net-libs/xulrunner-2.0_beta5_pre-r2, attr description\nerror: Metadata Exception: pkg ebuild src: net-libs/xulrunner-2.0_beta5_pre-r2, attr data\nerror: False',), < cpv='net-libs/xulrunner-2.0_beta5_pre-r2' @0x7fe1b755b690>) ERROR pkgcore: returned val from gen_metadata was 'False' -caught exception '%s' while processing '%s'(MetadataException('Metadata Exception: pkg ebuild src: www-client/firefox-3.6.13, attr description\nerror: Metadata Exception: pkg ebuild src: www-client/firefox-3.6.13, attr data\nerror: False',), < cpv='www-client/firefox-3.6.13' @0x7f91d3d4b550>) +caught exception '%s' while processing '%s'(MetadataException('Metadata Exception: pkg ebuild src: www-client/firefox-3.6.13, attr description\nerror: Metadata Exception: pkg ebuild src: www-client/firefox-3.6.13, attr data\nerror: False',), < cpv='www-client/firefox-3.6.13' @0x7fe1b755b550>) ERROR pkgcore: returned val from gen_metadata was 'False' -caught exception '%s' while processing '%s'(MetadataException('Metadata Exception: pkg ebuild src: www-client/firefox-3.6.8, attr description\nerror: Metadata Exception: pkg ebuild src: www-client/firefox-3.6.8, attr data\nerror: False',), < cpv='www-client/firefox-3.6.8' @0x7f91d3d4b690>) +caught exception '%s' while processing '%s'(MetadataException('Metadata Exception: pkg ebuild src: www-client/firefox-3.6.8, attr description\nerror: Metadata Exception: pkg ebuild src: www-client/firefox-3.6.8, attr data\nerror: False',), < cpv='www-client/firefox-3.6.8' @0x7fe1b755b690>) * Cache regen failed with 1 diff --git a/lordvan.html b/lordvan.html index 6a351c4d205e..491de78cacad 100644 --- a/lordvan.html +++ b/lordvan.html @@ -152,7 +152,7 @@
[FATAL] 71
ERROR pkgcore: returned val from gen_metadata was 'False'
 
- 72
caught exception '%s' while processing '%s'(MetadataException('Metadata Exception: pkg ebuild src: app-misc/labyrinth-0.4.0, attr description\nerror: Metadata Exception: pkg ebuild src: app-misc/labyrinth-0.4.0, attr data\nerror: False',), <<class 'pkgcore.ebuild.ebuild_src.package'> cpv='app-misc/labyrinth-0.4.0' @0x7f08ab49e050>)
+            72
caught exception '%s' while processing '%s'(MetadataException('Metadata Exception: pkg ebuild src: app-misc/labyrinth-0.4.0, attr description\nerror: Metadata Exception: pkg ebuild src: app-misc/labyrinth-0.4.0, attr data\nerror: False',), <<class 'pkgcore.ebuild.ebuild_src.package'> cpv='app-misc/labyrinth-0.4.0' @0x7fc32cc1e050>)
 
[FATAL] 73
 * Cache regen failed with 1
 
diff --git a/lordvan.txt b/lordvan.txt index db5f909504f0..2212e279f28d 100644 --- a/lordvan.txt +++ b/lordvan.txt @@ -69,5 +69,5 @@ WARNING:pkgcore:repository at '/home/mgorny/repos/steveeJ' has unsupported profi ERROR pkgcore: returned val from gen_metadata was 'False' !!! caught exception False while processing ebuild src: app-misc/labyrinth-0.4.0 ERROR pkgcore: returned val from gen_metadata was 'False' -caught exception '%s' while processing '%s'(MetadataException('Metadata Exception: pkg ebuild src: app-misc/labyrinth-0.4.0, attr description\nerror: Metadata Exception: pkg ebuild src: app-misc/labyrinth-0.4.0, attr data\nerror: False',), < cpv='app-misc/labyrinth-0.4.0' @0x7f08ab49e050>) +caught exception '%s' while processing '%s'(MetadataException('Metadata Exception: pkg ebuild src: app-misc/labyrinth-0.4.0, attr description\nerror: Metadata Exception: pkg ebuild src: app-misc/labyrinth-0.4.0, attr data\nerror: False',), < cpv='app-misc/labyrinth-0.4.0' @0x7fc32cc1e050>) * Cache regen failed with 1 diff --git a/luke-jr.html b/luke-jr.html index 7a84da7d8c8c..48058447569b 100644 --- a/luke-jr.html +++ b/luke-jr.html @@ -300,73 +300,71 @@
145
!!! caught exception False while processing ebuild src: net-im/psi-9999_pre20150515
 
[FATAL] - 146
!!! caught exception ("Expected command; instead got nothing from ''", None) while processing ebuild src: media-libs/glew-1.5.8
-
[FATAL] - 147
Traceback (most recent call last):
+            146
Traceback (most recent call last):
 
- 148
  File "/home/mgorny/pkgcore-venv/bin/pmaint", line 4, in <module>
+            147
  File "/home/mgorny/pkgcore-venv/bin/pmaint", line 4, in <module>
 
- 149
    scripts.main(basename(__file__))
+            148
    scripts.main(basename(__file__))
 
- 150
  File "/home/mgorny/pkgcore-venv/lib/python2.7/site-packages/pkgcore/scripts/__init__.py", line 40, in main
+            149
  File "/home/mgorny/pkgcore-venv/lib/python2.7/site-packages/pkgcore/scripts/__init__.py", line 40, in main
 
- 151
    commandline.main(argparser)
+            150
    commandline.main(argparser)
 
- 152
  File "/home/mgorny/pkgcore-venv/lib/python2.7/site-packages/pkgcore/util/commandline.py", line 969, in main
+            151
  File "/home/mgorny/pkgcore-venv/lib/python2.7/site-packages/pkgcore/util/commandline.py", line 969, in main
 
- 153
    exitstatus = main_func(options, out, err)
+            152
    exitstatus = main_func(options, out, err)
 
- 154
  File "/home/mgorny/pkgcore-venv/lib/python2.7/site-packages/pkgcore/scripts/pmaint.py", line 283, in regen_main
+            153
  File "/home/mgorny/pkgcore-venv/lib/python2.7/site-packages/pkgcore/scripts/pmaint.py", line 283, in regen_main
 
- 155
    eclass_caching=(not options.disable_eclass_caching))
+            154
    eclass_caching=(not options.disable_eclass_caching))
 
- 156
  File "/home/mgorny/pkgcore-venv/lib/python2.7/site-packages/pkgcore/operations/__init__.py", line 68, in _recast_exception_decorator
+            155
  File "/home/mgorny/pkgcore-venv/lib/python2.7/site-packages/pkgcore/operations/__init__.py", line 68, in _recast_exception_decorator
 
- 157
    return functor(*args, **kwds)
+            156
    return functor(*args, **kwds)
 
- 158
  File "/home/mgorny/pkgcore-venv/lib/python2.7/site-packages/pkgcore/operations/repo.py", line 247, in _cmd_api_regen_cache
+            157
  File "/home/mgorny/pkgcore-venv/lib/python2.7/site-packages/pkgcore/operations/repo.py", line 247, in _cmd_api_regen_cache
 
- 159
    self._get_observer(observer), threads=threads, **options)
+            158
    self._get_observer(observer), threads=threads, **options)
 
- 160
  File "/home/mgorny/pkgcore-venv/lib/python2.7/site-packages/pkgcore/operations/regen.py", line 37, in regen_repository
+            159
  File "/home/mgorny/pkgcore-venv/lib/python2.7/site-packages/pkgcore/operations/regen.py", line 37, in regen_repository
 
- 161
    regen_iter(iter(repo), _get_repo_helper(), observer)
+            160
    regen_iter(iter(repo), _get_repo_helper(), observer)
 
- 162
  File "/home/mgorny/pkgcore-venv/lib/python2.7/site-packages/pkgcore/operations/regen.py", line 15, in regen_iter
+            161
  File "/home/mgorny/pkgcore-venv/lib/python2.7/site-packages/pkgcore/operations/regen.py", line 15, in regen_iter
 
- 163
    regen_func(x)
+            162
    regen_func(x)
 
- 164
  File "/home/mgorny/pkgcore-venv/lib/python2.7/site-packages/pkgcore/ebuild/repository.py", line 521, in __call__
+            163
  File "/home/mgorny/pkgcore-venv/lib/python2.7/site-packages/pkgcore/ebuild/repository.py", line 521, in __call__
 
- 165
    return pkg._fetch_metadata(ebp=self.ebp, force_regen=self.force)
+            164
    return pkg._fetch_metadata(ebp=self.ebp, force_regen=self.force)
 
- 166
  File "/home/mgorny/pkgcore-venv/lib/python2.7/site-packages/pkgcore/ebuild/ebuild_src.py", line 277, in _fetch_metadata
+            165
  File "/home/mgorny/pkgcore-venv/lib/python2.7/site-packages/pkgcore/ebuild/ebuild_src.py", line 277, in _fetch_metadata
 
- 167
    return self._parent._get_metadata(self, ebp=ebp, force_regen=force_regen)
+            166
    return self._parent._get_metadata(self, ebp=ebp, force_regen=force_regen)
 
- 168
  File "/home/mgorny/pkgcore-venv/lib/python2.7/site-packages/pkgcore/ebuild/ebuild_src.py", line 367, in _get_metadata
+            167
  File "/home/mgorny/pkgcore-venv/lib/python2.7/site-packages/pkgcore/ebuild/ebuild_src.py", line 367, in _get_metadata
 
- 169
    return self._update_metadata(pkg, ebp=ebp)
+            168
    return self._update_metadata(pkg, ebp=ebp)
 
- 170
  File "/home/mgorny/pkgcore-venv/lib/python2.7/site-packages/pkgcore/ebuild/ebuild_src.py", line 375, in _update_metadata
+            169
  File "/home/mgorny/pkgcore-venv/lib/python2.7/site-packages/pkgcore/ebuild/ebuild_src.py", line 375, in _update_metadata
 
- 171
    mydata = my_proc.get_keys(pkg, self._ecache)
+            170
    mydata = my_proc.get_keys(pkg, self._ecache)
 
- 172
  File "/home/mgorny/pkgcore-venv/lib/python2.7/site-packages/pkgcore/ebuild/processor.py", line 788, in get_keys
+            171
  File "/home/mgorny/pkgcore-venv/lib/python2.7/site-packages/pkgcore/ebuild/processor.py", line 788, in get_keys
 
- 173
    {"key": receive_key})
+            172
    {"key": receive_key})
 
- 174
  File "/home/mgorny/pkgcore-venv/lib/python2.7/site-packages/pkgcore/ebuild/processor.py", line 721, in _run_depend_like_phase
+            173
  File "/home/mgorny/pkgcore-venv/lib/python2.7/site-packages/pkgcore/ebuild/processor.py", line 721, in _run_depend_like_phase
 
- 175
    self.write("%s %i\n%s" % (command, len(data), data), append_newline=False)
+            174
    self.write("%s %i\n%s" % (command, len(data), data), append_newline=False)
 
- 176
  File "/home/mgorny/pkgcore-venv/lib/python2.7/site-packages/pkgcore/ebuild/processor.py", line 419, in write
+            175
  File "/home/mgorny/pkgcore-venv/lib/python2.7/site-packages/pkgcore/ebuild/processor.py", line 419, in write
 
- 177
    raise RuntimeError(ie)
+            176
    raise RuntimeError(ie)
 
- 178
RuntimeError: [Errno 32] Broken pipe
+            177
RuntimeError: [Errno 32] Broken pipe
 
- 179
 * Cache regen failed with 1
+            178
 * Cache regen failed with 1
 
diff --git a/luke-jr.txt b/luke-jr.txt index 792504c05264..d9509b82f75f 100644 --- a/luke-jr.txt +++ b/luke-jr.txt @@ -143,7 +143,6 @@ ERROR pkgcore: returned val from gen_metadata was 'False' !!! caught exception False while processing ebuild src: net-im/psi-9999 ERROR pkgcore: returned val from gen_metadata was 'False' !!! caught exception False while processing ebuild src: net-im/psi-9999_pre20150515 -!!! caught exception ("Expected command; instead got nothing from ''", None) while processing ebuild src: media-libs/glew-1.5.8 Traceback (most recent call last): File "/home/mgorny/pkgcore-venv/bin/pmaint", line 4, in scripts.main(basename(__file__)) diff --git a/n4g.html b/n4g.html index e7a05a36941a..ab81bdf50efb 100644 --- a/n4g.html +++ b/n4g.html @@ -142,7 +142,7 @@
[FATAL] 66
ERROR pkgcore: returned val from gen_metadata was 'False'
 
- 67
caught exception '%s' while processing '%s'(MetadataException('Metadata Exception: pkg ebuild src: app-admin/oessysmon-0.1.7-r1, attr description\nerror: Metadata Exception: pkg ebuild src: app-admin/oessysmon-0.1.7-r1, attr data\nerror: False',), <<class 'pkgcore.ebuild.ebuild_src.package'> cpv='app-admin/oessysmon-0.1.7-r1' @0x7f4caa579550>)
+            67
caught exception '%s' while processing '%s'(MetadataException('Metadata Exception: pkg ebuild src: app-admin/oessysmon-0.1.7-r1, attr description\nerror: Metadata Exception: pkg ebuild src: app-admin/oessysmon-0.1.7-r1, attr data\nerror: False',), <<class 'pkgcore.ebuild.ebuild_src.package'> cpv='app-admin/oessysmon-0.1.7-r1' @0x7fb8fe183550>)
 
[FATAL] 68
 * Cache regen failed with 1
 
diff --git a/n4g.txt b/n4g.txt index 98f13ee8c942..773d705e12a4 100644 --- a/n4g.txt +++ b/n4g.txt @@ -64,5 +64,5 @@ WARNING:pkgcore:repository at '/home/mgorny/repos/steveeJ' has unsupported profi ERROR pkgcore: returned val from gen_metadata was 'False' !!! caught exception False while processing ebuild src: app-admin/oessysmon-0.1.7-r1 ERROR pkgcore: returned val from gen_metadata was 'False' -caught exception '%s' while processing '%s'(MetadataException('Metadata Exception: pkg ebuild src: app-admin/oessysmon-0.1.7-r1, attr description\nerror: Metadata Exception: pkg ebuild src: app-admin/oessysmon-0.1.7-r1, attr data\nerror: False',), < cpv='app-admin/oessysmon-0.1.7-r1' @0x7f4caa579550>) +caught exception '%s' while processing '%s'(MetadataException('Metadata Exception: pkg ebuild src: app-admin/oessysmon-0.1.7-r1, attr description\nerror: Metadata Exception: pkg ebuild src: app-admin/oessysmon-0.1.7-r1, attr data\nerror: False',), < cpv='app-admin/oessysmon-0.1.7-r1' @0x7fb8fe183550>) * Cache regen failed with 1 diff --git a/n8x0.html b/n8x0.html index 8aa67ab8c053..9f7f9fb15833 100644 --- a/n8x0.html +++ b/n8x0.html @@ -304,15 +304,15 @@
[FATAL] 147
ERROR pkgcore: returned val from gen_metadata was 'False'
 
- 148
caught exception '%s' while processing '%s'(MetadataException('Metadata Exception: pkg ebuild src: app-accessibility/florence-0.5.1, attr description\nerror: Metadata Exception: pkg ebuild src: app-accessibility/florence-0.5.1, attr data\nerror: False',), <<class 'pkgcore.ebuild.ebuild_src.package'> cpv='app-accessibility/florence-0.5.1' @0x7f92f44ec190>)
+            148
caught exception '%s' while processing '%s'(MetadataException('Metadata Exception: pkg ebuild src: app-accessibility/florence-0.5.1, attr description\nerror: Metadata Exception: pkg ebuild src: app-accessibility/florence-0.5.1, attr data\nerror: False',), <<class 'pkgcore.ebuild.ebuild_src.package'> cpv='app-accessibility/florence-0.5.1' @0x7fdc1048a190>)
 
[FATAL] 149
ERROR pkgcore: returned val from gen_metadata was 'False'
 
- 150
caught exception '%s' while processing '%s'(MetadataException('Metadata Exception: pkg ebuild src: sys-apps/fb_text2screen-0.1.1, attr description\nerror: Metadata Exception: pkg ebuild src: sys-apps/fb_text2screen-0.1.1, attr data\nerror: False',), <<class 'pkgcore.ebuild.ebuild_src.package'> cpv='sys-apps/fb_text2screen-0.1.1' @0x7f92f44ec7d0>)
+            150
caught exception '%s' while processing '%s'(MetadataException('Metadata Exception: pkg ebuild src: sys-apps/fb_text2screen-0.1.1, attr description\nerror: Metadata Exception: pkg ebuild src: sys-apps/fb_text2screen-0.1.1, attr data\nerror: False',), <<class 'pkgcore.ebuild.ebuild_src.package'> cpv='sys-apps/fb_text2screen-0.1.1' @0x7fdc1048a7d0>)
 
[FATAL] 151
ERROR pkgcore: returned val from gen_metadata was 'False'
 
- 152
caught exception '%s' while processing '%s'(MetadataException('Metadata Exception: pkg ebuild src: sys-apps/opendsme-0.2, attr description\nerror: Metadata Exception: pkg ebuild src: sys-apps/opendsme-0.2, attr data\nerror: False',), <<class 'pkgcore.ebuild.ebuild_src.package'> cpv='sys-apps/opendsme-0.2' @0x7f92f44f1190>)
+            152
caught exception '%s' while processing '%s'(MetadataException('Metadata Exception: pkg ebuild src: sys-apps/opendsme-0.2, attr description\nerror: Metadata Exception: pkg ebuild src: sys-apps/opendsme-0.2, attr data\nerror: False',), <<class 'pkgcore.ebuild.ebuild_src.package'> cpv='sys-apps/opendsme-0.2' @0x7fdc1048f190>)
 
[FATAL] 153
 * Cache regen failed with 1
 
diff --git a/n8x0.txt b/n8x0.txt index 80ef35406ad1..4dc357ea4259 100644 --- a/n8x0.txt +++ b/n8x0.txt @@ -145,9 +145,9 @@ ERROR pkgcore: returned val from gen_metadata was 'False' ERROR pkgcore: returned val from gen_metadata was 'False' !!! caught exception False while processing ebuild src: sys-apps/opendsme-0.2 ERROR pkgcore: returned val from gen_metadata was 'False' -caught exception '%s' while processing '%s'(MetadataException('Metadata Exception: pkg ebuild src: app-accessibility/florence-0.5.1, attr description\nerror: Metadata Exception: pkg ebuild src: app-accessibility/florence-0.5.1, attr data\nerror: False',), < cpv='app-accessibility/florence-0.5.1' @0x7f92f44ec190>) +caught exception '%s' while processing '%s'(MetadataException('Metadata Exception: pkg ebuild src: app-accessibility/florence-0.5.1, attr description\nerror: Metadata Exception: pkg ebuild src: app-accessibility/florence-0.5.1, attr data\nerror: False',), < cpv='app-accessibility/florence-0.5.1' @0x7fdc1048a190>) ERROR pkgcore: returned val from gen_metadata was 'False' -caught exception '%s' while processing '%s'(MetadataException('Metadata Exception: pkg ebuild src: sys-apps/fb_text2screen-0.1.1, attr description\nerror: Metadata Exception: pkg ebuild src: sys-apps/fb_text2screen-0.1.1, attr data\nerror: False',), < cpv='sys-apps/fb_text2screen-0.1.1' @0x7f92f44ec7d0>) +caught exception '%s' while processing '%s'(MetadataException('Metadata Exception: pkg ebuild src: sys-apps/fb_text2screen-0.1.1, attr description\nerror: Metadata Exception: pkg ebuild src: sys-apps/fb_text2screen-0.1.1, attr data\nerror: False',), < cpv='sys-apps/fb_text2screen-0.1.1' @0x7fdc1048a7d0>) ERROR pkgcore: returned val from gen_metadata was 'False' -caught exception '%s' while processing '%s'(MetadataException('Metadata Exception: pkg ebuild src: sys-apps/opendsme-0.2, attr description\nerror: Metadata Exception: pkg ebuild src: sys-apps/opendsme-0.2, attr data\nerror: False',), < cpv='sys-apps/opendsme-0.2' @0x7f92f44f1190>) +caught exception '%s' while processing '%s'(MetadataException('Metadata Exception: pkg ebuild src: sys-apps/opendsme-0.2, attr description\nerror: Metadata Exception: pkg ebuild src: sys-apps/opendsme-0.2, attr data\nerror: False',), < cpv='sys-apps/opendsme-0.2' @0x7fdc1048f190>) * Cache regen failed with 1 diff --git a/n900.html b/n900.html index 462b47220b63..b53a3b40afbd 100644 --- a/n900.html +++ b/n900.html @@ -128,71 +128,73 @@
59
!!! caught exception False while processing ebuild src: net-misc/phonet-utils-9999
 
[FATAL] - 60
Traceback (most recent call last):
+            60
!!! caught exception ("Expected command; instead got nothing from ''", None) while processing ebuild src: media-video/omap3camera-firmware-9999
+
[FATAL] + 61
Traceback (most recent call last):
 
- 61
  File "/home/mgorny/pkgcore-venv/bin/pmaint", line 4, in <module>
+            62
  File "/home/mgorny/pkgcore-venv/bin/pmaint", line 4, in <module>
 
- 62
    scripts.main(basename(__file__))
+            63
    scripts.main(basename(__file__))
 
- 63
  File "/home/mgorny/pkgcore-venv/lib/python2.7/site-packages/pkgcore/scripts/__init__.py", line 40, in main
+            64
  File "/home/mgorny/pkgcore-venv/lib/python2.7/site-packages/pkgcore/scripts/__init__.py", line 40, in main
 
- 64
    commandline.main(argparser)
+            65
    commandline.main(argparser)
 
- 65
  File "/home/mgorny/pkgcore-venv/lib/python2.7/site-packages/pkgcore/util/commandline.py", line 969, in main
+            66
  File "/home/mgorny/pkgcore-venv/lib/python2.7/site-packages/pkgcore/util/commandline.py", line 969, in main
 
- 66
    exitstatus = main_func(options, out, err)
+            67
    exitstatus = main_func(options, out, err)
 
- 67
  File "/home/mgorny/pkgcore-venv/lib/python2.7/site-packages/pkgcore/scripts/pmaint.py", line 283, in regen_main
+            68
  File "/home/mgorny/pkgcore-venv/lib/python2.7/site-packages/pkgcore/scripts/pmaint.py", line 283, in regen_main
 
- 68
    eclass_caching=(not options.disable_eclass_caching))
+            69
    eclass_caching=(not options.disable_eclass_caching))
 
- 69
  File "/home/mgorny/pkgcore-venv/lib/python2.7/site-packages/pkgcore/operations/__init__.py", line 68, in _recast_exception_decorator
+            70
  File "/home/mgorny/pkgcore-venv/lib/python2.7/site-packages/pkgcore/operations/__init__.py", line 68, in _recast_exception_decorator
 
- 70
    return functor(*args, **kwds)
+            71
    return functor(*args, **kwds)
 
- 71
  File "/home/mgorny/pkgcore-venv/lib/python2.7/site-packages/pkgcore/operations/repo.py", line 247, in _cmd_api_regen_cache
+            72
  File "/home/mgorny/pkgcore-venv/lib/python2.7/site-packages/pkgcore/operations/repo.py", line 247, in _cmd_api_regen_cache
 
- 72
    self._get_observer(observer), threads=threads, **options)
+            73
    self._get_observer(observer), threads=threads, **options)
 
- 73
  File "/home/mgorny/pkgcore-venv/lib/python2.7/site-packages/pkgcore/operations/regen.py", line 37, in regen_repository
+            74
  File "/home/mgorny/pkgcore-venv/lib/python2.7/site-packages/pkgcore/operations/regen.py", line 37, in regen_repository
 
- 74
    regen_iter(iter(repo), _get_repo_helper(), observer)
+            75
    regen_iter(iter(repo), _get_repo_helper(), observer)
 
- 75
  File "/home/mgorny/pkgcore-venv/lib/python2.7/site-packages/pkgcore/operations/regen.py", line 15, in regen_iter
+            76
  File "/home/mgorny/pkgcore-venv/lib/python2.7/site-packages/pkgcore/operations/regen.py", line 15, in regen_iter
 
- 76
    regen_func(x)
+            77
    regen_func(x)
 
- 77
  File "/home/mgorny/pkgcore-venv/lib/python2.7/site-packages/pkgcore/ebuild/repository.py", line 521, in __call__
+            78
  File "/home/mgorny/pkgcore-venv/lib/python2.7/site-packages/pkgcore/ebuild/repository.py", line 521, in __call__
 
- 78
    return pkg._fetch_metadata(ebp=self.ebp, force_regen=self.force)
+            79
    return pkg._fetch_metadata(ebp=self.ebp, force_regen=self.force)
 
- 79
  File "/home/mgorny/pkgcore-venv/lib/python2.7/site-packages/pkgcore/ebuild/ebuild_src.py", line 277, in _fetch_metadata
+            80
  File "/home/mgorny/pkgcore-venv/lib/python2.7/site-packages/pkgcore/ebuild/ebuild_src.py", line 277, in _fetch_metadata
 
- 80
    return self._parent._get_metadata(self, ebp=ebp, force_regen=force_regen)
+            81
    return self._parent._get_metadata(self, ebp=ebp, force_regen=force_regen)
 
- 81
  File "/home/mgorny/pkgcore-venv/lib/python2.7/site-packages/pkgcore/ebuild/ebuild_src.py", line 367, in _get_metadata
+            82
  File "/home/mgorny/pkgcore-venv/lib/python2.7/site-packages/pkgcore/ebuild/ebuild_src.py", line 367, in _get_metadata
 
- 82
    return self._update_metadata(pkg, ebp=ebp)
+            83
    return self._update_metadata(pkg, ebp=ebp)
 
- 83
  File "/home/mgorny/pkgcore-venv/lib/python2.7/site-packages/pkgcore/ebuild/ebuild_src.py", line 375, in _update_metadata
+            84
  File "/home/mgorny/pkgcore-venv/lib/python2.7/site-packages/pkgcore/ebuild/ebuild_src.py", line 375, in _update_metadata
 
- 84
    mydata = my_proc.get_keys(pkg, self._ecache)
+            85
    mydata = my_proc.get_keys(pkg, self._ecache)
 
- 85
  File "/home/mgorny/pkgcore-venv/lib/python2.7/site-packages/pkgcore/ebuild/processor.py", line 788, in get_keys
+            86
  File "/home/mgorny/pkgcore-venv/lib/python2.7/site-packages/pkgcore/ebuild/processor.py", line 788, in get_keys
 
- 86
    {"key": receive_key})
+            87
    {"key": receive_key})
 
- 87
  File "/home/mgorny/pkgcore-venv/lib/python2.7/site-packages/pkgcore/ebuild/processor.py", line 721, in _run_depend_like_phase
+            88
  File "/home/mgorny/pkgcore-venv/lib/python2.7/site-packages/pkgcore/ebuild/processor.py", line 721, in _run_depend_like_phase
 
- 88
    self.write("%s %i\n%s" % (command, len(data), data), append_newline=False)
+            89
    self.write("%s %i\n%s" % (command, len(data), data), append_newline=False)
 
- 89
  File "/home/mgorny/pkgcore-venv/lib/python2.7/site-packages/pkgcore/ebuild/processor.py", line 419, in write
+            90
  File "/home/mgorny/pkgcore-venv/lib/python2.7/site-packages/pkgcore/ebuild/processor.py", line 419, in write
 
- 90
    raise RuntimeError(ie)
+            91
    raise RuntimeError(ie)
 
- 91
RuntimeError: [Errno 32] Broken pipe
+            92
RuntimeError: [Errno 32] Broken pipe
 
- 92
 * Cache regen failed with 1
+            93
 * Cache regen failed with 1
 
diff --git a/n900.txt b/n900.txt index 8fd1bff82857..16c4260465d4 100644 --- a/n900.txt +++ b/n900.txt @@ -57,6 +57,7 @@ ERROR pkgcore: returned val from gen_metadata was 'False' !!! caught exception False while processing ebuild src: net-misc/ofono-1.0-r1 ERROR pkgcore: returned val from gen_metadata was 'False' !!! caught exception False while processing ebuild src: net-misc/phonet-utils-9999 +!!! caught exception ("Expected command; instead got nothing from ''", None) while processing ebuild src: media-video/omap3camera-firmware-9999 Traceback (most recent call last): File "/home/mgorny/pkgcore-venv/bin/pmaint", line 4, in scripts.main(basename(__file__)) diff --git a/o11c.html b/o11c.html index 6fdba162f8b4..f6c87c645a23 100644 --- a/o11c.html +++ b/o11c.html @@ -148,7 +148,7 @@
[FATAL] 69
ERROR pkgcore: returned val from gen_metadata was 'False'
 
- 70
caught exception '%s' while processing '%s'(MetadataException('Metadata Exception: pkg ebuild src: dev-python/attoconf-9999, attr description\nerror: Metadata Exception: pkg ebuild src: dev-python/attoconf-9999, attr data\nerror: False',), <<class 'pkgcore.ebuild.ebuild_src.package'> cpv='dev-python/attoconf-9999' @0x7f335a124b90>)
+            70
caught exception '%s' while processing '%s'(MetadataException('Metadata Exception: pkg ebuild src: dev-python/attoconf-9999, attr description\nerror: Metadata Exception: pkg ebuild src: dev-python/attoconf-9999, attr data\nerror: False',), <<class 'pkgcore.ebuild.ebuild_src.package'> cpv='dev-python/attoconf-9999' @0x7f53b3ae9b90>)
 
[FATAL] 71
 * Cache regen failed with 1
 
diff --git a/o11c.txt b/o11c.txt index 179b4703806a..2a5144adef3c 100644 --- a/o11c.txt +++ b/o11c.txt @@ -67,5 +67,5 @@ WARNING:pkgcore:repository at '/home/mgorny/repos/steveeJ' has unsupported profi ERROR pkgcore: returned val from gen_metadata was 'False' !!! caught exception False while processing ebuild src: dev-python/attoconf-9999 ERROR pkgcore: returned val from gen_metadata was 'False' -caught exception '%s' while processing '%s'(MetadataException('Metadata Exception: pkg ebuild src: dev-python/attoconf-9999, attr description\nerror: Metadata Exception: pkg ebuild src: dev-python/attoconf-9999, attr data\nerror: False',), < cpv='dev-python/attoconf-9999' @0x7f335a124b90>) +caught exception '%s' while processing '%s'(MetadataException('Metadata Exception: pkg ebuild src: dev-python/attoconf-9999, attr description\nerror: Metadata Exception: pkg ebuild src: dev-python/attoconf-9999, attr data\nerror: False',), < cpv='dev-python/attoconf-9999' @0x7f53b3ae9b90>) * Cache regen failed with 1 diff --git a/quantumsummers.html b/quantumsummers.html index 4d5872fce171..d140d73164a3 100644 --- a/quantumsummers.html +++ b/quantumsummers.html @@ -128,13 +128,13 @@
59
 
- 60
sandbox:stop  caught signal 15 in pid 19990
+            60
sandbox:stop  caught signal 15 in pid 19799
 
61
Sandboxed process killed by signal: Terminated
 
62
!!! caught exception inherit requires an unknown eclass, git cannot be found while processing ebuild src: dev-python/starcluster-9999
 
[FATAL] - 63
caught exception '%s' while processing '%s'(MetadataException('Metadata Exception: pkg ebuild src: dev-python/starcluster-9999, attr description\nerror: Metadata Exception: pkg ebuild src: dev-python/starcluster-9999, attr data\nerror: inherit requires an unknown eclass, git cannot be found',), <<class 'pkgcore.ebuild.ebuild_src.package'> cpv='dev-python/starcluster-9999' @0x7fec0d779690>)
+            63
caught exception '%s' while processing '%s'(MetadataException('Metadata Exception: pkg ebuild src: dev-python/starcluster-9999, attr description\nerror: Metadata Exception: pkg ebuild src: dev-python/starcluster-9999, attr data\nerror: inherit requires an unknown eclass, git cannot be found',), <<class 'pkgcore.ebuild.ebuild_src.package'> cpv='dev-python/starcluster-9999' @0x7f869a780690>)
 
[FATAL] 64
 * Cache regen failed with 1
 
diff --git a/quantumsummers.txt b/quantumsummers.txt index 60ae7e23f405..fde28b4c4c05 100644 --- a/quantumsummers.txt +++ b/quantumsummers.txt @@ -57,8 +57,8 @@ Sandboxed process killed by signal: Broken pipe !!! The die message: !!! inherit for git failed -sandbox:stop caught signal 15 in pid 19990 +sandbox:stop caught signal 15 in pid 19799 Sandboxed process killed by signal: Terminated !!! caught exception inherit requires an unknown eclass, git cannot be found while processing ebuild src: dev-python/starcluster-9999 -caught exception '%s' while processing '%s'(MetadataException('Metadata Exception: pkg ebuild src: dev-python/starcluster-9999, attr description\nerror: Metadata Exception: pkg ebuild src: dev-python/starcluster-9999, attr data\nerror: inherit requires an unknown eclass, git cannot be found',), < cpv='dev-python/starcluster-9999' @0x7fec0d779690>) +caught exception '%s' while processing '%s'(MetadataException('Metadata Exception: pkg ebuild src: dev-python/starcluster-9999, attr description\nerror: Metadata Exception: pkg ebuild src: dev-python/starcluster-9999, attr data\nerror: inherit requires an unknown eclass, git cannot be found',), < cpv='dev-python/starcluster-9999' @0x7f869a780690>) * Cache regen failed with 1 diff --git a/rainyday.html b/rainyday.html index 3c42ef9c7942..4d7fca46e6e2 100644 --- a/rainyday.html +++ b/rainyday.html @@ -1152,7 +1152,7 @@
[FATAL] 571
ERROR pkgcore: returned val from gen_metadata was 'False'
 
- 572
caught exception '%s' while processing '%s'(MetadataException('Metadata Exception: pkg ebuild src: x11-libs/compizconfig-backend-kconfig4-0.8.4, attr description\nerror: Metadata Exception: pkg ebuild src: x11-libs/compizconfig-backend-kconfig4-0.8.4, attr data\nerror: False',), <<class 'pkgcore.ebuild.ebuild_src.package'> cpv='x11-libs/compizconfig-backend-kconfig4-0.8.4' @0x7f7193384190>)
+            572
caught exception '%s' while processing '%s'(MetadataException('Metadata Exception: pkg ebuild src: x11-libs/compizconfig-backend-kconfig4-0.8.4, attr description\nerror: Metadata Exception: pkg ebuild src: x11-libs/compizconfig-backend-kconfig4-0.8.4, attr data\nerror: False',), <<class 'pkgcore.ebuild.ebuild_src.package'> cpv='x11-libs/compizconfig-backend-kconfig4-0.8.4' @0x7fb777c6a190>)
 
[FATAL] 573
ERROR pkgcore: returned val from gen_metadata was 'False'
 
@@ -1544,43 +1544,43 @@
767
 
- 768
ass 'pkgcore.ebuild.ebuild_src.package'> cpv='x11-libs/compizconfig-backend-kconfig4-0.8.8' @0x7f7193384e10>)
+            768
ass 'pkgcore.ebuild.ebuild_src.package'> cpv='x11-libs/compizconfig-backend-kconfig4-0.8.8' @0x7fb777c6ae10>)
 
769
ERROR pkgcore: returned val from gen_metadata was 'False'
 
- 770
caught exception '%s' while processing '%s'(MetadataException('Metadata Exception: pkg ebuild src: app-pda/libopensync-plugin-kdepim-0.35, attr description\nerror: Metadata Exception: pkg ebuild src: app-pda/libopensync-plugin-kdepim-0.35, attr data\nerror: False',), <<class 'pkgcore.ebuild.ebuild_src.package'> cpv='app-pda/libopensync-plugin-kdepim-0.35' @0x7f7192e4f7d0>)
+            770
caught exception '%s' while processing '%s'(MetadataException('Metadata Exception: pkg ebuild src: app-pda/libopensync-plugin-kdepim-0.35, attr description\nerror: Metadata Exception: pkg ebuild src: app-pda/libopensync-plugin-kdepim-0.35, attr data\nerror: False',), <<class 'pkgcore.ebuild.ebuild_src.package'> cpv='app-pda/libopensync-plugin-kdepim-0.35' @0x7fb7777357d0>)
 
[FATAL] 771
ERROR pkgcore: returned val from gen_metadata was 'False'
 
- 772
caught exception '%s' while processing '%s'(MetadataException('Metadata Exception: pkg ebuild src: app-pda/libopensync-plugin-kdepim-0.36, attr description\nerror: Metadata Exception: pkg ebuild src: app-pda/libopensync-plugin-kdepim-0.36, attr data\nerror: False',), <<class 'pkgcore.ebuild.ebuild_src.package'> cpv='app-pda/libopensync-plugin-kdepim-0.36' @0x7f7193384e10>)
+            772
caught exception '%s' while processing '%s'(MetadataException('Metadata Exception: pkg ebuild src: app-pda/libopensync-plugin-kdepim-0.36, attr description\nerror: Metadata Exception: pkg ebuild src: app-pda/libopensync-plugin-kdepim-0.36, attr data\nerror: False',), <<class 'pkgcore.ebuild.ebuild_src.package'> cpv='app-pda/libopensync-plugin-kdepim-0.36' @0x7fb777c6ae10>)
 
[FATAL] 773
ERROR pkgcore: returned val from gen_metadata was 'False'
 
- 774
caught exception '%s' while processing '%s'(MetadataException('Metadata Exception: pkg ebuild src: app-pda/libopensync-plugin-kdepim-9999, attr description\nerror: Metadata Exception: pkg ebuild src: app-pda/libopensync-plugin-kdepim-9999, attr data\nerror: False',), <<class 'pkgcore.ebuild.ebuild_src.package'> cpv='app-pda/libopensync-plugin-kdepim-9999' @0x7f7192e4f7d0>)
+            774
caught exception '%s' while processing '%s'(MetadataException('Metadata Exception: pkg ebuild src: app-pda/libopensync-plugin-kdepim-9999, attr description\nerror: Metadata Exception: pkg ebuild src: app-pda/libopensync-plugin-kdepim-9999, attr data\nerror: False',), <<class 'pkgcore.ebuild.ebuild_src.package'> cpv='app-pda/libopensync-plugin-kdepim-9999' @0x7fb7777357d0>)
 
[FATAL] 775
ERROR pkgcore: returned val from gen_metadata was 'False'
 
- 776
caught exception '%s' while processing '%s'(MetadataException('Metadata Exception: pkg ebuild src: x11-wm/metacity-2.30.3, attr description\nerror: Metadata Exception: pkg ebuild src: x11-wm/metacity-2.30.3, attr data\nerror: False',), <<class 'pkgcore.ebuild.ebuild_src.package'> cpv='x11-wm/metacity-2.30.3' @0x7f719288e190>)
+            776
caught exception '%s' while processing '%s'(MetadataException('Metadata Exception: pkg ebuild src: x11-wm/metacity-2.30.3, attr description\nerror: Metadata Exception: pkg ebuild src: x11-wm/metacity-2.30.3, attr data\nerror: False',), <<class 'pkgcore.ebuild.ebuild_src.package'> cpv='x11-wm/metacity-2.30.3' @0x7fb777174190>)
 
[FATAL] 777
ERROR pkgcore: returned val from gen_metadata was 'False'
 
- 778
caught exception '%s' while processing '%s'(MetadataException('Metadata Exception: pkg ebuild src: dev-perl/DCOP-Amarok-Player-0.036, attr description\nerror: Metadata Exception: pkg ebuild src: dev-perl/DCOP-Amarok-Player-0.036, attr data\nerror: False',), <<class 'pkgcore.ebuild.ebuild_src.package'> cpv='dev-perl/DCOP-Amarok-Player-0.036' @0x7f71928a8a50>)
+            778
caught exception '%s' while processing '%s'(MetadataException('Metadata Exception: pkg ebuild src: dev-perl/DCOP-Amarok-Player-0.036, attr description\nerror: Metadata Exception: pkg ebuild src: dev-perl/DCOP-Amarok-Player-0.036, attr data\nerror: False',), <<class 'pkgcore.ebuild.ebuild_src.package'> cpv='dev-perl/DCOP-Amarok-Player-0.036' @0x7fb77718ea50>)
 
[FATAL] 779
ERROR pkgcore: returned val from gen_metadata was 'False'
 
- 780
caught exception '%s' while processing '%s'(MetadataException('Metadata Exception: pkg ebuild src: dev-perl/DCOP-Amarok-Player-0.037, attr description\nerror: Metadata Exception: pkg ebuild src: dev-perl/DCOP-Amarok-Player-0.037, attr data\nerror: False',), <<class 'pkgcore.ebuild.ebuild_src.package'> cpv='dev-perl/DCOP-Amarok-Player-0.037' @0x7f719288e190>)
+            780
caught exception '%s' while processing '%s'(MetadataException('Metadata Exception: pkg ebuild src: dev-perl/DCOP-Amarok-Player-0.037, attr description\nerror: Metadata Exception: pkg ebuild src: dev-perl/DCOP-Amarok-Player-0.037, attr data\nerror: False',), <<class 'pkgcore.ebuild.ebuild_src.package'> cpv='dev-perl/DCOP-Amarok-Player-0.037' @0x7fb777174190>)
 
[FATAL] 781
ERROR pkgcore: returned val from gen_metadata was 'False'
 
- 782
caught exception '%s' while processing '%s'(MetadataException('Metadata Exception: pkg ebuild src: dev-perl/DCOP-Amarok-0.035, attr description\nerror: Metadata Exception: pkg ebuild src: dev-perl/DCOP-Amarok-0.035, attr data\nerror: False',), <<class 'pkgcore.ebuild.ebuild_src.package'> cpv='dev-perl/DCOP-Amarok-0.035' @0x7f71928a8a50>)
+            782
caught exception '%s' while processing '%s'(MetadataException('Metadata Exception: pkg ebuild src: dev-perl/DCOP-Amarok-0.035, attr description\nerror: Metadata Exception: pkg ebuild src: dev-perl/DCOP-Amarok-0.035, attr data\nerror: False',), <<class 'pkgcore.ebuild.ebuild_src.package'> cpv='dev-perl/DCOP-Amarok-0.035' @0x7fb77718ea50>)
 
[FATAL] 783
ERROR pkgcore: returned val from gen_metadata was 'False'
 
- 784
caught exception '%s' while processing '%s'(MetadataException('Metadata Exception: pkg ebuild src: dev-perl/DCOP-Amarok-0.036, attr description\nerror: Metadata Exception: pkg ebuild src: dev-perl/DCOP-Amarok-0.036, attr data\nerror: False',), <<class 'pkgcore.ebuild.ebuild_src.package'> cpv='dev-perl/DCOP-Amarok-0.036' @0x7f719288e190>)
+            784
caught exception '%s' while processing '%s'(MetadataException('Metadata Exception: pkg ebuild src: dev-perl/DCOP-Amarok-0.036, attr description\nerror: Metadata Exception: pkg ebuild src: dev-perl/DCOP-Amarok-0.036, attr data\nerror: False',), <<class 'pkgcore.ebuild.ebuild_src.package'> cpv='dev-perl/DCOP-Amarok-0.036' @0x7fb777174190>)
 
[FATAL] 785
ERROR pkgcore: returned val from gen_metadata was 'False'
 
- 786
caught exception '%s' while processing '%s'(MetadataException('Metadata Exception: pkg ebuild src: dev-perl/DCOP-0.036, attr description\nerror: Metadata Exception: pkg ebuild src: dev-perl/DCOP-0.036, attr data\nerror: False',), <<class 'pkgcore.ebuild.ebuild_src.package'> cpv='dev-perl/DCOP-0.036' @0x7f71928a8a50>)
+            786
caught exception '%s' while processing '%s'(MetadataException('Metadata Exception: pkg ebuild src: dev-perl/DCOP-0.036, attr description\nerror: Metadata Exception: pkg ebuild src: dev-perl/DCOP-0.036, attr data\nerror: False',), <<class 'pkgcore.ebuild.ebuild_src.package'> cpv='dev-perl/DCOP-0.036' @0x7fb77718ea50>)
 
[FATAL] 787
ERROR pkgcore: returned val from gen_metadata was 'False'
 
@@ -2026,51 +2026,51 @@
1008
 
- 1009
 <<class 'pkgcore.ebuild.ebuild_src.package'> cpv='dev-perl/DCOP-0.038' @0x7f719288e190>)
+            1009
 <<class 'pkgcore.ebuild.ebuild_src.package'> cpv='dev-perl/DCOP-0.038' @0x7fb777174190>)
 
1010
ERROR pkgcore: returned val from gen_metadata was 'False'
 
- 1011
caught exception '%s' while processing '%s'(MetadataException('Metadata Exception: pkg ebuild src: dev-perl/PerlQt-3.009_beta2, attr description\nerror: Metadata Exception: pkg ebuild src: dev-perl/PerlQt-3.009_beta2, attr data\nerror: False',), <<class 'pkgcore.ebuild.ebuild_src.package'> cpv='dev-perl/PerlQt-3.009_beta2' @0x7f71928a8a50>)
+            1011
caught exception '%s' while processing '%s'(MetadataException('Metadata Exception: pkg ebuild src: dev-perl/PerlQt-3.009_beta2, attr description\nerror: Metadata Exception: pkg ebuild src: dev-perl/PerlQt-3.009_beta2, attr data\nerror: False',), <<class 'pkgcore.ebuild.ebuild_src.package'> cpv='dev-perl/PerlQt-3.009_beta2' @0x7fb77718ea50>)
 
[FATAL] 1012
ERROR pkgcore: returned val from gen_metadata was 'False'
 
- 1013
caught exception '%s' while processing '%s'(MetadataException('Metadata Exception: pkg ebuild src: x11-themes/gtk-engines-qt-0.8-r4, attr description\nerror: Metadata Exception: pkg ebuild src: x11-themes/gtk-engines-qt-0.8-r4, attr data\nerror: False',), <<class 'pkgcore.ebuild.ebuild_src.package'> cpv='x11-themes/gtk-engines-qt-0.8-r4' @0x7f71927d6690>)
+            1013
caught exception '%s' while processing '%s'(MetadataException('Metadata Exception: pkg ebuild src: x11-themes/gtk-engines-qt-0.8-r4, attr description\nerror: Metadata Exception: pkg ebuild src: x11-themes/gtk-engines-qt-0.8-r4, attr data\nerror: False',), <<class 'pkgcore.ebuild.ebuild_src.package'> cpv='x11-themes/gtk-engines-qt-0.8-r4' @0x7fb7770bc690>)
 
[FATAL] 1014
ERROR pkgcore: returned val from gen_metadata was 'False'
 
- 1015
caught exception '%s' while processing '%s'(MetadataException('Metadata Exception: pkg ebuild src: x11-themes/qtcurve-0.59.2, attr description\nerror: Metadata Exception: pkg ebuild src: x11-themes/qtcurve-0.59.2, attr data\nerror: False',), <<class 'pkgcore.ebuild.ebuild_src.package'> cpv='x11-themes/qtcurve-0.59.2' @0x7f71927d6e10>)
+            1015
caught exception '%s' while processing '%s'(MetadataException('Metadata Exception: pkg ebuild src: x11-themes/qtcurve-0.59.2, attr description\nerror: Metadata Exception: pkg ebuild src: x11-themes/qtcurve-0.59.2, attr data\nerror: False',), <<class 'pkgcore.ebuild.ebuild_src.package'> cpv='x11-themes/qtcurve-0.59.2' @0x7fb7770bce10>)
 
[FATAL] 1016
ERROR pkgcore: returned val from gen_metadata was 'False'
 
- 1017
caught exception '%s' while processing '%s'(MetadataException('Metadata Exception: pkg ebuild src: x11-themes/qtcurve-0.59.5, attr description\nerror: Metadata Exception: pkg ebuild src: x11-themes/qtcurve-0.59.5, attr data\nerror: False',), <<class 'pkgcore.ebuild.ebuild_src.package'> cpv='x11-themes/qtcurve-0.59.5' @0x7f71927d6690>)
+            1017
caught exception '%s' while processing '%s'(MetadataException('Metadata Exception: pkg ebuild src: x11-themes/qtcurve-0.59.5, attr description\nerror: Metadata Exception: pkg ebuild src: x11-themes/qtcurve-0.59.5, attr data\nerror: False',), <<class 'pkgcore.ebuild.ebuild_src.package'> cpv='x11-themes/qtcurve-0.59.5' @0x7fb7770bc690>)
 
[FATAL] 1018
ERROR pkgcore: returned val from gen_metadata was 'False'
 
- 1019
caught exception '%s' while processing '%s'(MetadataException('Metadata Exception: pkg ebuild src: x11-themes/qtcurve-0.65.2, attr description\nerror: Metadata Exception: pkg ebuild src: x11-themes/qtcurve-0.65.2, attr data\nerror: False',), <<class 'pkgcore.ebuild.ebuild_src.package'> cpv='x11-themes/qtcurve-0.65.2' @0x7f71927d6e10>)
+            1019
caught exception '%s' while processing '%s'(MetadataException('Metadata Exception: pkg ebuild src: x11-themes/qtcurve-0.65.2, attr description\nerror: Metadata Exception: pkg ebuild src: x11-themes/qtcurve-0.65.2, attr data\nerror: False',), <<class 'pkgcore.ebuild.ebuild_src.package'> cpv='x11-themes/qtcurve-0.65.2' @0x7fb7770bce10>)
 
[FATAL] 1020
ERROR pkgcore: returned val from gen_metadata was 'False'
 
- 1021
caught exception '%s' while processing '%s'(MetadataException('Metadata Exception: pkg ebuild src: x11-themes/qtcurve-0.68.1, attr description\nerror: Metadata Exception: pkg ebuild src: x11-themes/qtcurve-0.68.1, attr data\nerror: False',), <<class 'pkgcore.ebuild.ebuild_src.package'> cpv='x11-themes/qtcurve-0.68.1' @0x7f71927d6690>)
+            1021
caught exception '%s' while processing '%s'(MetadataException('Metadata Exception: pkg ebuild src: x11-themes/qtcurve-0.68.1, attr description\nerror: Metadata Exception: pkg ebuild src: x11-themes/qtcurve-0.68.1, attr data\nerror: False',), <<class 'pkgcore.ebuild.ebuild_src.package'> cpv='x11-themes/qtcurve-0.68.1' @0x7fb7770bc690>)
 
[FATAL] 1022
ERROR pkgcore: returned val from gen_metadata was 'False'
 
- 1023
caught exception '%s' while processing '%s'(MetadataException('Metadata Exception: pkg ebuild src: x11-themes/qtcurve-0.69.1, attr description\nerror: Metadata Exception: pkg ebuild src: x11-themes/qtcurve-0.69.1, attr data\nerror: False',), <<class 'pkgcore.ebuild.ebuild_src.package'> cpv='x11-themes/qtcurve-0.69.1' @0x7f71927d6e10>)
+            1023
caught exception '%s' while processing '%s'(MetadataException('Metadata Exception: pkg ebuild src: x11-themes/qtcurve-0.69.1, attr description\nerror: Metadata Exception: pkg ebuild src: x11-themes/qtcurve-0.69.1, attr data\nerror: False',), <<class 'pkgcore.ebuild.ebuild_src.package'> cpv='x11-themes/qtcurve-0.69.1' @0x7fb7770bce10>)
 
[FATAL] 1024
ERROR pkgcore: returned val from gen_metadata was 'False'
 
- 1025
caught exception '%s' while processing '%s'(MetadataException('Metadata Exception: pkg ebuild src: net-misc/gwget-1.0.4-r1, attr description\nerror: Metadata Exception: pkg ebuild src: net-misc/gwget-1.0.4-r1, attr data\nerror: False',), <<class 'pkgcore.ebuild.ebuild_src.package'> cpv='net-misc/gwget-1.0.4-r1' @0x7f719278c410>)
+            1025
caught exception '%s' while processing '%s'(MetadataException('Metadata Exception: pkg ebuild src: net-misc/gwget-1.0.4-r1, attr description\nerror: Metadata Exception: pkg ebuild src: net-misc/gwget-1.0.4-r1, attr data\nerror: False',), <<class 'pkgcore.ebuild.ebuild_src.package'> cpv='net-misc/gwget-1.0.4-r1' @0x7fb777072410>)
 
[FATAL] 1026
ERROR pkgcore: returned val from gen_metadata was 'False'
 
- 1027
caught exception '%s' while processing '%s'(MetadataException('Metadata Exception: pkg ebuild src: media-video/asdf-0.4, attr description\nerror: Metadata Exception: pkg ebuild src: media-video/asdf-0.4, attr data\nerror: False',), <<class 'pkgcore.ebuild.ebuild_src.package'> cpv='media-video/asdf-0.4' @0x7f719279e690>)
+            1027
caught exception '%s' while processing '%s'(MetadataException('Metadata Exception: pkg ebuild src: media-video/asdf-0.4, attr description\nerror: Metadata Exception: pkg ebuild src: media-video/asdf-0.4, attr data\nerror: False',), <<class 'pkgcore.ebuild.ebuild_src.package'> cpv='media-video/asdf-0.4' @0x7fb777084690>)
 
[FATAL] 1028
ERROR pkgcore: returned val from gen_metadata was 'False'
 
- 1029
caught exception '%s' while processing '%s'(MetadataException('Metadata Exception: pkg ebuild src: media-video/dpencoder-0.6c, attr description\nerror: Metadata Exception: pkg ebuild src: media-video/dpencoder-0.6c, attr data\nerror: False',), <<class 'pkgcore.ebuild.ebuild_src.package'> cpv='media-video/dpencoder-0.6c' @0x7f719279eb90>)
+            1029
caught exception '%s' while processing '%s'(MetadataException('Metadata Exception: pkg ebuild src: media-video/dpencoder-0.6c, attr description\nerror: Metadata Exception: pkg ebuild src: media-video/dpencoder-0.6c, attr data\nerror: False',), <<class 'pkgcore.ebuild.ebuild_src.package'> cpv='media-video/dpencoder-0.6c' @0x7fb777084b90>)
 
[FATAL] 1030
ERROR pkgcore: returned val from gen_metadata was 'False'
 
- 1031
caught exception '%s' while processing '%s'(MetadataException('Metadata Exception: pkg ebuild src: kde-base/dcopperl-3.5.10, attr description\nerror: Metadata Exception: pkg ebuild src: kde-base/dcopperl-3.5.10, attr data\nerror: False',), <<class 'pkgcore.ebuild.ebuild_src.package'> cpv='kde-base/dcopperl-3.5.10' @0x7f7192748410>)
+            1031
caught exception '%s' while processing '%s'(MetadataException('Metadata Exception: pkg ebuild src: kde-base/dcopperl-3.5.10, attr description\nerror: Metadata Exception: pkg ebuild src: kde-base/dcopperl-3.5.10, attr data\nerror: False',), <<class 'pkgcore.ebuild.ebuild_src.package'> cpv='kde-base/dcopperl-3.5.10' @0x7fb77702e410>)
 
[FATAL] 1032
 * Cache regen failed with 1
 
diff --git a/rainyday.txt b/rainyday.txt index 42f0fd71658f..2b7c4f45d84c 100644 --- a/rainyday.txt +++ b/rainyday.txt @@ -569,7 +569,7 @@ ERROR pkgcore: returned val from gen_metadata was 'False' ERROR pkgcore: returned val from gen_metadata was 'False' !!! caught exception False while processing ebuild src: kde-base/dcopperl-3.5.10 ERROR pkgcore: returned val from gen_metadata was 'False' -caught exception '%s' while processing '%s'(MetadataException('Metadata Exception: pkg ebuild src: x11-libs/compizconfig-backend-kconfig4-0.8.4, attr description\nerror: Metadata Exception: pkg ebuild src: x11-libs/compizconfig-backend-kconfig4-0.8.4, attr data\nerror: False',), < cpv='x11-libs/compizconfig-backend-kconfig4-0.8.4' @0x7f7193384190>) +caught exception '%s' while processing '%s'(MetadataException('Metadata Exception: pkg ebuild src: x11-libs/compizconfig-backend-kconfig4-0.8.4, attr description\nerror: Metadata Exception: pkg ebuild src: x11-libs/compizconfig-backend-kconfig4-0.8.4, attr data\nerror: False',), < cpv='x11-libs/compizconfig-backend-kconfig4-0.8.4' @0x7fb777c6a190>) ERROR pkgcore: returned val from gen_metadata was 'False' caught exception '%s' while processing '%s'(MetadataException('Metadata Exception: pkg ebuild src: x11-libs/compizconfig-backend-kconfig4-0.8.8, attr description\nerror: Metadata Exception: pkg ebuild src: x11-libs/compizconfig-backend-kconfig4-0.8.8, attr data\nerror: False',), < cpv='x11-libs/compizconfig-backend-kconfig4-0.8.8' @0x7f7193384e10>) +ass 'pkgcore.ebuild.ebuild_src.package'> cpv='x11-libs/compizconfig-backend-kconfig4-0.8.8' @0x7fb777c6ae10>) ERROR pkgcore: returned val from gen_metadata was 'False' -caught exception '%s' while processing '%s'(MetadataException('Metadata Exception: pkg ebuild src: app-pda/libopensync-plugin-kdepim-0.35, attr description\nerror: Metadata Exception: pkg ebuild src: app-pda/libopensync-plugin-kdepim-0.35, attr data\nerror: False',), < cpv='app-pda/libopensync-plugin-kdepim-0.35' @0x7f7192e4f7d0>) +caught exception '%s' while processing '%s'(MetadataException('Metadata Exception: pkg ebuild src: app-pda/libopensync-plugin-kdepim-0.35, attr description\nerror: Metadata Exception: pkg ebuild src: app-pda/libopensync-plugin-kdepim-0.35, attr data\nerror: False',), < cpv='app-pda/libopensync-plugin-kdepim-0.35' @0x7fb7777357d0>) ERROR pkgcore: returned val from gen_metadata was 'False' -caught exception '%s' while processing '%s'(MetadataException('Metadata Exception: pkg ebuild src: app-pda/libopensync-plugin-kdepim-0.36, attr description\nerror: Metadata Exception: pkg ebuild src: app-pda/libopensync-plugin-kdepim-0.36, attr data\nerror: False',), < cpv='app-pda/libopensync-plugin-kdepim-0.36' @0x7f7193384e10>) +caught exception '%s' while processing '%s'(MetadataException('Metadata Exception: pkg ebuild src: app-pda/libopensync-plugin-kdepim-0.36, attr description\nerror: Metadata Exception: pkg ebuild src: app-pda/libopensync-plugin-kdepim-0.36, attr data\nerror: False',), < cpv='app-pda/libopensync-plugin-kdepim-0.36' @0x7fb777c6ae10>) ERROR pkgcore: returned val from gen_metadata was 'False' -caught exception '%s' while processing '%s'(MetadataException('Metadata Exception: pkg ebuild src: app-pda/libopensync-plugin-kdepim-9999, attr description\nerror: Metadata Exception: pkg ebuild src: app-pda/libopensync-plugin-kdepim-9999, attr data\nerror: False',), < cpv='app-pda/libopensync-plugin-kdepim-9999' @0x7f7192e4f7d0>) +caught exception '%s' while processing '%s'(MetadataException('Metadata Exception: pkg ebuild src: app-pda/libopensync-plugin-kdepim-9999, attr description\nerror: Metadata Exception: pkg ebuild src: app-pda/libopensync-plugin-kdepim-9999, attr data\nerror: False',), < cpv='app-pda/libopensync-plugin-kdepim-9999' @0x7fb7777357d0>) ERROR pkgcore: returned val from gen_metadata was 'False' -caught exception '%s' while processing '%s'(MetadataException('Metadata Exception: pkg ebuild src: x11-wm/metacity-2.30.3, attr description\nerror: Metadata Exception: pkg ebuild src: x11-wm/metacity-2.30.3, attr data\nerror: False',), < cpv='x11-wm/metacity-2.30.3' @0x7f719288e190>) +caught exception '%s' while processing '%s'(MetadataException('Metadata Exception: pkg ebuild src: x11-wm/metacity-2.30.3, attr description\nerror: Metadata Exception: pkg ebuild src: x11-wm/metacity-2.30.3, attr data\nerror: False',), < cpv='x11-wm/metacity-2.30.3' @0x7fb777174190>) ERROR pkgcore: returned val from gen_metadata was 'False' -caught exception '%s' while processing '%s'(MetadataException('Metadata Exception: pkg ebuild src: dev-perl/DCOP-Amarok-Player-0.036, attr description\nerror: Metadata Exception: pkg ebuild src: dev-perl/DCOP-Amarok-Player-0.036, attr data\nerror: False',), < cpv='dev-perl/DCOP-Amarok-Player-0.036' @0x7f71928a8a50>) +caught exception '%s' while processing '%s'(MetadataException('Metadata Exception: pkg ebuild src: dev-perl/DCOP-Amarok-Player-0.036, attr description\nerror: Metadata Exception: pkg ebuild src: dev-perl/DCOP-Amarok-Player-0.036, attr data\nerror: False',), < cpv='dev-perl/DCOP-Amarok-Player-0.036' @0x7fb77718ea50>) ERROR pkgcore: returned val from gen_metadata was 'False' -caught exception '%s' while processing '%s'(MetadataException('Metadata Exception: pkg ebuild src: dev-perl/DCOP-Amarok-Player-0.037, attr description\nerror: Metadata Exception: pkg ebuild src: dev-perl/DCOP-Amarok-Player-0.037, attr data\nerror: False',), < cpv='dev-perl/DCOP-Amarok-Player-0.037' @0x7f719288e190>) +caught exception '%s' while processing '%s'(MetadataException('Metadata Exception: pkg ebuild src: dev-perl/DCOP-Amarok-Player-0.037, attr description\nerror: Metadata Exception: pkg ebuild src: dev-perl/DCOP-Amarok-Player-0.037, attr data\nerror: False',), < cpv='dev-perl/DCOP-Amarok-Player-0.037' @0x7fb777174190>) ERROR pkgcore: returned val from gen_metadata was 'False' -caught exception '%s' while processing '%s'(MetadataException('Metadata Exception: pkg ebuild src: dev-perl/DCOP-Amarok-0.035, attr description\nerror: Metadata Exception: pkg ebuild src: dev-perl/DCOP-Amarok-0.035, attr data\nerror: False',), < cpv='dev-perl/DCOP-Amarok-0.035' @0x7f71928a8a50>) +caught exception '%s' while processing '%s'(MetadataException('Metadata Exception: pkg ebuild src: dev-perl/DCOP-Amarok-0.035, attr description\nerror: Metadata Exception: pkg ebuild src: dev-perl/DCOP-Amarok-0.035, attr data\nerror: False',), < cpv='dev-perl/DCOP-Amarok-0.035' @0x7fb77718ea50>) ERROR pkgcore: returned val from gen_metadata was 'False' -caught exception '%s' while processing '%s'(MetadataException('Metadata Exception: pkg ebuild src: dev-perl/DCOP-Amarok-0.036, attr description\nerror: Metadata Exception: pkg ebuild src: dev-perl/DCOP-Amarok-0.036, attr data\nerror: False',), < cpv='dev-perl/DCOP-Amarok-0.036' @0x7f719288e190>) +caught exception '%s' while processing '%s'(MetadataException('Metadata Exception: pkg ebuild src: dev-perl/DCOP-Amarok-0.036, attr description\nerror: Metadata Exception: pkg ebuild src: dev-perl/DCOP-Amarok-0.036, attr data\nerror: False',), < cpv='dev-perl/DCOP-Amarok-0.036' @0x7fb777174190>) ERROR pkgcore: returned val from gen_metadata was 'False' -caught exception '%s' while processing '%s'(MetadataException('Metadata Exception: pkg ebuild src: dev-perl/DCOP-0.036, attr description\nerror: Metadata Exception: pkg ebuild src: dev-perl/DCOP-0.036, attr data\nerror: False',), < cpv='dev-perl/DCOP-0.036' @0x7f71928a8a50>) +caught exception '%s' while processing '%s'(MetadataException('Metadata Exception: pkg ebuild src: dev-perl/DCOP-0.036, attr description\nerror: Metadata Exception: pkg ebuild src: dev-perl/DCOP-0.036, attr data\nerror: False',), < cpv='dev-perl/DCOP-0.036' @0x7fb77718ea50>) ERROR pkgcore: returned val from gen_metadata was 'False' caught exception '%s' while processing '%s'(MetadataException('Metadata Exception: pkg ebuild src: dev-perl/DCOP-0.038, attr description\nerror: Metadata Exception: pkg ebuild src: dev-perl/DCOP-0.038, attr data\nerror: False',), !!! ERROR: dev-perl/PerlQt-3.009_beta2 failed. @@ -1006,27 +1006,27 @@ caught exception '%s' while processing '%s'(MetadataException('Metadata Exceptio !!! The die message: !!! EAPI=1 is not supported by perl-module.eclass - < cpv='dev-perl/DCOP-0.038' @0x7f719288e190>) + < cpv='dev-perl/DCOP-0.038' @0x7fb777174190>) ERROR pkgcore: returned val from gen_metadata was 'False' -caught exception '%s' while processing '%s'(MetadataException('Metadata Exception: pkg ebuild src: dev-perl/PerlQt-3.009_beta2, attr description\nerror: Metadata Exception: pkg ebuild src: dev-perl/PerlQt-3.009_beta2, attr data\nerror: False',), < cpv='dev-perl/PerlQt-3.009_beta2' @0x7f71928a8a50>) +caught exception '%s' while processing '%s'(MetadataException('Metadata Exception: pkg ebuild src: dev-perl/PerlQt-3.009_beta2, attr description\nerror: Metadata Exception: pkg ebuild src: dev-perl/PerlQt-3.009_beta2, attr data\nerror: False',), < cpv='dev-perl/PerlQt-3.009_beta2' @0x7fb77718ea50>) ERROR pkgcore: returned val from gen_metadata was 'False' -caught exception '%s' while processing '%s'(MetadataException('Metadata Exception: pkg ebuild src: x11-themes/gtk-engines-qt-0.8-r4, attr description\nerror: Metadata Exception: pkg ebuild src: x11-themes/gtk-engines-qt-0.8-r4, attr data\nerror: False',), < cpv='x11-themes/gtk-engines-qt-0.8-r4' @0x7f71927d6690>) +caught exception '%s' while processing '%s'(MetadataException('Metadata Exception: pkg ebuild src: x11-themes/gtk-engines-qt-0.8-r4, attr description\nerror: Metadata Exception: pkg ebuild src: x11-themes/gtk-engines-qt-0.8-r4, attr data\nerror: False',), < cpv='x11-themes/gtk-engines-qt-0.8-r4' @0x7fb7770bc690>) ERROR pkgcore: returned val from gen_metadata was 'False' -caught exception '%s' while processing '%s'(MetadataException('Metadata Exception: pkg ebuild src: x11-themes/qtcurve-0.59.2, attr description\nerror: Metadata Exception: pkg ebuild src: x11-themes/qtcurve-0.59.2, attr data\nerror: False',), < cpv='x11-themes/qtcurve-0.59.2' @0x7f71927d6e10>) +caught exception '%s' while processing '%s'(MetadataException('Metadata Exception: pkg ebuild src: x11-themes/qtcurve-0.59.2, attr description\nerror: Metadata Exception: pkg ebuild src: x11-themes/qtcurve-0.59.2, attr data\nerror: False',), < cpv='x11-themes/qtcurve-0.59.2' @0x7fb7770bce10>) ERROR pkgcore: returned val from gen_metadata was 'False' -caught exception '%s' while processing '%s'(MetadataException('Metadata Exception: pkg ebuild src: x11-themes/qtcurve-0.59.5, attr description\nerror: Metadata Exception: pkg ebuild src: x11-themes/qtcurve-0.59.5, attr data\nerror: False',), < cpv='x11-themes/qtcurve-0.59.5' @0x7f71927d6690>) +caught exception '%s' while processing '%s'(MetadataException('Metadata Exception: pkg ebuild src: x11-themes/qtcurve-0.59.5, attr description\nerror: Metadata Exception: pkg ebuild src: x11-themes/qtcurve-0.59.5, attr data\nerror: False',), < cpv='x11-themes/qtcurve-0.59.5' @0x7fb7770bc690>) ERROR pkgcore: returned val from gen_metadata was 'False' -caught exception '%s' while processing '%s'(MetadataException('Metadata Exception: pkg ebuild src: x11-themes/qtcurve-0.65.2, attr description\nerror: Metadata Exception: pkg ebuild src: x11-themes/qtcurve-0.65.2, attr data\nerror: False',), < cpv='x11-themes/qtcurve-0.65.2' @0x7f71927d6e10>) +caught exception '%s' while processing '%s'(MetadataException('Metadata Exception: pkg ebuild src: x11-themes/qtcurve-0.65.2, attr description\nerror: Metadata Exception: pkg ebuild src: x11-themes/qtcurve-0.65.2, attr data\nerror: False',), < cpv='x11-themes/qtcurve-0.65.2' @0x7fb7770bce10>) ERROR pkgcore: returned val from gen_metadata was 'False' -caught exception '%s' while processing '%s'(MetadataException('Metadata Exception: pkg ebuild src: x11-themes/qtcurve-0.68.1, attr description\nerror: Metadata Exception: pkg ebuild src: x11-themes/qtcurve-0.68.1, attr data\nerror: False',), < cpv='x11-themes/qtcurve-0.68.1' @0x7f71927d6690>) +caught exception '%s' while processing '%s'(MetadataException('Metadata Exception: pkg ebuild src: x11-themes/qtcurve-0.68.1, attr description\nerror: Metadata Exception: pkg ebuild src: x11-themes/qtcurve-0.68.1, attr data\nerror: False',), < cpv='x11-themes/qtcurve-0.68.1' @0x7fb7770bc690>) ERROR pkgcore: returned val from gen_metadata was 'False' -caught exception '%s' while processing '%s'(MetadataException('Metadata Exception: pkg ebuild src: x11-themes/qtcurve-0.69.1, attr description\nerror: Metadata Exception: pkg ebuild src: x11-themes/qtcurve-0.69.1, attr data\nerror: False',), < cpv='x11-themes/qtcurve-0.69.1' @0x7f71927d6e10>) +caught exception '%s' while processing '%s'(MetadataException('Metadata Exception: pkg ebuild src: x11-themes/qtcurve-0.69.1, attr description\nerror: Metadata Exception: pkg ebuild src: x11-themes/qtcurve-0.69.1, attr data\nerror: False',), < cpv='x11-themes/qtcurve-0.69.1' @0x7fb7770bce10>) ERROR pkgcore: returned val from gen_metadata was 'False' -caught exception '%s' while processing '%s'(MetadataException('Metadata Exception: pkg ebuild src: net-misc/gwget-1.0.4-r1, attr description\nerror: Metadata Exception: pkg ebuild src: net-misc/gwget-1.0.4-r1, attr data\nerror: False',), < cpv='net-misc/gwget-1.0.4-r1' @0x7f719278c410>) +caught exception '%s' while processing '%s'(MetadataException('Metadata Exception: pkg ebuild src: net-misc/gwget-1.0.4-r1, attr description\nerror: Metadata Exception: pkg ebuild src: net-misc/gwget-1.0.4-r1, attr data\nerror: False',), < cpv='net-misc/gwget-1.0.4-r1' @0x7fb777072410>) ERROR pkgcore: returned val from gen_metadata was 'False' -caught exception '%s' while processing '%s'(MetadataException('Metadata Exception: pkg ebuild src: media-video/asdf-0.4, attr description\nerror: Metadata Exception: pkg ebuild src: media-video/asdf-0.4, attr data\nerror: False',), < cpv='media-video/asdf-0.4' @0x7f719279e690>) +caught exception '%s' while processing '%s'(MetadataException('Metadata Exception: pkg ebuild src: media-video/asdf-0.4, attr description\nerror: Metadata Exception: pkg ebuild src: media-video/asdf-0.4, attr data\nerror: False',), < cpv='media-video/asdf-0.4' @0x7fb777084690>) ERROR pkgcore: returned val from gen_metadata was 'False' -caught exception '%s' while processing '%s'(MetadataException('Metadata Exception: pkg ebuild src: media-video/dpencoder-0.6c, attr description\nerror: Metadata Exception: pkg ebuild src: media-video/dpencoder-0.6c, attr data\nerror: False',), < cpv='media-video/dpencoder-0.6c' @0x7f719279eb90>) +caught exception '%s' while processing '%s'(MetadataException('Metadata Exception: pkg ebuild src: media-video/dpencoder-0.6c, attr description\nerror: Metadata Exception: pkg ebuild src: media-video/dpencoder-0.6c, attr data\nerror: False',), < cpv='media-video/dpencoder-0.6c' @0x7fb777084b90>) ERROR pkgcore: returned val from gen_metadata was 'False' -caught exception '%s' while processing '%s'(MetadataException('Metadata Exception: pkg ebuild src: kde-base/dcopperl-3.5.10, attr description\nerror: Metadata Exception: pkg ebuild src: kde-base/dcopperl-3.5.10, attr data\nerror: False',), < cpv='kde-base/dcopperl-3.5.10' @0x7f7192748410>) +caught exception '%s' while processing '%s'(MetadataException('Metadata Exception: pkg ebuild src: kde-base/dcopperl-3.5.10, attr description\nerror: Metadata Exception: pkg ebuild src: kde-base/dcopperl-3.5.10, attr data\nerror: False',), < cpv='kde-base/dcopperl-3.5.10' @0x7fb77702e410>) * Cache regen failed with 1 diff --git a/raw.html b/raw.html index 288132234175..eba0a2d8215d 100644 --- a/raw.html +++ b/raw.html @@ -132,13 +132,13 @@
61
 
- 62
sandbox:stop  caught signal 15 in pid 20859
+            62
sandbox:stop  caught signal 15 in pid 20673
 
63
Sandboxed process killed by signal: Terminated
 
64
!!! caught exception inherit requires an unknown eclass, git cannot be found while processing ebuild src: sys-cluster/kerrighed-9999-r1
 
[FATAL] - 65
caught exception '%s' while processing '%s'(MetadataException('Metadata Exception: pkg ebuild src: sys-cluster/kerrighed-9999-r1, attr description\nerror: Metadata Exception: pkg ebuild src: sys-cluster/kerrighed-9999-r1, attr data\nerror: inherit requires an unknown eclass, git cannot be found',), <<class 'pkgcore.ebuild.ebuild_src.package'> cpv='sys-cluster/kerrighed-9999-r1' @0x7f36f7e9ba50>)
+            65
caught exception '%s' while processing '%s'(MetadataException('Metadata Exception: pkg ebuild src: sys-cluster/kerrighed-9999-r1, attr description\nerror: Metadata Exception: pkg ebuild src: sys-cluster/kerrighed-9999-r1, attr data\nerror: inherit requires an unknown eclass, git cannot be found',), <<class 'pkgcore.ebuild.ebuild_src.package'> cpv='sys-cluster/kerrighed-9999-r1' @0x7f544896ea50>)
 
[FATAL] 66
 * Cache regen failed with 1
 
diff --git a/raw.txt b/raw.txt index fa76b2521e63..b4f24e1a5647 100644 --- a/raw.txt +++ b/raw.txt @@ -59,8 +59,8 @@ Sandboxed process killed by signal: Broken pipe !!! The die message: !!! inherit for git failed -sandbox:stop caught signal 15 in pid 20859 +sandbox:stop caught signal 15 in pid 20673 Sandboxed process killed by signal: Terminated !!! caught exception inherit requires an unknown eclass, git cannot be found while processing ebuild src: sys-cluster/kerrighed-9999-r1 -caught exception '%s' while processing '%s'(MetadataException('Metadata Exception: pkg ebuild src: sys-cluster/kerrighed-9999-r1, attr description\nerror: Metadata Exception: pkg ebuild src: sys-cluster/kerrighed-9999-r1, attr data\nerror: inherit requires an unknown eclass, git cannot be found',), < cpv='sys-cluster/kerrighed-9999-r1' @0x7f36f7e9ba50>) +caught exception '%s' while processing '%s'(MetadataException('Metadata Exception: pkg ebuild src: sys-cluster/kerrighed-9999-r1, attr description\nerror: Metadata Exception: pkg ebuild src: sys-cluster/kerrighed-9999-r1, attr data\nerror: inherit requires an unknown eclass, git cannot be found',), < cpv='sys-cluster/kerrighed-9999-r1' @0x7f544896ea50>) * Cache regen failed with 1 diff --git a/rebel.html b/rebel.html index a66624bf1cf3..459a255ffd72 100644 --- a/rebel.html +++ b/rebel.html @@ -146,7 +146,7 @@
[FATAL] 68
ERROR pkgcore: returned val from gen_metadata was 'False'
 
- 69
caught exception '%s' while processing '%s'(MetadataException('Metadata Exception: pkg ebuild src: kde-misc/adjustableclock-9999, attr description\nerror: Metadata Exception: pkg ebuild src: kde-misc/adjustableclock-9999, attr data\nerror: False',), <<class 'pkgcore.ebuild.ebuild_src.package'> cpv='kde-misc/adjustableclock-9999' @0x7fa9fff20190>)
+            69
caught exception '%s' while processing '%s'(MetadataException('Metadata Exception: pkg ebuild src: kde-misc/adjustableclock-9999, attr description\nerror: Metadata Exception: pkg ebuild src: kde-misc/adjustableclock-9999, attr data\nerror: False',), <<class 'pkgcore.ebuild.ebuild_src.package'> cpv='kde-misc/adjustableclock-9999' @0x7f4096f59190>)
 
[FATAL] 70
 * Cache regen failed with 1
 
diff --git a/rebel.txt b/rebel.txt index 6ac537a40c8d..a4976186b791 100644 --- a/rebel.txt +++ b/rebel.txt @@ -66,5 +66,5 @@ WARNING:pkgcore:repository at '/home/mgorny/repos/steveeJ' has unsupported profi ERROR pkgcore: returned val from gen_metadata was 'False' !!! caught exception False while processing ebuild src: kde-misc/adjustableclock-9999 ERROR pkgcore: returned val from gen_metadata was 'False' -caught exception '%s' while processing '%s'(MetadataException('Metadata Exception: pkg ebuild src: kde-misc/adjustableclock-9999, attr description\nerror: Metadata Exception: pkg ebuild src: kde-misc/adjustableclock-9999, attr data\nerror: False',), < cpv='kde-misc/adjustableclock-9999' @0x7fa9fff20190>) +caught exception '%s' while processing '%s'(MetadataException('Metadata Exception: pkg ebuild src: kde-misc/adjustableclock-9999, attr description\nerror: Metadata Exception: pkg ebuild src: kde-misc/adjustableclock-9999, attr data\nerror: False',), < cpv='kde-misc/adjustableclock-9999' @0x7f4096f59190>) * Cache regen failed with 1 diff --git a/robbat2.html b/robbat2.html index b8a22be72593..b1e1f318d235 100644 --- a/robbat2.html +++ b/robbat2.html @@ -138,71 +138,73 @@
64
!!! caught exception False while processing ebuild src: dev-perl/Archive-Tar-Streamed-0.03
 
[FATAL] - 65
Traceback (most recent call last):
+            65
!!! caught exception ("Expected command; instead got nothing from ''", None) while processing ebuild src: dev-perl/Authen-Captcha-1.023
+
[FATAL] + 66
Traceback (most recent call last):
 
- 66
  File "/home/mgorny/pkgcore-venv/bin/pmaint", line 4, in <module>
+            67
  File "/home/mgorny/pkgcore-venv/bin/pmaint", line 4, in <module>
 
- 67
    scripts.main(basename(__file__))
+            68
    scripts.main(basename(__file__))
 
- 68
  File "/home/mgorny/pkgcore-venv/lib/python2.7/site-packages/pkgcore/scripts/__init__.py", line 40, in main
+            69
  File "/home/mgorny/pkgcore-venv/lib/python2.7/site-packages/pkgcore/scripts/__init__.py", line 40, in main
 
- 69
    commandline.main(argparser)
+            70
    commandline.main(argparser)
 
- 70
  File "/home/mgorny/pkgcore-venv/lib/python2.7/site-packages/pkgcore/util/commandline.py", line 969, in main
+            71
  File "/home/mgorny/pkgcore-venv/lib/python2.7/site-packages/pkgcore/util/commandline.py", line 969, in main
 
- 71
    exitstatus = main_func(options, out, err)
+            72
    exitstatus = main_func(options, out, err)
 
- 72
  File "/home/mgorny/pkgcore-venv/lib/python2.7/site-packages/pkgcore/scripts/pmaint.py", line 283, in regen_main
+            73
  File "/home/mgorny/pkgcore-venv/lib/python2.7/site-packages/pkgcore/scripts/pmaint.py", line 283, in regen_main
 
- 73
    eclass_caching=(not options.disable_eclass_caching))
+            74
    eclass_caching=(not options.disable_eclass_caching))
 
- 74
  File "/home/mgorny/pkgcore-venv/lib/python2.7/site-packages/pkgcore/operations/__init__.py", line 68, in _recast_exception_decorator
+            75
  File "/home/mgorny/pkgcore-venv/lib/python2.7/site-packages/pkgcore/operations/__init__.py", line 68, in _recast_exception_decorator
 
- 75
    return functor(*args, **kwds)
+            76
    return functor(*args, **kwds)
 
- 76
  File "/home/mgorny/pkgcore-venv/lib/python2.7/site-packages/pkgcore/operations/repo.py", line 247, in _cmd_api_regen_cache
+            77
  File "/home/mgorny/pkgcore-venv/lib/python2.7/site-packages/pkgcore/operations/repo.py", line 247, in _cmd_api_regen_cache
 
- 77
    self._get_observer(observer), threads=threads, **options)
+            78
    self._get_observer(observer), threads=threads, **options)
 
- 78
  File "/home/mgorny/pkgcore-venv/lib/python2.7/site-packages/pkgcore/operations/regen.py", line 37, in regen_repository
+            79
  File "/home/mgorny/pkgcore-venv/lib/python2.7/site-packages/pkgcore/operations/regen.py", line 37, in regen_repository
 
- 79
    regen_iter(iter(repo), _get_repo_helper(), observer)
+            80
    regen_iter(iter(repo), _get_repo_helper(), observer)
 
- 80
  File "/home/mgorny/pkgcore-venv/lib/python2.7/site-packages/pkgcore/operations/regen.py", line 15, in regen_iter
+            81
  File "/home/mgorny/pkgcore-venv/lib/python2.7/site-packages/pkgcore/operations/regen.py", line 15, in regen_iter
 
- 81
    regen_func(x)
+            82
    regen_func(x)
 
- 82
  File "/home/mgorny/pkgcore-venv/lib/python2.7/site-packages/pkgcore/ebuild/repository.py", line 521, in __call__
+            83
  File "/home/mgorny/pkgcore-venv/lib/python2.7/site-packages/pkgcore/ebuild/repository.py", line 521, in __call__
 
- 83
    return pkg._fetch_metadata(ebp=self.ebp, force_regen=self.force)
+            84
    return pkg._fetch_metadata(ebp=self.ebp, force_regen=self.force)
 
- 84
  File "/home/mgorny/pkgcore-venv/lib/python2.7/site-packages/pkgcore/ebuild/ebuild_src.py", line 277, in _fetch_metadata
+            85
  File "/home/mgorny/pkgcore-venv/lib/python2.7/site-packages/pkgcore/ebuild/ebuild_src.py", line 277, in _fetch_metadata
 
- 85
    return self._parent._get_metadata(self, ebp=ebp, force_regen=force_regen)
+            86
    return self._parent._get_metadata(self, ebp=ebp, force_regen=force_regen)
 
- 86
  File "/home/mgorny/pkgcore-venv/lib/python2.7/site-packages/pkgcore/ebuild/ebuild_src.py", line 367, in _get_metadata
+            87
  File "/home/mgorny/pkgcore-venv/lib/python2.7/site-packages/pkgcore/ebuild/ebuild_src.py", line 367, in _get_metadata
 
- 87
    return self._update_metadata(pkg, ebp=ebp)
+            88
    return self._update_metadata(pkg, ebp=ebp)
 
- 88
  File "/home/mgorny/pkgcore-venv/lib/python2.7/site-packages/pkgcore/ebuild/ebuild_src.py", line 375, in _update_metadata
+            89
  File "/home/mgorny/pkgcore-venv/lib/python2.7/site-packages/pkgcore/ebuild/ebuild_src.py", line 375, in _update_metadata
 
- 89
    mydata = my_proc.get_keys(pkg, self._ecache)
+            90
    mydata = my_proc.get_keys(pkg, self._ecache)
 
- 90
  File "/home/mgorny/pkgcore-venv/lib/python2.7/site-packages/pkgcore/ebuild/processor.py", line 788, in get_keys
+            91
  File "/home/mgorny/pkgcore-venv/lib/python2.7/site-packages/pkgcore/ebuild/processor.py", line 788, in get_keys
 
- 91
    {"key": receive_key})
+            92
    {"key": receive_key})
 
- 92
  File "/home/mgorny/pkgcore-venv/lib/python2.7/site-packages/pkgcore/ebuild/processor.py", line 721, in _run_depend_like_phase
+            93
  File "/home/mgorny/pkgcore-venv/lib/python2.7/site-packages/pkgcore/ebuild/processor.py", line 721, in _run_depend_like_phase
 
- 93
    self.write("%s %i\n%s" % (command, len(data), data), append_newline=False)
+            94
    self.write("%s %i\n%s" % (command, len(data), data), append_newline=False)
 
- 94
  File "/home/mgorny/pkgcore-venv/lib/python2.7/site-packages/pkgcore/ebuild/processor.py", line 419, in write
+            95
  File "/home/mgorny/pkgcore-venv/lib/python2.7/site-packages/pkgcore/ebuild/processor.py", line 419, in write
 
- 95
    raise RuntimeError(ie)
+            96
    raise RuntimeError(ie)
 
- 96
RuntimeError: [Errno 32] Broken pipe
+            97
RuntimeError: [Errno 32] Broken pipe
 
- 97
 * Cache regen failed with 1
+            98
 * Cache regen failed with 1
 
diff --git a/robbat2.txt b/robbat2.txt index 66a39d3695bf..98510d1f797b 100644 --- a/robbat2.txt +++ b/robbat2.txt @@ -62,6 +62,7 @@ ERROR pkgcore: returned val from gen_metadata was 'False' !!! caught exception False while processing ebuild src: dev-perl/Acme-Damn-0.04 ERROR pkgcore: returned val from gen_metadata was 'False' !!! caught exception False while processing ebuild src: dev-perl/Archive-Tar-Streamed-0.03 +!!! caught exception ("Expected command; instead got nothing from ''", None) while processing ebuild src: dev-perl/Authen-Captcha-1.023 Traceback (most recent call last): File "/home/mgorny/pkgcore-venv/bin/pmaint", line 4, in scripts.main(basename(__file__)) diff --git a/sigrok.html b/sigrok.html index d7100884b6ed..551424ffc3d6 100644 --- a/sigrok.html +++ b/sigrok.html @@ -530,27 +530,27 @@
[FATAL] 260
ERROR pkgcore: returned val from gen_metadata was 'False'
 
- 261
caught exception '%s' while processing '%s'(MetadataException('Metadata Exception: pkg ebuild src: sci-electronics/pulseview-0.2.0, attr description\nerror: Metadata Exception: pkg ebuild src: sci-electronics/pulseview-0.2.0, attr data\nerror: False',), <<class 'pkgcore.ebuild.ebuild_src.package'> cpv='sci-electronics/pulseview-0.2.0' @0x7f5d8cc86e10>)
+            261
caught exception '%s' while processing '%s'(MetadataException('Metadata Exception: pkg ebuild src: sci-electronics/pulseview-0.2.0, attr description\nerror: Metadata Exception: pkg ebuild src: sci-electronics/pulseview-0.2.0, attr data\nerror: False',), <<class 'pkgcore.ebuild.ebuild_src.package'> cpv='sci-electronics/pulseview-0.2.0' @0x7f14fab7ce10>)
 
[FATAL] 262
ERROR pkgcore: returned val from gen_metadata was 'False'
 
- 263
caught exception '%s' while processing '%s'(MetadataException('Metadata Exception: pkg ebuild src: sci-electronics/pulseview-0.1.0, attr description\nerror: Metadata Exception: pkg ebuild src: sci-electronics/pulseview-0.1.0, attr data\nerror: False',), <<class 'pkgcore.ebuild.ebuild_src.package'> cpv='sci-electronics/pulseview-0.1.0' @0x7f5d8c7da050>)
+            263
caught exception '%s' while processing '%s'(MetadataException('Metadata Exception: pkg ebuild src: sci-electronics/pulseview-0.1.0, attr description\nerror: Metadata Exception: pkg ebuild src: sci-electronics/pulseview-0.1.0, attr data\nerror: False',), <<class 'pkgcore.ebuild.ebuild_src.package'> cpv='sci-electronics/pulseview-0.1.0' @0x7f14fa6d0050>)
 
[FATAL] 264
ERROR pkgcore: returned val from gen_metadata was 'False'
 
- 265
caught exception '%s' while processing '%s'(MetadataException('Metadata Exception: pkg ebuild src: sci-electronics/pulseview-9999, attr description\nerror: Metadata Exception: pkg ebuild src: sci-electronics/pulseview-9999, attr data\nerror: False',), <<class 'pkgcore.ebuild.ebuild_src.package'> cpv='sci-electronics/pulseview-9999' @0x7f5d8cc86e10>)
+            265
caught exception '%s' while processing '%s'(MetadataException('Metadata Exception: pkg ebuild src: sci-electronics/pulseview-9999, attr description\nerror: Metadata Exception: pkg ebuild src: sci-electronics/pulseview-9999, attr data\nerror: False',), <<class 'pkgcore.ebuild.ebuild_src.package'> cpv='sci-electronics/pulseview-9999' @0x7f14fab7ce10>)
 
[FATAL] 266
ERROR pkgcore: returned val from gen_metadata was 'False'
 
- 267
caught exception '%s' while processing '%s'(MetadataException('Metadata Exception: pkg ebuild src: sci-electronics/sigrok-cli-0.5.0, attr description\nerror: Metadata Exception: pkg ebuild src: sci-electronics/sigrok-cli-0.5.0, attr data\nerror: False',), <<class 'pkgcore.ebuild.ebuild_src.package'> cpv='sci-electronics/sigrok-cli-0.5.0' @0x7f5d8c7da050>)
+            267
caught exception '%s' while processing '%s'(MetadataException('Metadata Exception: pkg ebuild src: sci-electronics/sigrok-cli-0.5.0, attr description\nerror: Metadata Exception: pkg ebuild src: sci-electronics/sigrok-cli-0.5.0, attr data\nerror: False',), <<class 'pkgcore.ebuild.ebuild_src.package'> cpv='sci-electronics/sigrok-cli-0.5.0' @0x7f14fa6d0050>)
 
[FATAL] 268
ERROR pkgcore: returned val from gen_metadata was 'False'
 
- 269
caught exception '%s' while processing '%s'(MetadataException('Metadata Exception: pkg ebuild src: sci-electronics/sigrok-cli-0.4.0, attr description\nerror: Metadata Exception: pkg ebuild src: sci-electronics/sigrok-cli-0.4.0, attr data\nerror: False',), <<class 'pkgcore.ebuild.ebuild_src.package'> cpv='sci-electronics/sigrok-cli-0.4.0' @0x7f5d8cc86e10>)
+            269
caught exception '%s' while processing '%s'(MetadataException('Metadata Exception: pkg ebuild src: sci-electronics/sigrok-cli-0.4.0, attr description\nerror: Metadata Exception: pkg ebuild src: sci-electronics/sigrok-cli-0.4.0, attr data\nerror: False',), <<class 'pkgcore.ebuild.ebuild_src.package'> cpv='sci-electronics/sigrok-cli-0.4.0' @0x7f14fab7ce10>)
 
[FATAL] 270
ERROR pkgcore: returned val from gen_metadata was 'False'
 
- 271
caught exception '%s' while processing '%s'(MetadataException('Metadata Exception: pkg ebuild src: sci-electronics/sigrok-cli-9999, attr description\nerror: Metadata Exception: pkg ebuild src: sci-electronics/sigrok-cli-9999, attr data\nerror: False',), <<class 'pkgcore.ebuild.ebuild_src.package'> cpv='sci-electronics/sigrok-cli-9999' @0x7f5d8c7da050>)
+            271
caught exception '%s' while processing '%s'(MetadataException('Metadata Exception: pkg ebuild src: sci-electronics/sigrok-cli-9999, attr description\nerror: Metadata Exception: pkg ebuild src: sci-electronics/sigrok-cli-9999, attr data\nerror: False',), <<class 'pkgcore.ebuild.ebuild_src.package'> cpv='sci-electronics/sigrok-cli-9999' @0x7f14fa6d0050>)
 
[FATAL] 272
 * Cache regen failed with 1
 
diff --git a/sigrok.txt b/sigrok.txt index 40ca04790b05..7d8f8aeb2078 100644 --- a/sigrok.txt +++ b/sigrok.txt @@ -258,15 +258,15 @@ ERROR pkgcore: returned val from gen_metadata was 'False' ERROR pkgcore: returned val from gen_metadata was 'False' !!! caught exception False while processing ebuild src: sci-electronics/sigrok-cli-9999 ERROR pkgcore: returned val from gen_metadata was 'False' -caught exception '%s' while processing '%s'(MetadataException('Metadata Exception: pkg ebuild src: sci-electronics/pulseview-0.2.0, attr description\nerror: Metadata Exception: pkg ebuild src: sci-electronics/pulseview-0.2.0, attr data\nerror: False',), < cpv='sci-electronics/pulseview-0.2.0' @0x7f5d8cc86e10>) +caught exception '%s' while processing '%s'(MetadataException('Metadata Exception: pkg ebuild src: sci-electronics/pulseview-0.2.0, attr description\nerror: Metadata Exception: pkg ebuild src: sci-electronics/pulseview-0.2.0, attr data\nerror: False',), < cpv='sci-electronics/pulseview-0.2.0' @0x7f14fab7ce10>) ERROR pkgcore: returned val from gen_metadata was 'False' -caught exception '%s' while processing '%s'(MetadataException('Metadata Exception: pkg ebuild src: sci-electronics/pulseview-0.1.0, attr description\nerror: Metadata Exception: pkg ebuild src: sci-electronics/pulseview-0.1.0, attr data\nerror: False',), < cpv='sci-electronics/pulseview-0.1.0' @0x7f5d8c7da050>) +caught exception '%s' while processing '%s'(MetadataException('Metadata Exception: pkg ebuild src: sci-electronics/pulseview-0.1.0, attr description\nerror: Metadata Exception: pkg ebuild src: sci-electronics/pulseview-0.1.0, attr data\nerror: False',), < cpv='sci-electronics/pulseview-0.1.0' @0x7f14fa6d0050>) ERROR pkgcore: returned val from gen_metadata was 'False' -caught exception '%s' while processing '%s'(MetadataException('Metadata Exception: pkg ebuild src: sci-electronics/pulseview-9999, attr description\nerror: Metadata Exception: pkg ebuild src: sci-electronics/pulseview-9999, attr data\nerror: False',), < cpv='sci-electronics/pulseview-9999' @0x7f5d8cc86e10>) +caught exception '%s' while processing '%s'(MetadataException('Metadata Exception: pkg ebuild src: sci-electronics/pulseview-9999, attr description\nerror: Metadata Exception: pkg ebuild src: sci-electronics/pulseview-9999, attr data\nerror: False',), < cpv='sci-electronics/pulseview-9999' @0x7f14fab7ce10>) ERROR pkgcore: returned val from gen_metadata was 'False' -caught exception '%s' while processing '%s'(MetadataException('Metadata Exception: pkg ebuild src: sci-electronics/sigrok-cli-0.5.0, attr description\nerror: Metadata Exception: pkg ebuild src: sci-electronics/sigrok-cli-0.5.0, attr data\nerror: False',), < cpv='sci-electronics/sigrok-cli-0.5.0' @0x7f5d8c7da050>) +caught exception '%s' while processing '%s'(MetadataException('Metadata Exception: pkg ebuild src: sci-electronics/sigrok-cli-0.5.0, attr description\nerror: Metadata Exception: pkg ebuild src: sci-electronics/sigrok-cli-0.5.0, attr data\nerror: False',), < cpv='sci-electronics/sigrok-cli-0.5.0' @0x7f14fa6d0050>) ERROR pkgcore: returned val from gen_metadata was 'False' -caught exception '%s' while processing '%s'(MetadataException('Metadata Exception: pkg ebuild src: sci-electronics/sigrok-cli-0.4.0, attr description\nerror: Metadata Exception: pkg ebuild src: sci-electronics/sigrok-cli-0.4.0, attr data\nerror: False',), < cpv='sci-electronics/sigrok-cli-0.4.0' @0x7f5d8cc86e10>) +caught exception '%s' while processing '%s'(MetadataException('Metadata Exception: pkg ebuild src: sci-electronics/sigrok-cli-0.4.0, attr description\nerror: Metadata Exception: pkg ebuild src: sci-electronics/sigrok-cli-0.4.0, attr data\nerror: False',), < cpv='sci-electronics/sigrok-cli-0.4.0' @0x7f14fab7ce10>) ERROR pkgcore: returned val from gen_metadata was 'False' -caught exception '%s' while processing '%s'(MetadataException('Metadata Exception: pkg ebuild src: sci-electronics/sigrok-cli-9999, attr description\nerror: Metadata Exception: pkg ebuild src: sci-electronics/sigrok-cli-9999, attr data\nerror: False',), < cpv='sci-electronics/sigrok-cli-9999' @0x7f5d8c7da050>) +caught exception '%s' while processing '%s'(MetadataException('Metadata Exception: pkg ebuild src: sci-electronics/sigrok-cli-9999, attr description\nerror: Metadata Exception: pkg ebuild src: sci-electronics/sigrok-cli-9999, attr data\nerror: False',), < cpv='sci-electronics/sigrok-cli-9999' @0x7f14fa6d0050>) * Cache regen failed with 1 diff --git a/stuge.html b/stuge.html index 22503c7d4eca..e9437f27a752 100644 --- a/stuge.html +++ b/stuge.html @@ -126,71 +126,73 @@
58
!!! caught exception False while processing ebuild src: app-misc/taidelta-9999
 
[FATAL] - 59
Traceback (most recent call last):
+            59
!!! caught exception ("Expected command; instead got nothing from ''", None) while processing ebuild src: app-misc/unlinkd-9999
+
[FATAL] + 60
Traceback (most recent call last):
 
- 60
  File "/home/mgorny/pkgcore-venv/bin/pmaint", line 4, in <module>
+            61
  File "/home/mgorny/pkgcore-venv/bin/pmaint", line 4, in <module>
 
- 61
    scripts.main(basename(__file__))
+            62
    scripts.main(basename(__file__))
 
- 62
  File "/home/mgorny/pkgcore-venv/lib/python2.7/site-packages/pkgcore/scripts/__init__.py", line 40, in main
+            63
  File "/home/mgorny/pkgcore-venv/lib/python2.7/site-packages/pkgcore/scripts/__init__.py", line 40, in main
 
- 63
    commandline.main(argparser)
+            64
    commandline.main(argparser)
 
- 64
  File "/home/mgorny/pkgcore-venv/lib/python2.7/site-packages/pkgcore/util/commandline.py", line 969, in main
+            65
  File "/home/mgorny/pkgcore-venv/lib/python2.7/site-packages/pkgcore/util/commandline.py", line 969, in main
 
- 65
    exitstatus = main_func(options, out, err)
+            66
    exitstatus = main_func(options, out, err)
 
- 66
  File "/home/mgorny/pkgcore-venv/lib/python2.7/site-packages/pkgcore/scripts/pmaint.py", line 283, in regen_main
+            67
  File "/home/mgorny/pkgcore-venv/lib/python2.7/site-packages/pkgcore/scripts/pmaint.py", line 283, in regen_main
 
- 67
    eclass_caching=(not options.disable_eclass_caching))
+            68
    eclass_caching=(not options.disable_eclass_caching))
 
- 68
  File "/home/mgorny/pkgcore-venv/lib/python2.7/site-packages/pkgcore/operations/__init__.py", line 68, in _recast_exception_decorator
+            69
  File "/home/mgorny/pkgcore-venv/lib/python2.7/site-packages/pkgcore/operations/__init__.py", line 68, in _recast_exception_decorator
 
- 69
    return functor(*args, **kwds)
+            70
    return functor(*args, **kwds)
 
- 70
  File "/home/mgorny/pkgcore-venv/lib/python2.7/site-packages/pkgcore/operations/repo.py", line 247, in _cmd_api_regen_cache
+            71
  File "/home/mgorny/pkgcore-venv/lib/python2.7/site-packages/pkgcore/operations/repo.py", line 247, in _cmd_api_regen_cache
 
- 71
    self._get_observer(observer), threads=threads, **options)
+            72
    self._get_observer(observer), threads=threads, **options)
 
- 72
  File "/home/mgorny/pkgcore-venv/lib/python2.7/site-packages/pkgcore/operations/regen.py", line 37, in regen_repository
+            73
  File "/home/mgorny/pkgcore-venv/lib/python2.7/site-packages/pkgcore/operations/regen.py", line 37, in regen_repository
 
- 73
    regen_iter(iter(repo), _get_repo_helper(), observer)
+            74
    regen_iter(iter(repo), _get_repo_helper(), observer)
 
- 74
  File "/home/mgorny/pkgcore-venv/lib/python2.7/site-packages/pkgcore/operations/regen.py", line 15, in regen_iter
+            75
  File "/home/mgorny/pkgcore-venv/lib/python2.7/site-packages/pkgcore/operations/regen.py", line 15, in regen_iter
 
- 75
    regen_func(x)
+            76
    regen_func(x)
 
- 76
  File "/home/mgorny/pkgcore-venv/lib/python2.7/site-packages/pkgcore/ebuild/repository.py", line 521, in __call__
+            77
  File "/home/mgorny/pkgcore-venv/lib/python2.7/site-packages/pkgcore/ebuild/repository.py", line 521, in __call__
 
- 77
    return pkg._fetch_metadata(ebp=self.ebp, force_regen=self.force)
+            78
    return pkg._fetch_metadata(ebp=self.ebp, force_regen=self.force)
 
- 78
  File "/home/mgorny/pkgcore-venv/lib/python2.7/site-packages/pkgcore/ebuild/ebuild_src.py", line 277, in _fetch_metadata
+            79
  File "/home/mgorny/pkgcore-venv/lib/python2.7/site-packages/pkgcore/ebuild/ebuild_src.py", line 277, in _fetch_metadata
 
- 79
    return self._parent._get_metadata(self, ebp=ebp, force_regen=force_regen)
+            80
    return self._parent._get_metadata(self, ebp=ebp, force_regen=force_regen)
 
- 80
  File "/home/mgorny/pkgcore-venv/lib/python2.7/site-packages/pkgcore/ebuild/ebuild_src.py", line 367, in _get_metadata
+            81
  File "/home/mgorny/pkgcore-venv/lib/python2.7/site-packages/pkgcore/ebuild/ebuild_src.py", line 367, in _get_metadata
 
- 81
    return self._update_metadata(pkg, ebp=ebp)
+            82
    return self._update_metadata(pkg, ebp=ebp)
 
- 82
  File "/home/mgorny/pkgcore-venv/lib/python2.7/site-packages/pkgcore/ebuild/ebuild_src.py", line 375, in _update_metadata
+            83
  File "/home/mgorny/pkgcore-venv/lib/python2.7/site-packages/pkgcore/ebuild/ebuild_src.py", line 375, in _update_metadata
 
- 83
    mydata = my_proc.get_keys(pkg, self._ecache)
+            84
    mydata = my_proc.get_keys(pkg, self._ecache)
 
- 84
  File "/home/mgorny/pkgcore-venv/lib/python2.7/site-packages/pkgcore/ebuild/processor.py", line 788, in get_keys
+            85
  File "/home/mgorny/pkgcore-venv/lib/python2.7/site-packages/pkgcore/ebuild/processor.py", line 788, in get_keys
 
- 85
    {"key": receive_key})
+            86
    {"key": receive_key})
 
- 86
  File "/home/mgorny/pkgcore-venv/lib/python2.7/site-packages/pkgcore/ebuild/processor.py", line 721, in _run_depend_like_phase
+            87
  File "/home/mgorny/pkgcore-venv/lib/python2.7/site-packages/pkgcore/ebuild/processor.py", line 721, in _run_depend_like_phase
 
- 87
    self.write("%s %i\n%s" % (command, len(data), data), append_newline=False)
+            88
    self.write("%s %i\n%s" % (command, len(data), data), append_newline=False)
 
- 88
  File "/home/mgorny/pkgcore-venv/lib/python2.7/site-packages/pkgcore/ebuild/processor.py", line 419, in write
+            89
  File "/home/mgorny/pkgcore-venv/lib/python2.7/site-packages/pkgcore/ebuild/processor.py", line 419, in write
 
- 89
    raise RuntimeError(ie)
+            90
    raise RuntimeError(ie)
 
- 90
RuntimeError: [Errno 32] Broken pipe
+            91
RuntimeError: [Errno 32] Broken pipe
 
- 91
 * Cache regen failed with 1
+            92
 * Cache regen failed with 1
 
diff --git a/stuge.txt b/stuge.txt index 7f9244f65a72..cbfbf9bbe6ad 100644 --- a/stuge.txt +++ b/stuge.txt @@ -56,6 +56,7 @@ ERROR pkgcore: returned val from gen_metadata was 'False' !!! caught exception False while processing ebuild src: app-misc/screen-4.0.3-r7 ERROR pkgcore: returned val from gen_metadata was 'False' !!! caught exception False while processing ebuild src: app-misc/taidelta-9999 +!!! caught exception ("Expected command; instead got nothing from ''", None) while processing ebuild src: app-misc/unlinkd-9999 Traceback (most recent call last): File "/home/mgorny/pkgcore-venv/bin/pmaint", line 4, in scripts.main(basename(__file__)) diff --git a/sunrise.html b/sunrise.html index 763249d74984..305b035b0796 100644 --- a/sunrise.html +++ b/sunrise.html @@ -216,11 +216,11 @@
[FATAL] 103
ERROR pkgcore: returned val from gen_metadata was 'False'
 
- 104
caught exception '%s' while processing '%s'(MetadataException('Metadata Exception: pkg ebuild src: games-rpg/lipsofsuna-0.5.0, attr description\nerror: Metadata Exception: pkg ebuild src: games-rpg/lipsofsuna-0.5.0, attr data\nerror: False',), <<class 'pkgcore.ebuild.ebuild_src.package'> cpv='games-rpg/lipsofsuna-0.5.0' @0x7ff7b2c3d410>)
+            104
caught exception '%s' while processing '%s'(MetadataException('Metadata Exception: pkg ebuild src: games-rpg/lipsofsuna-0.5.0, attr description\nerror: Metadata Exception: pkg ebuild src: games-rpg/lipsofsuna-0.5.0, attr data\nerror: False',), <<class 'pkgcore.ebuild.ebuild_src.package'> cpv='games-rpg/lipsofsuna-0.5.0' @0x7f84e5a0b410>)
 
[FATAL] 105
ERROR pkgcore: returned val from gen_metadata was 'False'
 
- 106
caught exception '%s' while processing '%s'(MetadataException('Metadata Exception: pkg ebuild src: games-rpg/lipsofsuna-9999, attr description\nerror: Metadata Exception: pkg ebuild src: games-rpg/lipsofsuna-9999, attr data\nerror: False',), <<class 'pkgcore.ebuild.ebuild_src.package'> cpv='games-rpg/lipsofsuna-9999' @0x7ff7b2c3d550>)
+            106
caught exception '%s' while processing '%s'(MetadataException('Metadata Exception: pkg ebuild src: games-rpg/lipsofsuna-9999, attr description\nerror: Metadata Exception: pkg ebuild src: games-rpg/lipsofsuna-9999, attr data\nerror: False',), <<class 'pkgcore.ebuild.ebuild_src.package'> cpv='games-rpg/lipsofsuna-9999' @0x7f84e5a0b550>)
 
[FATAL] 107
 * Cache regen failed with 1
 
diff --git a/sunrise.txt b/sunrise.txt index 4336de865004..287b85f20df9 100644 --- a/sunrise.txt +++ b/sunrise.txt @@ -101,7 +101,7 @@ ERROR pkgcore: returned val from gen_metadata was 'False' ERROR pkgcore: returned val from gen_metadata was 'False' !!! caught exception False while processing ebuild src: games-rpg/lipsofsuna-9999 ERROR pkgcore: returned val from gen_metadata was 'False' -caught exception '%s' while processing '%s'(MetadataException('Metadata Exception: pkg ebuild src: games-rpg/lipsofsuna-0.5.0, attr description\nerror: Metadata Exception: pkg ebuild src: games-rpg/lipsofsuna-0.5.0, attr data\nerror: False',), < cpv='games-rpg/lipsofsuna-0.5.0' @0x7ff7b2c3d410>) +caught exception '%s' while processing '%s'(MetadataException('Metadata Exception: pkg ebuild src: games-rpg/lipsofsuna-0.5.0, attr description\nerror: Metadata Exception: pkg ebuild src: games-rpg/lipsofsuna-0.5.0, attr data\nerror: False',), < cpv='games-rpg/lipsofsuna-0.5.0' @0x7f84e5a0b410>) ERROR pkgcore: returned val from gen_metadata was 'False' -caught exception '%s' while processing '%s'(MetadataException('Metadata Exception: pkg ebuild src: games-rpg/lipsofsuna-9999, attr description\nerror: Metadata Exception: pkg ebuild src: games-rpg/lipsofsuna-9999, attr data\nerror: False',), < cpv='games-rpg/lipsofsuna-9999' @0x7ff7b2c3d550>) +caught exception '%s' while processing '%s'(MetadataException('Metadata Exception: pkg ebuild src: games-rpg/lipsofsuna-9999, attr description\nerror: Metadata Exception: pkg ebuild src: games-rpg/lipsofsuna-9999, attr data\nerror: False',), < cpv='games-rpg/lipsofsuna-9999' @0x7f84e5a0b550>) * Cache regen failed with 1 diff --git a/swegener.html b/swegener.html index 8c407369a7a0..265d0993984d 100644 --- a/swegener.html +++ b/swegener.html @@ -206,7 +206,7 @@
[FATAL] 98
ERROR pkgcore: returned val from gen_metadata was 'False'
 
- 99
caught exception '%s' while processing '%s'(MetadataException('Metadata Exception: pkg ebuild src: gnome-extra/brightside-1.4.0, attr description\nerror: Metadata Exception: pkg ebuild src: gnome-extra/brightside-1.4.0, attr data\nerror: False',), <<class 'pkgcore.ebuild.ebuild_src.package'> cpv='gnome-extra/brightside-1.4.0' @0x7f71f535b690>)
+            99
caught exception '%s' while processing '%s'(MetadataException('Metadata Exception: pkg ebuild src: gnome-extra/brightside-1.4.0, attr description\nerror: Metadata Exception: pkg ebuild src: gnome-extra/brightside-1.4.0, attr data\nerror: False',), <<class 'pkgcore.ebuild.ebuild_src.package'> cpv='gnome-extra/brightside-1.4.0' @0x7fa9bbcc8690>)
 
[FATAL] 100
 * Cache regen failed with 1
 
diff --git a/swegener.txt b/swegener.txt index b615ea120e86..d6932d4ad667 100644 --- a/swegener.txt +++ b/swegener.txt @@ -96,5 +96,5 @@ WARNING:pkgcore:repository at '/home/mgorny/repos/steveeJ' has unsupported profi ERROR pkgcore: returned val from gen_metadata was 'False' !!! caught exception False while processing ebuild src: gnome-extra/brightside-1.4.0 ERROR pkgcore: returned val from gen_metadata was 'False' -caught exception '%s' while processing '%s'(MetadataException('Metadata Exception: pkg ebuild src: gnome-extra/brightside-1.4.0, attr description\nerror: Metadata Exception: pkg ebuild src: gnome-extra/brightside-1.4.0, attr data\nerror: False',), < cpv='gnome-extra/brightside-1.4.0' @0x7f71f535b690>) +caught exception '%s' while processing '%s'(MetadataException('Metadata Exception: pkg ebuild src: gnome-extra/brightside-1.4.0, attr description\nerror: Metadata Exception: pkg ebuild src: gnome-extra/brightside-1.4.0, attr data\nerror: False',), < cpv='gnome-extra/brightside-1.4.0' @0x7fa9bbcc8690>) * Cache regen failed with 1 diff --git a/vdr-testing.html b/vdr-testing.html index 92ce888da099..6470ecb61f1f 100644 --- a/vdr-testing.html +++ b/vdr-testing.html @@ -62,9 +62,9 @@
[FATAL] 26
error: parsed eapi '0' doesn't match sourced eapi '2' while processing ebuild src: media-tv/s2-liplianin-0.1
 
- 27
caught exception '%s' while processing '%s'(MetadataException("Metadata Exception: pkg ebuild src: media-tv/mantis-v4l-dvb-hg-0.1, attr description\nerror: Metadata Exception: pkg ebuild src: media-tv/mantis-v4l-dvb-hg-0.1, attr data\nerror: Metadata Exception: pkg ebuild src: media-tv/mantis-v4l-dvb-hg-0.1, attr eapi\nerror: parsed eapi '0' doesn't match sourced eapi '2'",), <<class 'pkgcore.ebuild.ebuild_src.package'> cpv='media-tv/mantis-v4l-dvb-hg-0.1' @0x7f9b8bc37550>)
+            27
caught exception '%s' while processing '%s'(MetadataException("Metadata Exception: pkg ebuild src: media-tv/mantis-v4l-dvb-hg-0.1, attr description\nerror: Metadata Exception: pkg ebuild src: media-tv/mantis-v4l-dvb-hg-0.1, attr data\nerror: Metadata Exception: pkg ebuild src: media-tv/mantis-v4l-dvb-hg-0.1, attr eapi\nerror: parsed eapi '0' doesn't match sourced eapi '2'",), <<class 'pkgcore.ebuild.ebuild_src.package'> cpv='media-tv/mantis-v4l-dvb-hg-0.1' @0x7f7abf5f7550>)
 
[FATAL] - 28
caught exception '%s' while processing '%s'(MetadataException("Metadata Exception: pkg ebuild src: media-tv/s2-liplianin-0.1, attr description\nerror: Metadata Exception: pkg ebuild src: media-tv/s2-liplianin-0.1, attr data\nerror: Metadata Exception: pkg ebuild src: media-tv/s2-liplianin-0.1, attr eapi\nerror: parsed eapi '0' doesn't match sourced eapi '2'",), <<class 'pkgcore.ebuild.ebuild_src.package'> cpv='media-tv/s2-liplianin-0.1' @0x7f9b8bc37690>)
+            28
caught exception '%s' while processing '%s'(MetadataException("Metadata Exception: pkg ebuild src: media-tv/s2-liplianin-0.1, attr description\nerror: Metadata Exception: pkg ebuild src: media-tv/s2-liplianin-0.1, attr data\nerror: Metadata Exception: pkg ebuild src: media-tv/s2-liplianin-0.1, attr eapi\nerror: parsed eapi '0' doesn't match sourced eapi '2'",), <<class 'pkgcore.ebuild.ebuild_src.package'> cpv='media-tv/s2-liplianin-0.1' @0x7f7abf5f7690>)
 
[FATAL] 29
 * Cache regen failed with 1
 
diff --git a/vdr-testing.txt b/vdr-testing.txt index 6c2be64504c8..993e3c983229 100644 --- a/vdr-testing.txt +++ b/vdr-testing.txt @@ -24,6 +24,6 @@ WARNING:pkgcore:repository at '/home/mgorny/repos/steveeJ' has unsupported profi error: parsed eapi '0' doesn't match sourced eapi '2' while processing ebuild src: media-tv/mantis-v4l-dvb-hg-0.1 !!! caught exception Metadata Exception: pkg ebuild src: media-tv/s2-liplianin-0.1, attr eapi error: parsed eapi '0' doesn't match sourced eapi '2' while processing ebuild src: media-tv/s2-liplianin-0.1 -caught exception '%s' while processing '%s'(MetadataException("Metadata Exception: pkg ebuild src: media-tv/mantis-v4l-dvb-hg-0.1, attr description\nerror: Metadata Exception: pkg ebuild src: media-tv/mantis-v4l-dvb-hg-0.1, attr data\nerror: Metadata Exception: pkg ebuild src: media-tv/mantis-v4l-dvb-hg-0.1, attr eapi\nerror: parsed eapi '0' doesn't match sourced eapi '2'",), < cpv='media-tv/mantis-v4l-dvb-hg-0.1' @0x7f9b8bc37550>) -caught exception '%s' while processing '%s'(MetadataException("Metadata Exception: pkg ebuild src: media-tv/s2-liplianin-0.1, attr description\nerror: Metadata Exception: pkg ebuild src: media-tv/s2-liplianin-0.1, attr data\nerror: Metadata Exception: pkg ebuild src: media-tv/s2-liplianin-0.1, attr eapi\nerror: parsed eapi '0' doesn't match sourced eapi '2'",), < cpv='media-tv/s2-liplianin-0.1' @0x7f9b8bc37690>) +caught exception '%s' while processing '%s'(MetadataException("Metadata Exception: pkg ebuild src: media-tv/mantis-v4l-dvb-hg-0.1, attr description\nerror: Metadata Exception: pkg ebuild src: media-tv/mantis-v4l-dvb-hg-0.1, attr data\nerror: Metadata Exception: pkg ebuild src: media-tv/mantis-v4l-dvb-hg-0.1, attr eapi\nerror: parsed eapi '0' doesn't match sourced eapi '2'",), < cpv='media-tv/mantis-v4l-dvb-hg-0.1' @0x7f7abf5f7550>) +caught exception '%s' while processing '%s'(MetadataException("Metadata Exception: pkg ebuild src: media-tv/s2-liplianin-0.1, attr description\nerror: Metadata Exception: pkg ebuild src: media-tv/s2-liplianin-0.1, attr data\nerror: Metadata Exception: pkg ebuild src: media-tv/s2-liplianin-0.1, attr eapi\nerror: parsed eapi '0' doesn't match sourced eapi '2'",), < cpv='media-tv/s2-liplianin-0.1' @0x7f7abf5f7690>) * Cache regen failed with 1 diff --git a/wtk.html b/wtk.html index 5a703a0264d5..593d4f179ebd 100644 --- a/wtk.html +++ b/wtk.html @@ -292,15 +292,15 @@
[FATAL] 141
ERROR pkgcore: returned val from gen_metadata was 'False'
 
- 142
caught exception '%s' while processing '%s'(MetadataException('Metadata Exception: pkg ebuild src: perl-gcpan/Crypt-X509-0.51, attr description\nerror: Metadata Exception: pkg ebuild src: perl-gcpan/Crypt-X509-0.51, attr data\nerror: False',), <<class 'pkgcore.ebuild.ebuild_src.package'> cpv='perl-gcpan/Crypt-X509-0.51' @0x7f767bafd910>)
+            142
caught exception '%s' while processing '%s'(MetadataException('Metadata Exception: pkg ebuild src: perl-gcpan/Crypt-X509-0.51, attr description\nerror: Metadata Exception: pkg ebuild src: perl-gcpan/Crypt-X509-0.51, attr data\nerror: False',), <<class 'pkgcore.ebuild.ebuild_src.package'> cpv='perl-gcpan/Crypt-X509-0.51' @0x7f109e7e4910>)
 
[FATAL] 143
ERROR pkgcore: returned val from gen_metadata was 'False'
 
- 144
caught exception '%s' while processing '%s'(MetadataException('Metadata Exception: pkg ebuild src: perl-gcpan/MathML-Entities-0.17, attr description\nerror: Metadata Exception: pkg ebuild src: perl-gcpan/MathML-Entities-0.17, attr data\nerror: False',), <<class 'pkgcore.ebuild.ebuild_src.package'> cpv='perl-gcpan/MathML-Entities-0.17' @0x7f767bafda50>)
+            144
caught exception '%s' while processing '%s'(MetadataException('Metadata Exception: pkg ebuild src: perl-gcpan/MathML-Entities-0.17, attr description\nerror: Metadata Exception: pkg ebuild src: perl-gcpan/MathML-Entities-0.17, attr data\nerror: False',), <<class 'pkgcore.ebuild.ebuild_src.package'> cpv='perl-gcpan/MathML-Entities-0.17' @0x7f109e7e4a50>)
 
[FATAL] 145
ERROR pkgcore: returned val from gen_metadata was 'False'
 
- 146
caught exception '%s' while processing '%s'(MetadataException('Metadata Exception: pkg ebuild src: app-crypt/msva-perl-9999, attr description\nerror: Metadata Exception: pkg ebuild src: app-crypt/msva-perl-9999, attr data\nerror: False',), <<class 'pkgcore.ebuild.ebuild_src.package'> cpv='app-crypt/msva-perl-9999' @0x7f767bb05a50>)
+            146
caught exception '%s' while processing '%s'(MetadataException('Metadata Exception: pkg ebuild src: app-crypt/msva-perl-9999, attr description\nerror: Metadata Exception: pkg ebuild src: app-crypt/msva-perl-9999, attr data\nerror: False',), <<class 'pkgcore.ebuild.ebuild_src.package'> cpv='app-crypt/msva-perl-9999' @0x7f109e7eca50>)
 
[FATAL] 147
 * Cache regen failed with 1
 
diff --git a/wtk.txt b/wtk.txt index cb71bf5b5119..48b2354c6a28 100644 --- a/wtk.txt +++ b/wtk.txt @@ -139,9 +139,9 @@ ERROR pkgcore: returned val from gen_metadata was 'False' ERROR pkgcore: returned val from gen_metadata was 'False' !!! caught exception False while processing ebuild src: app-crypt/msva-perl-9999 ERROR pkgcore: returned val from gen_metadata was 'False' -caught exception '%s' while processing '%s'(MetadataException('Metadata Exception: pkg ebuild src: perl-gcpan/Crypt-X509-0.51, attr description\nerror: Metadata Exception: pkg ebuild src: perl-gcpan/Crypt-X509-0.51, attr data\nerror: False',), < cpv='perl-gcpan/Crypt-X509-0.51' @0x7f767bafd910>) +caught exception '%s' while processing '%s'(MetadataException('Metadata Exception: pkg ebuild src: perl-gcpan/Crypt-X509-0.51, attr description\nerror: Metadata Exception: pkg ebuild src: perl-gcpan/Crypt-X509-0.51, attr data\nerror: False',), < cpv='perl-gcpan/Crypt-X509-0.51' @0x7f109e7e4910>) ERROR pkgcore: returned val from gen_metadata was 'False' -caught exception '%s' while processing '%s'(MetadataException('Metadata Exception: pkg ebuild src: perl-gcpan/MathML-Entities-0.17, attr description\nerror: Metadata Exception: pkg ebuild src: perl-gcpan/MathML-Entities-0.17, attr data\nerror: False',), < cpv='perl-gcpan/MathML-Entities-0.17' @0x7f767bafda50>) +caught exception '%s' while processing '%s'(MetadataException('Metadata Exception: pkg ebuild src: perl-gcpan/MathML-Entities-0.17, attr description\nerror: Metadata Exception: pkg ebuild src: perl-gcpan/MathML-Entities-0.17, attr data\nerror: False',), < cpv='perl-gcpan/MathML-Entities-0.17' @0x7f109e7e4a50>) ERROR pkgcore: returned val from gen_metadata was 'False' -caught exception '%s' while processing '%s'(MetadataException('Metadata Exception: pkg ebuild src: app-crypt/msva-perl-9999, attr description\nerror: Metadata Exception: pkg ebuild src: app-crypt/msva-perl-9999, attr data\nerror: False',), < cpv='app-crypt/msva-perl-9999' @0x7f767bb05a50>) +caught exception '%s' while processing '%s'(MetadataException('Metadata Exception: pkg ebuild src: app-crypt/msva-perl-9999, attr description\nerror: Metadata Exception: pkg ebuild src: app-crypt/msva-perl-9999, attr data\nerror: False',), < cpv='app-crypt/msva-perl-9999' @0x7f109e7eca50>) * Cache regen failed with 1 diff --git a/wuodan.html b/wuodan.html index 1fc43829962e..995365cebab3 100644 --- a/wuodan.html +++ b/wuodan.html @@ -136,7 +136,7 @@
[FATAL] 63
ERROR pkgcore: returned val from gen_metadata was 'False'
 
- 64
caught exception '%s' while processing '%s'(MetadataException('Metadata Exception: pkg ebuild src: www-servers/apache-2.4.2-r1, attr description\nerror: Metadata Exception: pkg ebuild src: www-servers/apache-2.4.2-r1, attr data\nerror: False',), <<class 'pkgcore.ebuild.ebuild_src.package'> cpv='www-servers/apache-2.4.2-r1' @0x7f3da572de10>)
+            64
caught exception '%s' while processing '%s'(MetadataException('Metadata Exception: pkg ebuild src: www-servers/apache-2.4.2-r1, attr description\nerror: Metadata Exception: pkg ebuild src: www-servers/apache-2.4.2-r1, attr data\nerror: False',), <<class 'pkgcore.ebuild.ebuild_src.package'> cpv='www-servers/apache-2.4.2-r1' @0x7f6cb9c2ce10>)
 
[FATAL] 65
 * Cache regen failed with 1
 
diff --git a/wuodan.txt b/wuodan.txt index 35d2004f470b..241d12d789dd 100644 --- a/wuodan.txt +++ b/wuodan.txt @@ -61,5 +61,5 @@ WARNING:pkgcore:repository at '/home/mgorny/repos/steveeJ' has unsupported profi ERROR pkgcore: returned val from gen_metadata was 'False' !!! caught exception False while processing ebuild src: www-servers/apache-2.4.2-r1 ERROR pkgcore: returned val from gen_metadata was 'False' -caught exception '%s' while processing '%s'(MetadataException('Metadata Exception: pkg ebuild src: www-servers/apache-2.4.2-r1, attr description\nerror: Metadata Exception: pkg ebuild src: www-servers/apache-2.4.2-r1, attr data\nerror: False',), < cpv='www-servers/apache-2.4.2-r1' @0x7f3da572de10>) +caught exception '%s' while processing '%s'(MetadataException('Metadata Exception: pkg ebuild src: www-servers/apache-2.4.2-r1, attr description\nerror: Metadata Exception: pkg ebuild src: www-servers/apache-2.4.2-r1, attr data\nerror: False',), < cpv='www-servers/apache-2.4.2-r1' @0x7f6cb9c2ce10>) * Cache regen failed with 1 diff --git a/xmw.html b/xmw.html index 71599ae68458..34f9803b8303 100644 --- a/xmw.html +++ b/xmw.html @@ -150,7 +150,7 @@
[FATAL] 70
ERROR pkgcore: returned val from gen_metadata was 'False'
 
- 71
caught exception '%s' while processing '%s'(MetadataException('Metadata Exception: pkg ebuild src: app-accessibility/florence-0.6.0, attr description\nerror: Metadata Exception: pkg ebuild src: app-accessibility/florence-0.6.0, attr data\nerror: False',), <<class 'pkgcore.ebuild.ebuild_src.package'> cpv='app-accessibility/florence-0.6.0' @0x7f9297445910>)
+            71
caught exception '%s' while processing '%s'(MetadataException('Metadata Exception: pkg ebuild src: app-accessibility/florence-0.6.0, attr description\nerror: Metadata Exception: pkg ebuild src: app-accessibility/florence-0.6.0, attr data\nerror: False',), <<class 'pkgcore.ebuild.ebuild_src.package'> cpv='app-accessibility/florence-0.6.0' @0x7f16e3f51910>)
 
[FATAL] 72
 * Cache regen failed with 1
 
diff --git a/xmw.txt b/xmw.txt index e0abd98be3af..02d18d058fa8 100644 --- a/xmw.txt +++ b/xmw.txt @@ -68,5 +68,5 @@ WARNING:pkgcore:repository at '/home/mgorny/repos/steveeJ' has unsupported profi ERROR pkgcore: returned val from gen_metadata was 'False' !!! caught exception False while processing ebuild src: app-accessibility/florence-0.6.0 ERROR pkgcore: returned val from gen_metadata was 'False' -caught exception '%s' while processing '%s'(MetadataException('Metadata Exception: pkg ebuild src: app-accessibility/florence-0.6.0, attr description\nerror: Metadata Exception: pkg ebuild src: app-accessibility/florence-0.6.0, attr data\nerror: False',), < cpv='app-accessibility/florence-0.6.0' @0x7f9297445910>) +caught exception '%s' while processing '%s'(MetadataException('Metadata Exception: pkg ebuild src: app-accessibility/florence-0.6.0, attr description\nerror: Metadata Exception: pkg ebuild src: app-accessibility/florence-0.6.0, attr data\nerror: False',), < cpv='app-accessibility/florence-0.6.0' @0x7f16e3f51910>) * Cache regen failed with 1 diff --git a/xwing.html b/xwing.html index 08865e20b021..7d516b7c8ae8 100644 --- a/xwing.html +++ b/xwing.html @@ -74,27 +74,79 @@
32
Total bytes sent: 85
 
- 33
Total bytes received: 133
+            33
Total bytes received: 130
 
34
 
- 35
sent 85 bytes  received 133 bytes  87.20 bytes/sec
+            35
sent 85 bytes  received 130 bytes  86.00 bytes/sec
 
36
total size is 32  speedup is 0.15
 
- 37
*** syncing xwing
+            37
This is xwing.info / coruscant.xwing.info
 
- 38
*** synced xwing
+            38
 
- 39
 * Sync succeeded
+            39
Server Address : 62.212.103.27 / 2001:7a8:2b1b::254
 
- 40
$ pmaint regen --use-local-desc --pkg-desc-index -t 1 xwing
+            40
Contact Name   : webmaster@xwing.info
 
- 41
WARNING:pkgcore:repository at '/home/mgorny/repos/steveeJ' has unsupported profile format(s): 'profile-set'
+            41
Hardware       : Intel Atom D510 @ 1.66GHz, 2048MB RAM
 
- 42
WARNING:pkgcore:repository at '/home/mgorny/repos/steveeJ' has unsupported profile format(s): 'profile-set'
+            42
 
- 43
 * Cache regenerated successfully
+            43
receiving incremental file list
+
+ 44
metadata/
+
+ 45
metadata/timestamp.chk
+
+ 46
+
+ 47
Number of files: 131 (reg: 84, dir: 45, link: 2)
+
+ 48
Number of created files: 0
+
+ 49
Number of deleted files: 0
+
+ 50
Number of regular files transferred: 1
+
+ 51
Total file size: 181.97K bytes
+
+ 52
Total transferred file size: 32 bytes
+
+ 53
Literal data: 32 bytes
+
+ 54
Matched data: 0 bytes
+
+ 55
File list size: 4.23K
+
+ 56
File list generation time: 0.001 seconds
+
+ 57
File list transfer time: 0.000 seconds
+
+ 58
Total bytes sent: 136
+
+ 59
Total bytes received: 4.36K
+
+ 60
+
+ 61
sent 136 bytes  received 4.36K bytes  1.80K bytes/sec
+
+ 62
total size is 181.97K  speedup is 40.45
+
+ 63
*** syncing xwing
+
+ 64
*** synced xwing
+
+ 65
 * Sync succeeded
+
+ 66
$ pmaint regen --use-local-desc --pkg-desc-index -t 1 xwing
+
+ 67
WARNING:pkgcore:repository at '/home/mgorny/repos/steveeJ' has unsupported profile format(s): 'profile-set'
+
+ 68
WARNING:pkgcore:repository at '/home/mgorny/repos/steveeJ' has unsupported profile format(s): 'profile-set'
+
+ 69
 * Cache regenerated successfully
 
diff --git a/xwing.txt b/xwing.txt index b955283f886d..84b35988f5ca 100644 --- a/xwing.txt +++ b/xwing.txt @@ -30,10 +30,36 @@ File list size: 47 File list generation time: 0.001 seconds File list transfer time: 0.000 seconds Total bytes sent: 85 -Total bytes received: 133 +Total bytes received: 130 -sent 85 bytes received 133 bytes 87.20 bytes/sec +sent 85 bytes received 130 bytes 86.00 bytes/sec total size is 32 speedup is 0.15 +This is xwing.info / coruscant.xwing.info + +Server Address : 62.212.103.27 / 2001:7a8:2b1b::254 +Contact Name : webmaster@xwing.info +Hardware : Intel Atom D510 @ 1.66GHz, 2048MB RAM + +receiving incremental file list +metadata/ +metadata/timestamp.chk + +Number of files: 131 (reg: 84, dir: 45, link: 2) +Number of created files: 0 +Number of deleted files: 0 +Number of regular files transferred: 1 +Total file size: 181.97K bytes +Total transferred file size: 32 bytes +Literal data: 32 bytes +Matched data: 0 bytes +File list size: 4.23K +File list generation time: 0.001 seconds +File list transfer time: 0.000 seconds +Total bytes sent: 136 +Total bytes received: 4.36K + +sent 136 bytes received 4.36K bytes 1.80K bytes/sec +total size is 181.97K speedup is 40.45 *** syncing xwing *** synced xwing * Sync succeeded diff --git a/zugaina.html b/zugaina.html index 3bf927490099..5a39bde73833 100644 --- a/zugaina.html +++ b/zugaina.html @@ -50,7 +50,7 @@
20
Matched data: 0 bytes
 
- 21
File list size: 45.12K
+            21
File list size: 42.48K
 
22
File list generation time: 0.001 seconds
 
diff --git a/zugaina.txt b/zugaina.txt index bed948173d5a..0dfc6a6de478 100644 --- a/zugaina.txt +++ b/zugaina.txt @@ -18,7 +18,7 @@ Total file size: 3.20M bytes Total transferred file size: 0 bytes Literal data: 0 bytes Matched data: 0 bytes -File list size: 45.12K +File list size: 42.48K File list generation time: 0.001 seconds File list transfer time: 0.000 seconds Total bytes sent: 602 -- cgit v1.2.3-65-gdbad