summaryrefslogtreecommitdiff
diff options
context:
space:
mode:
Diffstat (limited to 'humble.txt')
-rw-r--r--humble.txt6
1 files changed, 3 insertions, 3 deletions
diff --git a/humble.txt b/humble.txt
index c36d1d9f2584..8dd7f912da01 100644
--- a/humble.txt
+++ b/humble.txt
@@ -37,7 +37,7 @@ WARNING:pkgcore:repo at '/home/mgorny/repos/gentoo-playground', named 'gentoo-pl
* isolated-functions.lib, line 354: called source '/home/mgorny/repos/humble/games-puzzle/englishcountrytune/englishcountrytune-1370040672.ebuild'
* englishcountrytune-1370040672.ebuild, line 41: called command_not_found_handle 'arch'
* ebuild-daemon.bash, line 384: called die
-sandbox:stop caught signal 15 in pid 11333
+sandbox:stop caught signal 15 in pid 9239
Sandboxed process killed by signal: Terminated
* ERROR: games-puzzle/englishcountrytune-1370040672 failed (depend phase):
* External commands disallowed during metadata regen: arch
@@ -46,8 +46,8 @@ Sandboxed process killed by signal: Terminated
* isolated-functions.lib, line 354: called source '/home/mgorny/repos/humble/games-puzzle/englishcountrytune/englishcountrytune-1370040672.ebuild'
* englishcountrytune-1370040672.ebuild, line 41: called command_not_found_handle 'arch'
* ebuild-daemon.bash, line 384: called die
-sandbox:stop caught signal 15 in pid 11409
+sandbox:stop caught signal 15 in pid 9301
Sandboxed process killed by signal: Terminated
!!! caught exception False while processing ebuild src: games-puzzle/englishcountrytune-1370040672
-caught exception '%s' while processing '%s'(MetadataException('Metadata Exception: pkg ebuild src: games-puzzle/englishcountrytune-1370040672, attr description\nerror: Metadata Exception: pkg ebuild src: games-puzzle/englishcountrytune-1370040672, attr data\nerror: False',), <<class 'pkgcore.ebuild.ebuild_src.package'> cpv='games-puzzle/englishcountrytune-1370040672' @0x7ff9a0fe5830>)
+caught exception '%s' while processing '%s'(MetadataException('Metadata Exception: pkg ebuild src: games-puzzle/englishcountrytune-1370040672, attr description\nerror: Metadata Exception: pkg ebuild src: games-puzzle/englishcountrytune-1370040672, attr data\nerror: False',), <<class 'pkgcore.ebuild.ebuild_src.package'> cpv='games-puzzle/englishcountrytune-1370040672' @0x7f1f77262830>)
* Cache regen failed with 1