diff options
-rw-r--r-- | R_Overlay.html | 6 | ||||
-rw-r--r-- | R_Overlay.txt | 6 | ||||
-rw-r--r-- | alexxy.html | 2 | ||||
-rw-r--r-- | alexxy.txt | 2 | ||||
-rw-r--r-- | archenroot.html | 2 | ||||
-rw-r--r-- | archenroot.txt | 2 | ||||
-rw-r--r-- | benklop.html | 4 | ||||
-rw-r--r-- | benklop.txt | 4 | ||||
-rw-r--r-- | emery.html | 4 | ||||
-rw-r--r-- | emery.txt | 4 | ||||
-rw-r--r-- | ennui.html | 2 | ||||
-rw-r--r-- | ennui.txt | 2 | ||||
-rw-r--r-- | fidonet.html | 2 | ||||
-rw-r--r-- | fidonet.txt | 2 | ||||
-rw-r--r-- | gentoo.html | 30 | ||||
-rw-r--r-- | gentoo.txt | 10 | ||||
-rw-r--r-- | hacking-gentoo.html | 8 | ||||
-rw-r--r-- | hacking-gentoo.txt | 8 | ||||
-rw-r--r-- | index.html | 2 | ||||
-rw-r--r-- | lorelei.html | 4 | ||||
-rw-r--r-- | lorelei.txt | 4 | ||||
-rw-r--r-- | nikai.html | 4 | ||||
-rw-r--r-- | nikai.txt | 4 | ||||
-rw-r--r-- | poly-c.html | 2 | ||||
-rw-r--r-- | poly-c.txt | 2 | ||||
-rw-r--r-- | raiagent.html | 4 | ||||
-rw-r--r-- | raiagent.txt | 4 | ||||
-rw-r--r-- | rs-overlay.html | 4 | ||||
-rw-r--r-- | rs-overlay.txt | 4 | ||||
-rw-r--r-- | swegener.html | 8 | ||||
-rw-r--r-- | swegener.txt | 8 | ||||
-rw-r--r-- | ultrabug.html | 62 | ||||
-rw-r--r-- | ultrabug.txt | 9 | ||||
-rw-r--r-- | v-fox.html | 4 | ||||
-rw-r--r-- | v-fox.txt | 4 | ||||
-rw-r--r-- | vaca.html | 8 | ||||
-rw-r--r-- | vaca.txt | 8 | ||||
-rw-r--r-- | xwing.html | 2 | ||||
-rw-r--r-- | xwing.txt | 2 | ||||
-rw-r--r-- | y2kbadbug.html | 2 | ||||
-rw-r--r-- | y2kbadbug.txt | 2 | ||||
-rw-r--r-- | zugaina.html | 10 | ||||
-rw-r--r-- | zugaina.txt | 10 |
43 files changed, 116 insertions, 161 deletions
diff --git a/R_Overlay.html b/R_Overlay.html index efbeae171084..94b5ea61944a 100644 --- a/R_Overlay.html +++ b/R_Overlay.html @@ -52,19 +52,19 @@ </pre></td></tr> <tr class="" id="l21"><td><a href="#l21"><span>21</span></a></td><td><pre>Matched data: 0 bytes </pre></td></tr> - <tr class="" id="l22"><td><a href="#l22"><span>22</span></a></td><td><pre>File list size: 2.94M + <tr class="" id="l22"><td><a href="#l22"><span>22</span></a></td><td><pre>File list size: 2.97M </pre></td></tr> <tr class="" id="l23"><td><a href="#l23"><span>23</span></a></td><td><pre>File list generation time: 0.001 seconds </pre></td></tr> <tr class="" id="l24"><td><a href="#l24"><span>24</span></a></td><td><pre>File list transfer time: 0.000 seconds </pre></td></tr> - <tr class="" id="l25"><td><a href="#l25"><span>25</span></a></td><td><pre>Total bytes sent: 15.00K + <tr class="" id="l25"><td><a href="#l25"><span>25</span></a></td><td><pre>Total bytes sent: 14.96K </pre></td></tr> <tr class="" id="l26"><td><a href="#l26"><span>26</span></a></td><td><pre>Total bytes received: 3.19M </pre></td></tr> <tr class="" id="l27"><td><a href="#l27"><span>27</span></a></td><td><pre> </pre></td></tr> - <tr class="" id="l28"><td><a href="#l28"><span>28</span></a></td><td><pre>sent 15.00K bytes received 3.19M bytes 194.16K bytes/sec + <tr class="" id="l28"><td><a href="#l28"><span>28</span></a></td><td><pre>sent 14.96K bytes received 3.19M bytes 194.15K bytes/sec </pre></td></tr> <tr class="" id="l29"><td><a href="#l29"><span>29</span></a></td><td><pre>total size is 86.62M speedup is 27.04 </pre></td></tr> diff --git a/R_Overlay.txt b/R_Overlay.txt index da5484f8c32f..9bcd49d9236f 100644 --- a/R_Overlay.txt +++ b/R_Overlay.txt @@ -19,13 +19,13 @@ Total file size: 86.62M bytes Total transferred file size: 0 bytes Literal data: 0 bytes Matched data: 0 bytes -File list size: 2.94M +File list size: 2.97M File list generation time: 0.001 seconds File list transfer time: 0.000 seconds -Total bytes sent: 15.00K +Total bytes sent: 14.96K Total bytes received: 3.19M -sent 15.00K bytes received 3.19M bytes 194.16K bytes/sec +sent 14.96K bytes received 3.19M bytes 194.15K bytes/sec total size is 86.62M speedup is 27.04 *** syncing R_Overlay *** synced R_Overlay diff --git a/alexxy.html b/alexxy.html index 546f2083bf42..62476b706eb3 100644 --- a/alexxy.html +++ b/alexxy.html @@ -98,7 +98,7 @@ </pre></td><td>[FATAL]</td></tr> <tr class="" id="l44"><td><a href="#l44"><span>44</span></a></td><td><pre>ERROR pkgcore: returned val from gen_metadata was 'False' </pre></td></tr> - <tr class="err" id="l45"><td><a href="#l45"><span>45</span></a></td><td><pre>caught exception '%s' while processing '%s'(MetadataException('Metadata Exception: pkg ebuild src: dev-qt/qtwebengine-5.5.1, attr description\nerror: Metadata Exception: pkg ebuild src: dev-qt/qtwebengine-5.5.1, attr data\nerror: False',), <<class 'pkgcore.ebuild.ebuild_src.package'> cpv='dev-qt/qtwebengine-5.5.1' @0x7ff3fe2422e0>) + <tr class="err" id="l45"><td><a href="#l45"><span>45</span></a></td><td><pre>caught exception '%s' while processing '%s'(MetadataException('Metadata Exception: pkg ebuild src: dev-qt/qtwebengine-5.5.1, attr description\nerror: Metadata Exception: pkg ebuild src: dev-qt/qtwebengine-5.5.1, attr data\nerror: False',), <<class 'pkgcore.ebuild.ebuild_src.package'> cpv='dev-qt/qtwebengine-5.5.1' @0x7f5efb3e42e0>) </pre></td><td>[FATAL]</td></tr> <tr class="" id="l46"><td><a href="#l46"><span>46</span></a></td><td><pre> * Cache regen failed with 1 </pre></td></tr> diff --git a/alexxy.txt b/alexxy.txt index 8b5f5e113ad5..704fd81d30a8 100644 --- a/alexxy.txt +++ b/alexxy.txt @@ -42,5 +42,5 @@ $ pmaint regen --use-local-desc --pkg-desc-index -t 1 alexxy ERROR pkgcore: returned val from gen_metadata was 'False' !!! caught exception False while processing ebuild src: dev-qt/qtwebengine-5.5.1 ERROR pkgcore: returned val from gen_metadata was 'False' -caught exception '%s' while processing '%s'(MetadataException('Metadata Exception: pkg ebuild src: dev-qt/qtwebengine-5.5.1, attr description\nerror: Metadata Exception: pkg ebuild src: dev-qt/qtwebengine-5.5.1, attr data\nerror: False',), <<class 'pkgcore.ebuild.ebuild_src.package'> cpv='dev-qt/qtwebengine-5.5.1' @0x7ff3fe2422e0>) +caught exception '%s' while processing '%s'(MetadataException('Metadata Exception: pkg ebuild src: dev-qt/qtwebengine-5.5.1, attr description\nerror: Metadata Exception: pkg ebuild src: dev-qt/qtwebengine-5.5.1, attr data\nerror: False',), <<class 'pkgcore.ebuild.ebuild_src.package'> cpv='dev-qt/qtwebengine-5.5.1' @0x7f5efb3e42e0>) * Cache regen failed with 1 diff --git a/archenroot.html b/archenroot.html index f7a98da6441d..d42446554edf 100644 --- a/archenroot.html +++ b/archenroot.html @@ -90,7 +90,7 @@ </pre></td><td>[FATAL]</td></tr> <tr class="" id="l40"><td><a href="#l40"><span>40</span></a></td><td><pre>ERROR pkgcore: returned val from gen_metadata was 'False' </pre></td></tr> - <tr class="err" id="l41"><td><a href="#l41"><span>41</span></a></td><td><pre>caught exception '%s' while processing '%s'(MetadataException('Metadata Exception: pkg ebuild src: dev-java/ibm-sdk-java-1.6.0.9_p2, attr description\nerror: Metadata Exception: pkg ebuild src: dev-java/ibm-sdk-java-1.6.0.9_p2, attr data\nerror: False',), <<class 'pkgcore.ebuild.ebuild_src.package'> cpv='dev-java/ibm-sdk-java-1.6.0.9_p2' @0x7f82f0a09a90>) + <tr class="err" id="l41"><td><a href="#l41"><span>41</span></a></td><td><pre>caught exception '%s' while processing '%s'(MetadataException('Metadata Exception: pkg ebuild src: dev-java/ibm-sdk-java-1.6.0.9_p2, attr description\nerror: Metadata Exception: pkg ebuild src: dev-java/ibm-sdk-java-1.6.0.9_p2, attr data\nerror: False',), <<class 'pkgcore.ebuild.ebuild_src.package'> cpv='dev-java/ibm-sdk-java-1.6.0.9_p2' @0x7f3b81089a90>) </pre></td><td>[FATAL]</td></tr> <tr class="" id="l42"><td><a href="#l42"><span>42</span></a></td><td><pre> * Cache regen failed with 1 </pre></td></tr> diff --git a/archenroot.txt b/archenroot.txt index fe1aa015b9e2..81e9b9e590c1 100644 --- a/archenroot.txt +++ b/archenroot.txt @@ -38,5 +38,5 @@ $ pmaint regen --use-local-desc --pkg-desc-index -t 1 archenroot ERROR pkgcore: returned val from gen_metadata was 'False' !!! caught exception False while processing ebuild src: dev-java/ibm-sdk-java-1.6.0.9_p2 ERROR pkgcore: returned val from gen_metadata was 'False' -caught exception '%s' while processing '%s'(MetadataException('Metadata Exception: pkg ebuild src: dev-java/ibm-sdk-java-1.6.0.9_p2, attr description\nerror: Metadata Exception: pkg ebuild src: dev-java/ibm-sdk-java-1.6.0.9_p2, attr data\nerror: False',), <<class 'pkgcore.ebuild.ebuild_src.package'> cpv='dev-java/ibm-sdk-java-1.6.0.9_p2' @0x7f82f0a09a90>) +caught exception '%s' while processing '%s'(MetadataException('Metadata Exception: pkg ebuild src: dev-java/ibm-sdk-java-1.6.0.9_p2, attr description\nerror: Metadata Exception: pkg ebuild src: dev-java/ibm-sdk-java-1.6.0.9_p2, attr data\nerror: False',), <<class 'pkgcore.ebuild.ebuild_src.package'> cpv='dev-java/ibm-sdk-java-1.6.0.9_p2' @0x7f3b81089a90>) * Cache regen failed with 1 diff --git a/benklop.html b/benklop.html index 6df4855dced4..0299656ac1ac 100644 --- a/benklop.html +++ b/benklop.html @@ -88,13 +88,13 @@ </pre></td></tr> <tr class="" id="l39"><td><a href="#l39"><span>39</span></a></td><td><pre> * ebuild-daemon.lib, line 34: Called die </pre></td></tr> - <tr class="" id="l40"><td><a href="#l40"><span>40</span></a></td><td><pre>sandbox:stop caught signal 15 in pid 10893 + <tr class="" id="l40"><td><a href="#l40"><span>40</span></a></td><td><pre>sandbox:stop caught signal 15 in pid 5661 </pre></td></tr> <tr class="" id="l41"><td><a href="#l41"><span>41</span></a></td><td><pre>Sandboxed process killed by signal: Terminated </pre></td></tr> <tr class="err" id="l42"><td><a href="#l42"><span>42</span></a></td><td><pre>!!! caught exception inherit requires an unknown eclass, distutils cannot be found while processing ebuild src: app-misc/mplugd-9999-r1 </pre></td><td>[FATAL]</td></tr> - <tr class="err" id="l43"><td><a href="#l43"><span>43</span></a></td><td><pre>caught exception '%s' while processing '%s'(MetadataException('Metadata Exception: pkg ebuild src: app-misc/mplugd-9999-r1, attr description\nerror: Metadata Exception: pkg ebuild src: app-misc/mplugd-9999-r1, attr data\nerror: inherit requires an unknown eclass, distutils cannot be found',), <<class 'pkgcore.ebuild.ebuild_src.package'> cpv='app-misc/mplugd-9999-r1' @0x7f7b27761570>) + <tr class="err" id="l43"><td><a href="#l43"><span>43</span></a></td><td><pre>caught exception '%s' while processing '%s'(MetadataException('Metadata Exception: pkg ebuild src: app-misc/mplugd-9999-r1, attr description\nerror: Metadata Exception: pkg ebuild src: app-misc/mplugd-9999-r1, attr data\nerror: inherit requires an unknown eclass, distutils cannot be found',), <<class 'pkgcore.ebuild.ebuild_src.package'> cpv='app-misc/mplugd-9999-r1' @0x7fa69eab4570>) </pre></td><td>[FATAL]</td></tr> <tr class="" id="l44"><td><a href="#l44"><span>44</span></a></td><td><pre> * Cache regen failed with 1 </pre></td></tr> diff --git a/benklop.txt b/benklop.txt index 34e0912568fd..d7bc74cb294f 100644 --- a/benklop.txt +++ b/benklop.txt @@ -37,8 +37,8 @@ Sandboxed process killed by signal: Broken pipe * mplugd-9999-r1.ebuild, line 7: Called inherit 'git-2' 'distutils' 'user' * ebuild-default-functions.lib, line 209: Called __internal_inherit 'distutils' * ebuild-daemon.lib, line 34: Called die -sandbox:stop caught signal 15 in pid 10893 +sandbox:stop caught signal 15 in pid 5661 Sandboxed process killed by signal: Terminated !!! caught exception inherit requires an unknown eclass, distutils cannot be found while processing ebuild src: app-misc/mplugd-9999-r1 -caught exception '%s' while processing '%s'(MetadataException('Metadata Exception: pkg ebuild src: app-misc/mplugd-9999-r1, attr description\nerror: Metadata Exception: pkg ebuild src: app-misc/mplugd-9999-r1, attr data\nerror: inherit requires an unknown eclass, distutils cannot be found',), <<class 'pkgcore.ebuild.ebuild_src.package'> cpv='app-misc/mplugd-9999-r1' @0x7f7b27761570>) +caught exception '%s' while processing '%s'(MetadataException('Metadata Exception: pkg ebuild src: app-misc/mplugd-9999-r1, attr description\nerror: Metadata Exception: pkg ebuild src: app-misc/mplugd-9999-r1, attr data\nerror: inherit requires an unknown eclass, distutils cannot be found',), <<class 'pkgcore.ebuild.ebuild_src.package'> cpv='app-misc/mplugd-9999-r1' @0x7fa69eab4570>) * Cache regen failed with 1 diff --git a/emery.html b/emery.html index 625dcd34d44f..7141010a8528 100644 --- a/emery.html +++ b/emery.html @@ -86,13 +86,13 @@ </pre></td></tr> <tr class="" id="l38"><td><a href="#l38"><span>38</span></a></td><td><pre> * ebuild-daemon.lib, line 34: Called die </pre></td></tr> - <tr class="" id="l39"><td><a href="#l39"><span>39</span></a></td><td><pre>sandbox:stop caught signal 15 in pid 12950 + <tr class="" id="l39"><td><a href="#l39"><span>39</span></a></td><td><pre>sandbox:stop caught signal 15 in pid 7719 </pre></td></tr> <tr class="" id="l40"><td><a href="#l40"><span>40</span></a></td><td><pre>Sandboxed process killed by signal: Terminated </pre></td></tr> <tr class="err" id="l41"><td><a href="#l41"><span>41</span></a></td><td><pre>!!! caught exception inherit requires an unknown eclass, python cannot be found while processing ebuild src: dev-python/python-webm-0.2.2 </pre></td><td>[FATAL]</td></tr> - <tr class="err" id="l42"><td><a href="#l42"><span>42</span></a></td><td><pre>caught exception '%s' while processing '%s'(MetadataException('Metadata Exception: pkg ebuild src: dev-python/python-webm-0.2.2, attr description\nerror: Metadata Exception: pkg ebuild src: dev-python/python-webm-0.2.2, attr data\nerror: inherit requires an unknown eclass, python cannot be found',), <<class 'pkgcore.ebuild.ebuild_src.package'> cpv='dev-python/python-webm-0.2.2' @0x7f21b2c43e68>) + <tr class="err" id="l42"><td><a href="#l42"><span>42</span></a></td><td><pre>caught exception '%s' while processing '%s'(MetadataException('Metadata Exception: pkg ebuild src: dev-python/python-webm-0.2.2, attr description\nerror: Metadata Exception: pkg ebuild src: dev-python/python-webm-0.2.2, attr data\nerror: inherit requires an unknown eclass, python cannot be found',), <<class 'pkgcore.ebuild.ebuild_src.package'> cpv='dev-python/python-webm-0.2.2' @0x7f593bec1e68>) </pre></td><td>[FATAL]</td></tr> <tr class="" id="l43"><td><a href="#l43"><span>43</span></a></td><td><pre> * Cache regen failed with 1 </pre></td></tr> diff --git a/emery.txt b/emery.txt index a21d01b533b6..803455781ac3 100644 --- a/emery.txt +++ b/emery.txt @@ -36,8 +36,8 @@ Sandboxed process killed by signal: Broken pipe * python-webm-0.2.2.ebuild, line 10: Called inherit 'python' * ebuild-default-functions.lib, line 209: Called __internal_inherit 'python' * ebuild-daemon.lib, line 34: Called die -sandbox:stop caught signal 15 in pid 12950 +sandbox:stop caught signal 15 in pid 7719 Sandboxed process killed by signal: Terminated !!! caught exception inherit requires an unknown eclass, python cannot be found while processing ebuild src: dev-python/python-webm-0.2.2 -caught exception '%s' while processing '%s'(MetadataException('Metadata Exception: pkg ebuild src: dev-python/python-webm-0.2.2, attr description\nerror: Metadata Exception: pkg ebuild src: dev-python/python-webm-0.2.2, attr data\nerror: inherit requires an unknown eclass, python cannot be found',), <<class 'pkgcore.ebuild.ebuild_src.package'> cpv='dev-python/python-webm-0.2.2' @0x7f21b2c43e68>) +caught exception '%s' while processing '%s'(MetadataException('Metadata Exception: pkg ebuild src: dev-python/python-webm-0.2.2, attr description\nerror: Metadata Exception: pkg ebuild src: dev-python/python-webm-0.2.2, attr data\nerror: inherit requires an unknown eclass, python cannot be found',), <<class 'pkgcore.ebuild.ebuild_src.package'> cpv='dev-python/python-webm-0.2.2' @0x7f593bec1e68>) * Cache regen failed with 1 diff --git a/ennui.html b/ennui.html index 273b0250b086..92070105df7c 100644 --- a/ennui.html +++ b/ennui.html @@ -98,7 +98,7 @@ </pre></td><td>[FATAL]</td></tr> <tr class="" id="l44"><td><a href="#l44"><span>44</span></a></td><td><pre>ERROR pkgcore: returned val from gen_metadata was 'False' </pre></td></tr> - <tr class="err" id="l45"><td><a href="#l45"><span>45</span></a></td><td><pre>caught exception '%s' while processing '%s'(MetadataException('Metadata Exception: pkg ebuild src: dev-qt/qtnetwork-5.5.1-r100, attr description\nerror: Metadata Exception: pkg ebuild src: dev-qt/qtnetwork-5.5.1-r100, attr data\nerror: False',), <<class 'pkgcore.ebuild.ebuild_src.package'> cpv='dev-qt/qtnetwork-5.5.1-r100' @0x7fcc35a9cd20>) + <tr class="err" id="l45"><td><a href="#l45"><span>45</span></a></td><td><pre>caught exception '%s' while processing '%s'(MetadataException('Metadata Exception: pkg ebuild src: dev-qt/qtnetwork-5.5.1-r100, attr description\nerror: Metadata Exception: pkg ebuild src: dev-qt/qtnetwork-5.5.1-r100, attr data\nerror: False',), <<class 'pkgcore.ebuild.ebuild_src.package'> cpv='dev-qt/qtnetwork-5.5.1-r100' @0x7fc3444f9d20>) </pre></td><td>[FATAL]</td></tr> <tr class="" id="l46"><td><a href="#l46"><span>46</span></a></td><td><pre> * Cache regen failed with 1 </pre></td></tr> diff --git a/ennui.txt b/ennui.txt index 336d450a84d2..1bab192a6144 100644 --- a/ennui.txt +++ b/ennui.txt @@ -42,5 +42,5 @@ $ pmaint regen --use-local-desc --pkg-desc-index -t 1 ennui ERROR pkgcore: returned val from gen_metadata was 'False' !!! caught exception False while processing ebuild src: dev-qt/qtnetwork-5.5.1-r100 ERROR pkgcore: returned val from gen_metadata was 'False' -caught exception '%s' while processing '%s'(MetadataException('Metadata Exception: pkg ebuild src: dev-qt/qtnetwork-5.5.1-r100, attr description\nerror: Metadata Exception: pkg ebuild src: dev-qt/qtnetwork-5.5.1-r100, attr data\nerror: False',), <<class 'pkgcore.ebuild.ebuild_src.package'> cpv='dev-qt/qtnetwork-5.5.1-r100' @0x7fcc35a9cd20>) +caught exception '%s' while processing '%s'(MetadataException('Metadata Exception: pkg ebuild src: dev-qt/qtnetwork-5.5.1-r100, attr description\nerror: Metadata Exception: pkg ebuild src: dev-qt/qtnetwork-5.5.1-r100, attr data\nerror: False',), <<class 'pkgcore.ebuild.ebuild_src.package'> cpv='dev-qt/qtnetwork-5.5.1-r100' @0x7fc3444f9d20>) * Cache regen failed with 1 diff --git a/fidonet.html b/fidonet.html index c1240bcc0298..1905eb139a1b 100644 --- a/fidonet.html +++ b/fidonet.html @@ -68,7 +68,7 @@ </pre></td></tr> <tr class="" id="l29"><td><a href="#l29"><span>29</span></a></td><td><pre> </pre></td></tr> - <tr class="" id="l30"><td><a href="#l30"><span>30</span></a></td><td><pre>sent 85 bytes received 125 bytes 140.00 bytes/sec + <tr class="" id="l30"><td><a href="#l30"><span>30</span></a></td><td><pre>sent 85 bytes received 125 bytes 84.00 bytes/sec </pre></td></tr> <tr class="" id="l31"><td><a href="#l31"><span>31</span></a></td><td><pre>total size is 32 speedup is 0.15 </pre></td></tr> diff --git a/fidonet.txt b/fidonet.txt index 309de0d78d25..771744306146 100644 --- a/fidonet.txt +++ b/fidonet.txt @@ -27,7 +27,7 @@ File list transfer time: 0.000 seconds Total bytes sent: 85 Total bytes received: 125 -sent 85 bytes received 125 bytes 140.00 bytes/sec +sent 85 bytes received 125 bytes 84.00 bytes/sec total size is 32 speedup is 0.15 *** syncing fidonet *** synced fidonet diff --git a/gentoo.html b/gentoo.html index 9707ab117b34..2dc0bb1d6219 100644 --- a/gentoo.html +++ b/gentoo.html @@ -42,35 +42,19 @@ </pre></td></tr> <tr class="" id="l16"><td><a href="#l16"><span>16</span></a></td><td><pre>$ pmaint sync gentoo </pre></td></tr> - <tr class="" id="l17"><td><a href="#l17"><span>17</span></a></td><td><pre>From https://anongit.gentoo.org/git/repo/gentoo + <tr class="" id="l17"><td><a href="#l17"><span>17</span></a></td><td><pre>Already up-to-date. </pre></td></tr> - <tr class="" id="l18"><td><a href="#l18"><span>18</span></a></td><td><pre> 7c1902a79e..f60090b34e master -> origin/master + <tr class="" id="l18"><td><a href="#l18"><span>18</span></a></td><td><pre>*** syncing gentoo </pre></td></tr> - <tr class="" id="l19"><td><a href="#l19"><span>19</span></a></td><td><pre>Updating 7c1902a79e..f60090b34e + <tr class="" id="l19"><td><a href="#l19"><span>19</span></a></td><td><pre>*** synced gentoo </pre></td></tr> - <tr class="" id="l20"><td><a href="#l20"><span>20</span></a></td><td><pre>Fast-forward + <tr class="" id="l20"><td><a href="#l20"><span>20</span></a></td><td><pre> * Sync succeeded </pre></td></tr> - <tr class="" id="l21"><td><a href="#l21"><span>21</span></a></td><td><pre> dev-util/cmake/cmake-3.8.0-r1.ebuild | 201 +++++++++++++++++++++++++++++++++++ + <tr class="" id="l21"><td><a href="#l21"><span>21</span></a></td><td><pre>$ git log --format=%ci -1 </pre></td></tr> - <tr class="" id="l22"><td><a href="#l22"><span>22</span></a></td><td><pre> dev-util/cmake/metadata.xml | 1 + + <tr class="" id="l22"><td><a href="#l22"><span>22</span></a></td><td><pre>$ pmaint regen --use-local-desc --pkg-desc-index -t 1 gentoo </pre></td></tr> - <tr class="" id="l23"><td><a href="#l23"><span>23</span></a></td><td><pre> profiles/package.mask | 31 ++++++ -</pre></td></tr> - <tr class="" id="l24"><td><a href="#l24"><span>24</span></a></td><td><pre> 3 files changed, 233 insertions(+) -</pre></td></tr> - <tr class="" id="l25"><td><a href="#l25"><span>25</span></a></td><td><pre> create mode 100644 dev-util/cmake/cmake-3.8.0-r1.ebuild -</pre></td></tr> - <tr class="" id="l26"><td><a href="#l26"><span>26</span></a></td><td><pre>*** syncing gentoo -</pre></td></tr> - <tr class="" id="l27"><td><a href="#l27"><span>27</span></a></td><td><pre>*** synced gentoo -</pre></td></tr> - <tr class="" id="l28"><td><a href="#l28"><span>28</span></a></td><td><pre> * Sync succeeded -</pre></td></tr> - <tr class="" id="l29"><td><a href="#l29"><span>29</span></a></td><td><pre>$ git log --format=%ci -1 -</pre></td></tr> - <tr class="" id="l30"><td><a href="#l30"><span>30</span></a></td><td><pre>$ pmaint regen --use-local-desc --pkg-desc-index -t 1 gentoo -</pre></td></tr> - <tr class="" id="l31"><td><a href="#l31"><span>31</span></a></td><td><pre> * Cache regenerated successfully + <tr class="" id="l23"><td><a href="#l23"><span>23</span></a></td><td><pre> * Cache regenerated successfully </pre></td></tr> </table> diff --git a/gentoo.txt b/gentoo.txt index 4d33ce0ed61b..3837b5faf572 100644 --- a/gentoo.txt +++ b/gentoo.txt @@ -14,15 +14,7 @@ 'uri': 'git+ssh://git@git.gentoo.org/repo/gentoo.git'}], 'status': 'official'} $ pmaint sync gentoo -From https://anongit.gentoo.org/git/repo/gentoo - 7c1902a79e..f60090b34e master -> origin/master -Updating 7c1902a79e..f60090b34e -Fast-forward - dev-util/cmake/cmake-3.8.0-r1.ebuild | 201 +++++++++++++++++++++++++++++++++++ - dev-util/cmake/metadata.xml | 1 + - profiles/package.mask | 31 ++++++ - 3 files changed, 233 insertions(+) - create mode 100644 dev-util/cmake/cmake-3.8.0-r1.ebuild +Already up-to-date. *** syncing gentoo *** synced gentoo * Sync succeeded diff --git a/hacking-gentoo.html b/hacking-gentoo.html index 348f80383b58..2c188dabc35d 100644 --- a/hacking-gentoo.html +++ b/hacking-gentoo.html @@ -52,21 +52,21 @@ </pre></td></tr> <tr class="" id="l21"><td><a href="#l21"><span>21</span></a></td><td><pre>Matched data: 0 bytes </pre></td></tr> - <tr class="" id="l22"><td><a href="#l22"><span>22</span></a></td><td><pre>File list size: 42.71K + <tr class="" id="l22"><td><a href="#l22"><span>22</span></a></td><td><pre>File list size: 41.10K </pre></td></tr> <tr class="" id="l23"><td><a href="#l23"><span>23</span></a></td><td><pre>File list generation time: 0.001 seconds </pre></td></tr> <tr class="" id="l24"><td><a href="#l24"><span>24</span></a></td><td><pre>File list transfer time: 0.000 seconds </pre></td></tr> - <tr class="" id="l25"><td><a href="#l25"><span>25</span></a></td><td><pre>Total bytes sent: 446 + <tr class="" id="l25"><td><a href="#l25"><span>25</span></a></td><td><pre>Total bytes sent: 466 </pre></td></tr> <tr class="" id="l26"><td><a href="#l26"><span>26</span></a></td><td><pre>Total bytes received: 45.27K </pre></td></tr> <tr class="" id="l27"><td><a href="#l27"><span>27</span></a></td><td><pre> </pre></td></tr> - <tr class="" id="l28"><td><a href="#l28"><span>28</span></a></td><td><pre>sent 446 bytes received 45.27K bytes 18.29K bytes/sec + <tr class="" id="l28"><td><a href="#l28"><span>28</span></a></td><td><pre>sent 466 bytes received 45.27K bytes 18.30K bytes/sec </pre></td></tr> - <tr class="" id="l29"><td><a href="#l29"><span>29</span></a></td><td><pre>total size is 4.16M speedup is 91.01 + <tr class="" id="l29"><td><a href="#l29"><span>29</span></a></td><td><pre>total size is 4.16M speedup is 90.97 </pre></td></tr> <tr class="" id="l30"><td><a href="#l30"><span>30</span></a></td><td><pre>*** syncing hacking-gentoo </pre></td></tr> diff --git a/hacking-gentoo.txt b/hacking-gentoo.txt index 0c9ce820b5e6..2abaf2ca53f9 100644 --- a/hacking-gentoo.txt +++ b/hacking-gentoo.txt @@ -19,14 +19,14 @@ Total file size: 4.16M bytes Total transferred file size: 0 bytes Literal data: 0 bytes Matched data: 0 bytes -File list size: 42.71K +File list size: 41.10K File list generation time: 0.001 seconds File list transfer time: 0.000 seconds -Total bytes sent: 446 +Total bytes sent: 466 Total bytes received: 45.27K -sent 446 bytes received 45.27K bytes 18.29K bytes/sec -total size is 4.16M speedup is 91.01 +sent 466 bytes received 45.27K bytes 18.30K bytes/sec +total size is 4.16M speedup is 90.97 *** syncing hacking-gentoo *** synced hacking-gentoo * Sync succeeded diff --git a/index.html b/index.html index 540e6b278663..8c4310b841d0 100644 --- a/index.html +++ b/index.html @@ -876,7 +876,7 @@ </table> - <address>Generated based on results from 2017-04-28 08:24:13 UTC</address> + <address>Generated based on results from 2017-04-28 08:41:28 UTC</address> </body> </html>
\ No newline at end of file diff --git a/lorelei.html b/lorelei.html index 120ebdc3ba3c..5cec5d1f76b5 100644 --- a/lorelei.html +++ b/lorelei.html @@ -84,13 +84,13 @@ </pre></td></tr> <tr class="" id="l37"><td><a href="#l37"><span>37</span></a></td><td><pre> * ebuild-daemon.lib, line 34: Called die </pre></td></tr> - <tr class="" id="l38"><td><a href="#l38"><span>38</span></a></td><td><pre>sandbox:stop caught signal 15 in pid 16375 + <tr class="" id="l38"><td><a href="#l38"><span>38</span></a></td><td><pre>sandbox:stop caught signal 15 in pid 11088 </pre></td></tr> <tr class="" id="l39"><td><a href="#l39"><span>39</span></a></td><td><pre>Sandboxed process killed by signal: Terminated </pre></td></tr> <tr class="err" id="l40"><td><a href="#l40"><span>40</span></a></td><td><pre>!!! caught exception inherit requires an unknown eclass, distutils cannot be found while processing ebuild src: dev-python/gnosis-utils-1.2.2 </pre></td><td>[FATAL]</td></tr> - <tr class="err" id="l41"><td><a href="#l41"><span>41</span></a></td><td><pre>caught exception '%s' while processing '%s'(MetadataException('Metadata Exception: pkg ebuild src: dev-python/gnosis-utils-1.2.2, attr description\nerror: Metadata Exception: pkg ebuild src: dev-python/gnosis-utils-1.2.2, attr data\nerror: inherit requires an unknown eclass, distutils cannot be found',), <<class 'pkgcore.ebuild.ebuild_src.package'> cpv='dev-python/gnosis-utils-1.2.2' @0x7f95ce81cbd8>) + <tr class="err" id="l41"><td><a href="#l41"><span>41</span></a></td><td><pre>caught exception '%s' while processing '%s'(MetadataException('Metadata Exception: pkg ebuild src: dev-python/gnosis-utils-1.2.2, attr description\nerror: Metadata Exception: pkg ebuild src: dev-python/gnosis-utils-1.2.2, attr data\nerror: inherit requires an unknown eclass, distutils cannot be found',), <<class 'pkgcore.ebuild.ebuild_src.package'> cpv='dev-python/gnosis-utils-1.2.2' @0x7f31a47a4bd8>) </pre></td><td>[FATAL]</td></tr> <tr class="" id="l42"><td><a href="#l42"><span>42</span></a></td><td><pre> * Cache regen failed with 1 </pre></td></tr> diff --git a/lorelei.txt b/lorelei.txt index 3beabd060c9b..78a7ef4d6c25 100644 --- a/lorelei.txt +++ b/lorelei.txt @@ -35,8 +35,8 @@ Sandboxed process killed by signal: Broken pipe * gnosis-utils-1.2.2.ebuild, line 10: Called inherit 'distutils' 'eutils' * ebuild-default-functions.lib, line 209: Called __internal_inherit 'distutils' * ebuild-daemon.lib, line 34: Called die -sandbox:stop caught signal 15 in pid 16375 +sandbox:stop caught signal 15 in pid 11088 Sandboxed process killed by signal: Terminated !!! caught exception inherit requires an unknown eclass, distutils cannot be found while processing ebuild src: dev-python/gnosis-utils-1.2.2 -caught exception '%s' while processing '%s'(MetadataException('Metadata Exception: pkg ebuild src: dev-python/gnosis-utils-1.2.2, attr description\nerror: Metadata Exception: pkg ebuild src: dev-python/gnosis-utils-1.2.2, attr data\nerror: inherit requires an unknown eclass, distutils cannot be found',), <<class 'pkgcore.ebuild.ebuild_src.package'> cpv='dev-python/gnosis-utils-1.2.2' @0x7f95ce81cbd8>) +caught exception '%s' while processing '%s'(MetadataException('Metadata Exception: pkg ebuild src: dev-python/gnosis-utils-1.2.2, attr description\nerror: Metadata Exception: pkg ebuild src: dev-python/gnosis-utils-1.2.2, attr data\nerror: inherit requires an unknown eclass, distutils cannot be found',), <<class 'pkgcore.ebuild.ebuild_src.package'> cpv='dev-python/gnosis-utils-1.2.2' @0x7f31a47a4bd8>) * Cache regen failed with 1 diff --git a/nikai.html b/nikai.html index 5aaf937a483d..82de064dcec3 100644 --- a/nikai.html +++ b/nikai.html @@ -86,13 +86,13 @@ </pre></td></tr> <tr class="" id="l38"><td><a href="#l38"><span>38</span></a></td><td><pre> * ebuild-daemon.lib, line 34: Called die </pre></td></tr> - <tr class="" id="l39"><td><a href="#l39"><span>39</span></a></td><td><pre>sandbox:stop caught signal 15 in pid 17668 + <tr class="" id="l39"><td><a href="#l39"><span>39</span></a></td><td><pre>sandbox:stop caught signal 15 in pid 12419 </pre></td></tr> <tr class="" id="l40"><td><a href="#l40"><span>40</span></a></td><td><pre>Sandboxed process killed by signal: Terminated </pre></td></tr> <tr class="err" id="l41"><td><a href="#l41"><span>41</span></a></td><td><pre>!!! caught exception inherit requires an unknown eclass, python cannot be found while processing ebuild src: games-simulation/vegastrike-data-9999 </pre></td><td>[FATAL]</td></tr> - <tr class="err" id="l42"><td><a href="#l42"><span>42</span></a></td><td><pre>caught exception '%s' while processing '%s'(MetadataException('Metadata Exception: pkg ebuild src: games-simulation/vegastrike-data-9999, attr description\nerror: Metadata Exception: pkg ebuild src: games-simulation/vegastrike-data-9999, attr data\nerror: inherit requires an unknown eclass, python cannot be found',), <<class 'pkgcore.ebuild.ebuild_src.package'> cpv='games-simulation/vegastrike-data-9999' @0x7fd069840198>) + <tr class="err" id="l42"><td><a href="#l42"><span>42</span></a></td><td><pre>caught exception '%s' while processing '%s'(MetadataException('Metadata Exception: pkg ebuild src: games-simulation/vegastrike-data-9999, attr description\nerror: Metadata Exception: pkg ebuild src: games-simulation/vegastrike-data-9999, attr data\nerror: inherit requires an unknown eclass, python cannot be found',), <<class 'pkgcore.ebuild.ebuild_src.package'> cpv='games-simulation/vegastrike-data-9999' @0x7febfec04198>) </pre></td><td>[FATAL]</td></tr> <tr class="" id="l43"><td><a href="#l43"><span>43</span></a></td><td><pre> * Cache regen failed with 1 </pre></td></tr> diff --git a/nikai.txt b/nikai.txt index 717f1038606a..991256583184 100644 --- a/nikai.txt +++ b/nikai.txt @@ -36,8 +36,8 @@ Sandboxed process killed by signal: Broken pipe * vegastrike-data-9999.ebuild, line 7: Called inherit 'eutils' 'python' 'games' * ebuild-default-functions.lib, line 209: Called __internal_inherit 'python' * ebuild-daemon.lib, line 34: Called die -sandbox:stop caught signal 15 in pid 17668 +sandbox:stop caught signal 15 in pid 12419 Sandboxed process killed by signal: Terminated !!! caught exception inherit requires an unknown eclass, python cannot be found while processing ebuild src: games-simulation/vegastrike-data-9999 -caught exception '%s' while processing '%s'(MetadataException('Metadata Exception: pkg ebuild src: games-simulation/vegastrike-data-9999, attr description\nerror: Metadata Exception: pkg ebuild src: games-simulation/vegastrike-data-9999, attr data\nerror: inherit requires an unknown eclass, python cannot be found',), <<class 'pkgcore.ebuild.ebuild_src.package'> cpv='games-simulation/vegastrike-data-9999' @0x7fd069840198>) +caught exception '%s' while processing '%s'(MetadataException('Metadata Exception: pkg ebuild src: games-simulation/vegastrike-data-9999, attr description\nerror: Metadata Exception: pkg ebuild src: games-simulation/vegastrike-data-9999, attr data\nerror: inherit requires an unknown eclass, python cannot be found',), <<class 'pkgcore.ebuild.ebuild_src.package'> cpv='games-simulation/vegastrike-data-9999' @0x7febfec04198>) * Cache regen failed with 1 diff --git a/poly-c.html b/poly-c.html index fdf2c49396b1..b8c2399673b9 100644 --- a/poly-c.html +++ b/poly-c.html @@ -116,7 +116,7 @@ </pre></td></tr> <tr class="" id="l53"><td><a href="#l53"><span>53</span></a></td><td><pre> </pre></td></tr> - <tr class="" id="l54"><td><a href="#l54"><span>54</span></a></td><td><pre>sent 85 bytes received 133 bytes 87.20 bytes/sec + <tr class="" id="l54"><td><a href="#l54"><span>54</span></a></td><td><pre>sent 85 bytes received 133 bytes 145.33 bytes/sec </pre></td></tr> <tr class="" id="l55"><td><a href="#l55"><span>55</span></a></td><td><pre>total size is 32 speedup is 0.15 </pre></td></tr> diff --git a/poly-c.txt b/poly-c.txt index 0a7257e1970b..cab07be8226e 100644 --- a/poly-c.txt +++ b/poly-c.txt @@ -51,7 +51,7 @@ File list transfer time: 0.000 seconds Total bytes sent: 85 Total bytes received: 133 -sent 85 bytes received 133 bytes 87.20 bytes/sec +sent 85 bytes received 133 bytes 145.33 bytes/sec total size is 32 speedup is 0.15 *** syncing poly-c *** synced poly-c diff --git a/raiagent.html b/raiagent.html index e4481cb6f47b..65e15752f78b 100644 --- a/raiagent.html +++ b/raiagent.html @@ -78,13 +78,13 @@ </pre></td></tr> <tr class="" id="l34"><td><a href="#l34"><span>34</span></a></td><td><pre> * ebuild-daemon.lib, line 34: Called die </pre></td></tr> - <tr class="" id="l35"><td><a href="#l35"><span>35</span></a></td><td><pre>sandbox:stop caught signal 15 in pid 19081 + <tr class="" id="l35"><td><a href="#l35"><span>35</span></a></td><td><pre>sandbox:stop caught signal 15 in pid 13918 </pre></td></tr> <tr class="" id="l36"><td><a href="#l36"><span>36</span></a></td><td><pre>Sandboxed process killed by signal: Terminated </pre></td></tr> <tr class="err" id="l37"><td><a href="#l37"><span>37</span></a></td><td><pre>!!! caught exception inherit requires an unknown eclass, python cannot be found while processing ebuild src: media-video/devede-3.23.0 </pre></td><td>[FATAL]</td></tr> - <tr class="err" id="l38"><td><a href="#l38"><span>38</span></a></td><td><pre>caught exception '%s' while processing '%s'(MetadataException('Metadata Exception: pkg ebuild src: media-video/devede-3.23.0, attr description\nerror: Metadata Exception: pkg ebuild src: media-video/devede-3.23.0, attr data\nerror: inherit requires an unknown eclass, python cannot be found',), <<class 'pkgcore.ebuild.ebuild_src.package'> cpv='media-video/devede-3.23.0' @0x7fd997332d20>) + <tr class="err" id="l38"><td><a href="#l38"><span>38</span></a></td><td><pre>caught exception '%s' while processing '%s'(MetadataException('Metadata Exception: pkg ebuild src: media-video/devede-3.23.0, attr description\nerror: Metadata Exception: pkg ebuild src: media-video/devede-3.23.0, attr data\nerror: inherit requires an unknown eclass, python cannot be found',), <<class 'pkgcore.ebuild.ebuild_src.package'> cpv='media-video/devede-3.23.0' @0x7faf25e11d20>) </pre></td><td>[FATAL]</td></tr> <tr class="" id="l39"><td><a href="#l39"><span>39</span></a></td><td><pre> * Cache regen failed with 1 </pre></td></tr> diff --git a/raiagent.txt b/raiagent.txt index 3006cc73b702..07dad7d1be36 100644 --- a/raiagent.txt +++ b/raiagent.txt @@ -32,8 +32,8 @@ Sandboxed process killed by signal: Broken pipe * devede-3.23.0.ebuild, line 10: Called inherit 'multilib' 'python' * ebuild-default-functions.lib, line 209: Called __internal_inherit 'python' * ebuild-daemon.lib, line 34: Called die -sandbox:stop caught signal 15 in pid 19081 +sandbox:stop caught signal 15 in pid 13918 Sandboxed process killed by signal: Terminated !!! caught exception inherit requires an unknown eclass, python cannot be found while processing ebuild src: media-video/devede-3.23.0 -caught exception '%s' while processing '%s'(MetadataException('Metadata Exception: pkg ebuild src: media-video/devede-3.23.0, attr description\nerror: Metadata Exception: pkg ebuild src: media-video/devede-3.23.0, attr data\nerror: inherit requires an unknown eclass, python cannot be found',), <<class 'pkgcore.ebuild.ebuild_src.package'> cpv='media-video/devede-3.23.0' @0x7fd997332d20>) +caught exception '%s' while processing '%s'(MetadataException('Metadata Exception: pkg ebuild src: media-video/devede-3.23.0, attr description\nerror: Metadata Exception: pkg ebuild src: media-video/devede-3.23.0, attr data\nerror: inherit requires an unknown eclass, python cannot be found',), <<class 'pkgcore.ebuild.ebuild_src.package'> cpv='media-video/devede-3.23.0' @0x7faf25e11d20>) * Cache regen failed with 1 diff --git a/rs-overlay.html b/rs-overlay.html index 1f22e60968fc..5040ccdb08f8 100644 --- a/rs-overlay.html +++ b/rs-overlay.html @@ -136,11 +136,11 @@ </pre></td><td>[FATAL]</td></tr> <tr class="" id="l63"><td><a href="#l63"><span>63</span></a></td><td><pre>ERROR pkgcore: returned val from gen_metadata was 'False' </pre></td></tr> - <tr class="err" id="l64"><td><a href="#l64"><span>64</span></a></td><td><pre>caught exception '%s' while processing '%s'(MetadataException('Metadata Exception: pkg ebuild src: dev-qt/qtnetwork-5.5.1, attr description\nerror: Metadata Exception: pkg ebuild src: dev-qt/qtnetwork-5.5.1, attr data\nerror: False',), <<class 'pkgcore.ebuild.ebuild_src.package'> cpv='dev-qt/qtnetwork-5.5.1' @0x7fcdfb4f6570>) + <tr class="err" id="l64"><td><a href="#l64"><span>64</span></a></td><td><pre>caught exception '%s' while processing '%s'(MetadataException('Metadata Exception: pkg ebuild src: dev-qt/qtnetwork-5.5.1, attr description\nerror: Metadata Exception: pkg ebuild src: dev-qt/qtnetwork-5.5.1, attr data\nerror: False',), <<class 'pkgcore.ebuild.ebuild_src.package'> cpv='dev-qt/qtnetwork-5.5.1' @0x7f508f358570>) </pre></td><td>[FATAL]</td></tr> <tr class="" id="l65"><td><a href="#l65"><span>65</span></a></td><td><pre>ERROR pkgcore: returned val from gen_metadata was 'False' </pre></td></tr> - <tr class="err" id="l66"><td><a href="#l66"><span>66</span></a></td><td><pre>caught exception '%s' while processing '%s'(MetadataException('Metadata Exception: pkg ebuild src: dev-qt/qtnetwork-5.6.0, attr description\nerror: Metadata Exception: pkg ebuild src: dev-qt/qtnetwork-5.6.0, attr data\nerror: False',), <<class 'pkgcore.ebuild.ebuild_src.package'> cpv='dev-qt/qtnetwork-5.6.0' @0x7fcdfb4f66b8>) + <tr class="err" id="l66"><td><a href="#l66"><span>66</span></a></td><td><pre>caught exception '%s' while processing '%s'(MetadataException('Metadata Exception: pkg ebuild src: dev-qt/qtnetwork-5.6.0, attr description\nerror: Metadata Exception: pkg ebuild src: dev-qt/qtnetwork-5.6.0, attr data\nerror: False',), <<class 'pkgcore.ebuild.ebuild_src.package'> cpv='dev-qt/qtnetwork-5.6.0' @0x7f508f3586b8>) </pre></td><td>[FATAL]</td></tr> <tr class="" id="l67"><td><a href="#l67"><span>67</span></a></td><td><pre> * Cache regen failed with 1 </pre></td></tr> diff --git a/rs-overlay.txt b/rs-overlay.txt index 06a1b2c577ea..e70069727838 100644 --- a/rs-overlay.txt +++ b/rs-overlay.txt @@ -61,7 +61,7 @@ ERROR pkgcore: returned val from gen_metadata was 'False' ERROR pkgcore: returned val from gen_metadata was 'False' !!! caught exception False while processing ebuild src: dev-qt/qtnetwork-5.6.0 ERROR pkgcore: returned val from gen_metadata was 'False' -caught exception '%s' while processing '%s'(MetadataException('Metadata Exception: pkg ebuild src: dev-qt/qtnetwork-5.5.1, attr description\nerror: Metadata Exception: pkg ebuild src: dev-qt/qtnetwork-5.5.1, attr data\nerror: False',), <<class 'pkgcore.ebuild.ebuild_src.package'> cpv='dev-qt/qtnetwork-5.5.1' @0x7fcdfb4f6570>) +caught exception '%s' while processing '%s'(MetadataException('Metadata Exception: pkg ebuild src: dev-qt/qtnetwork-5.5.1, attr description\nerror: Metadata Exception: pkg ebuild src: dev-qt/qtnetwork-5.5.1, attr data\nerror: False',), <<class 'pkgcore.ebuild.ebuild_src.package'> cpv='dev-qt/qtnetwork-5.5.1' @0x7f508f358570>) ERROR pkgcore: returned val from gen_metadata was 'False' -caught exception '%s' while processing '%s'(MetadataException('Metadata Exception: pkg ebuild src: dev-qt/qtnetwork-5.6.0, attr description\nerror: Metadata Exception: pkg ebuild src: dev-qt/qtnetwork-5.6.0, attr data\nerror: False',), <<class 'pkgcore.ebuild.ebuild_src.package'> cpv='dev-qt/qtnetwork-5.6.0' @0x7fcdfb4f66b8>) +caught exception '%s' while processing '%s'(MetadataException('Metadata Exception: pkg ebuild src: dev-qt/qtnetwork-5.6.0, attr description\nerror: Metadata Exception: pkg ebuild src: dev-qt/qtnetwork-5.6.0, attr data\nerror: False',), <<class 'pkgcore.ebuild.ebuild_src.package'> cpv='dev-qt/qtnetwork-5.6.0' @0x7f508f3586b8>) * Cache regen failed with 1 diff --git a/swegener.html b/swegener.html index fae8daface8d..d8f7cac49c98 100644 --- a/swegener.html +++ b/swegener.html @@ -84,15 +84,15 @@ </pre></td></tr> <tr class="" id="l37"><td><a href="#l37"><span>37</span></a></td><td><pre>File list transfer time: 0.000 seconds </pre></td></tr> - <tr class="" id="l38"><td><a href="#l38"><span>38</span></a></td><td><pre>Total bytes sent: 134 + <tr class="" id="l38"><td><a href="#l38"><span>38</span></a></td><td><pre>Total bytes sent: 130 </pre></td></tr> - <tr class="" id="l39"><td><a href="#l39"><span>39</span></a></td><td><pre>Total bytes received: 4.52K + <tr class="" id="l39"><td><a href="#l39"><span>39</span></a></td><td><pre>Total bytes received: 4.51K </pre></td></tr> <tr class="" id="l40"><td><a href="#l40"><span>40</span></a></td><td><pre> </pre></td></tr> - <tr class="" id="l41"><td><a href="#l41"><span>41</span></a></td><td><pre>sent 134 bytes received 4.52K bytes 1.86K bytes/sec + <tr class="" id="l41"><td><a href="#l41"><span>41</span></a></td><td><pre>sent 130 bytes received 4.51K bytes 3.09K bytes/sec </pre></td></tr> - <tr class="" id="l42"><td><a href="#l42"><span>42</span></a></td><td><pre>total size is 71.70K speedup is 15.42 + <tr class="" id="l42"><td><a href="#l42"><span>42</span></a></td><td><pre>total size is 71.70K speedup is 15.45 </pre></td></tr> <tr class="" id="l43"><td><a href="#l43"><span>43</span></a></td><td><pre>*** syncing swegener </pre></td></tr> diff --git a/swegener.txt b/swegener.txt index daf7df968739..db093e3f6bb9 100644 --- a/swegener.txt +++ b/swegener.txt @@ -35,11 +35,11 @@ Matched data: 0 bytes File list size: 4.43K File list generation time: 0.001 seconds File list transfer time: 0.000 seconds -Total bytes sent: 134 -Total bytes received: 4.52K +Total bytes sent: 130 +Total bytes received: 4.51K -sent 134 bytes received 4.52K bytes 1.86K bytes/sec -total size is 71.70K speedup is 15.42 +sent 130 bytes received 4.51K bytes 3.09K bytes/sec +total size is 71.70K speedup is 15.45 *** syncing swegener *** synced swegener * Sync succeeded diff --git a/ultrabug.html b/ultrabug.html index 80ba3c86001e..e4d78161a6a1 100644 --- a/ultrabug.html +++ b/ultrabug.html @@ -42,67 +42,53 @@ </pre></td></tr> <tr class="" id="l16"><td><a href="#l16"><span>16</span></a></td><td><pre>$ pmaint sync ultrabug </pre></td></tr> - <tr class="" id="l17"><td><a href="#l17"><span>17</span></a></td><td><pre>From https://anongit.gentoo.org/git/dev/ultrabug + <tr class="" id="l17"><td><a href="#l17"><span>17</span></a></td><td><pre>Already up-to-date. </pre></td></tr> - <tr class="" id="l18"><td><a href="#l18"><span>18</span></a></td><td><pre> 7f7e443..940b6db master -> origin/master + <tr class="" id="l18"><td><a href="#l18"><span>18</span></a></td><td><pre>*** syncing ultrabug </pre></td></tr> - <tr class="" id="l19"><td><a href="#l19"><span>19</span></a></td><td><pre>Updating 7f7e443..940b6db + <tr class="" id="l19"><td><a href="#l19"><span>19</span></a></td><td><pre>*** synced ultrabug </pre></td></tr> - <tr class="" id="l20"><td><a href="#l20"><span>20</span></a></td><td><pre>Fast-forward + <tr class="" id="l20"><td><a href="#l20"><span>20</span></a></td><td><pre> * Sync succeeded </pre></td></tr> - <tr class="" id="l21"><td><a href="#l21"><span>21</span></a></td><td><pre> dev-db/scylla/Manifest | 2 +- + <tr class="" id="l21"><td><a href="#l21"><span>21</span></a></td><td><pre>$ git log --format=%ci -1 </pre></td></tr> - <tr class="" id="l22"><td><a href="#l22"><span>22</span></a></td><td><pre> dev-db/scylla/{scylla-1.6.3.ebuild => scylla-1.6.4.ebuild} | 0 + <tr class="" id="l22"><td><a href="#l22"><span>22</span></a></td><td><pre>$ pmaint regen --use-local-desc --pkg-desc-index -t 1 ultrabug </pre></td></tr> - <tr class="" id="l23"><td><a href="#l23"><span>23</span></a></td><td><pre> 2 files changed, 1 insertion(+), 1 deletion(-) + <tr class="" id="l23"><td><a href="#l23"><span>23</span></a></td><td><pre> * ERROR: app-admin/circus-0.11.1 failed (depend phase): </pre></td></tr> - <tr class="" id="l24"><td><a href="#l24"><span>24</span></a></td><td><pre> rename dev-db/scylla/{scylla-1.6.3.ebuild => scylla-1.6.4.ebuild} (100%) + <tr class="" id="l24"><td><a href="#l24"><span>24</span></a></td><td><pre> * inherit for distutils failed </pre></td></tr> - <tr class="" id="l25"><td><a href="#l25"><span>25</span></a></td><td><pre>*** syncing ultrabug + <tr class="" id="l25"><td><a href="#l25"><span>25</span></a></td><td><pre> * </pre></td></tr> - <tr class="" id="l26"><td><a href="#l26"><span>26</span></a></td><td><pre>*** synced ultrabug + <tr class="" id="l26"><td><a href="#l26"><span>26</span></a></td><td><pre> * Call stack: </pre></td></tr> - <tr class="" id="l27"><td><a href="#l27"><span>27</span></a></td><td><pre> * Sync succeeded + <tr class="" id="l27"><td><a href="#l27"><span>27</span></a></td><td><pre> * isolated-functions.lib, line 345: Called source '/home/mgorny/repos/ultrabug/app-admin/circus/circus-0.11.1.ebuild' </pre></td></tr> - <tr class="" id="l28"><td><a href="#l28"><span>28</span></a></td><td><pre>$ git log --format=%ci -1 + <tr class="" id="l28"><td><a href="#l28"><span>28</span></a></td><td><pre> * circus-0.11.1.ebuild, line 9: Called inherit 'distutils' </pre></td></tr> - <tr class="" id="l29"><td><a href="#l29"><span>29</span></a></td><td><pre>$ pmaint regen --use-local-desc --pkg-desc-index -t 1 ultrabug + <tr class="" id="l29"><td><a href="#l29"><span>29</span></a></td><td><pre> * ebuild-default-functions.lib, line 209: Called __internal_inherit 'distutils' </pre></td></tr> - <tr class="" id="l30"><td><a href="#l30"><span>30</span></a></td><td><pre> * ERROR: app-admin/circus-0.11.1 failed (depend phase): + <tr class="" id="l30"><td><a href="#l30"><span>30</span></a></td><td><pre> * ebuild-daemon.lib, line 34: Called die </pre></td></tr> - <tr class="" id="l31"><td><a href="#l31"><span>31</span></a></td><td><pre> * inherit for distutils failed + <tr class="" id="l31"><td><a href="#l31"><span>31</span></a></td><td><pre> * ERROR: app-admin/ec2-api-tools-1.6.9.0 failed (depend phase): </pre></td></tr> - <tr class="" id="l32"><td><a href="#l32"><span>32</span></a></td><td><pre> * + <tr class="" id="l32"><td><a href="#l32"><span>32</span></a></td><td><pre> * unknown inherit command from pythonic side, 'gen_metadata 718' for eclass versionator </pre></td></tr> - <tr class="" id="l33"><td><a href="#l33"><span>33</span></a></td><td><pre> * Call stack: + <tr class="" id="l33"><td><a href="#l33"><span>33</span></a></td><td><pre> * </pre></td></tr> - <tr class="" id="l34"><td><a href="#l34"><span>34</span></a></td><td><pre> * isolated-functions.lib, line 345: Called source '/home/mgorny/repos/ultrabug/app-admin/circus/circus-0.11.1.ebuild' + <tr class="" id="l34"><td><a href="#l34"><span>34</span></a></td><td><pre> * Call stack: </pre></td></tr> - <tr class="" id="l35"><td><a href="#l35"><span>35</span></a></td><td><pre> * circus-0.11.1.ebuild, line 9: Called inherit 'distutils' + <tr class="" id="l35"><td><a href="#l35"><span>35</span></a></td><td><pre> * isolated-functions.lib, line 345: Called source '/home/mgorny/repos/ultrabug/app-admin/ec2-api-tools/ec2-api-tools-1.6.9.0.ebuild' </pre></td></tr> - <tr class="" id="l36"><td><a href="#l36"><span>36</span></a></td><td><pre> * ebuild-default-functions.lib, line 209: Called __internal_inherit 'distutils' + <tr class="" id="l36"><td><a href="#l36"><span>36</span></a></td><td><pre> * ec2-api-tools-1.6.9.0.ebuild, line 7: Called inherit 'versionator' </pre></td></tr> - <tr class="" id="l37"><td><a href="#l37"><span>37</span></a></td><td><pre> * ebuild-daemon.lib, line 34: Called die + <tr class="" id="l37"><td><a href="#l37"><span>37</span></a></td><td><pre> * ebuild-default-functions.lib, line 209: Called __internal_inherit 'versionator' </pre></td></tr> - <tr class="" id="l38"><td><a href="#l38"><span>38</span></a></td><td><pre> * ERROR: app-admin/ec2-api-tools-1.6.9.0 failed (depend phase): + <tr class="" id="l38"><td><a href="#l38"><span>38</span></a></td><td><pre> * ebuild-daemon.lib, line 36: Called die </pre></td></tr> - <tr class="" id="l39"><td><a href="#l39"><span>39</span></a></td><td><pre> * unknown inherit command from pythonic side, 'gen_metadata 718' for eclass versionator + <tr class="" id="l39"><td><a href="#l39"><span>39</span></a></td><td><pre>received unknown com: CATEGORY='app-admin' PKGCORE_EBUILD_PHASE_FUNC=true PKGCORE_ECONF_DISABLE_SILENT_RULES=true PKGCORE_ECONF_DISABLE_DEPENDENCY_TRACKING=true PKGCORE_UNPACK_CASE_INSENSITIVE=false PKGCORE_DODOC_ALLOW_RECURSIVE=true PKGCORE_UNPACK_ABSOLUTE_PATHS=false P='logswan-1.05' PKGCORE_BASH_COMPAT='3.2' PVR='1.05' PV='1.05' PKGCORE_DOINS_ALLOW_SYMLINKS=true PKGCORE_NEW_READS_STDIN=true PKGCORE_NONFATAL=false PR=r0 EAPI=5 PKGCORE_DOMAN_LANGUAGE_OVERRIDE=true PKGCORE_PROFILE_IUSE_INJECTION=true PKGCORE_NONFATAL_DIE=false EBUILD='/home/mgorny/repos/ultrabug/app-admin/logswan/logswan-1.05.ebuild' PF='logswan-1.05' PKGCORE_GLOBAL_FAILGLOB=false PN=logswan PKGCORE_ECONF_DOCDIR_AND_HTMLDIR=false PKGCORE_DOMAN_LANGUAGE_DETECT=truepath </pre></td></tr> - <tr class="" id="l40"><td><a href="#l40"><span>40</span></a></td><td><pre> * -</pre></td></tr> - <tr class="" id="l41"><td><a href="#l41"><span>41</span></a></td><td><pre> * Call stack: -</pre></td></tr> - <tr class="" id="l42"><td><a href="#l42"><span>42</span></a></td><td><pre> * isolated-functions.lib, line 345: Called source '/home/mgorny/repos/ultrabug/app-admin/ec2-api-tools/ec2-api-tools-1.6.9.0.ebuild' -</pre></td></tr> - <tr class="" id="l43"><td><a href="#l43"><span>43</span></a></td><td><pre> * ec2-api-tools-1.6.9.0.ebuild, line 7: Called inherit 'versionator' -</pre></td></tr> - <tr class="" id="l44"><td><a href="#l44"><span>44</span></a></td><td><pre> * ebuild-default-functions.lib, line 209: Called __internal_inherit 'versionator' -</pre></td></tr> - <tr class="" id="l45"><td><a href="#l45"><span>45</span></a></td><td><pre> * ebuild-daemon.lib, line 36: Called die -</pre></td></tr> - <tr class="" id="l46"><td><a href="#l46"><span>46</span></a></td><td><pre>received unknown com: CATEGORY='app-admin' PKGCORE_EBUILD_PHASE_FUNC=true PKGCORE_ECONF_DISABLE_SILENT_RULES=true PKGCORE_ECONF_DISABLE_DEPENDENCY_TRACKING=true PKGCORE_UNPACK_CASE_INSENSITIVE=false PKGCORE_DODOC_ALLOW_RECURSIVE=true PKGCORE_UNPACK_ABSOLUTE_PATHS=false P='logswan-1.05' PKGCORE_BASH_COMPAT='3.2' PVR='1.05' PV='1.05' PKGCORE_DOINS_ALLOW_SYMLINKS=true PKGCORE_NEW_READS_STDIN=true PKGCORE_NONFATAL=false PR=r0 EAPI=5 PKGCORE_DOMAN_LANGUAGE_OVERRIDE=true PKGCORE_PROFILE_IUSE_INJECTION=true PKGCORE_NONFATAL_DIE=false EBUILD='/home/mgorny/repos/ultrabug/app-admin/logswan/logswan-1.05.ebuild' PF='logswan-1.05' PKGCORE_GLOBAL_FAILGLOB=false PN=logswan PKGCORE_ECONF_DOCDIR_AND_HTMLDIR=false PKGCORE_DOMAN_LANGUAGE_DETECT=truepath -</pre></td></tr> - <tr class="" id="l47"><td><a href="#l47"><span>47</span></a></td><td><pre> * Cache regen failed with -13 + <tr class="" id="l40"><td><a href="#l40"><span>40</span></a></td><td><pre> * Cache regen failed with -13 </pre></td></tr> </table> diff --git a/ultrabug.txt b/ultrabug.txt index 5dbc61311e25..205d79a6d782 100644 --- a/ultrabug.txt +++ b/ultrabug.txt @@ -14,14 +14,7 @@ 'uri': 'git+ssh://git@git.gentoo.org/dev/ultrabug.git'}], 'status': 'official'} $ pmaint sync ultrabug -From https://anongit.gentoo.org/git/dev/ultrabug - 7f7e443..940b6db master -> origin/master -Updating 7f7e443..940b6db -Fast-forward - dev-db/scylla/Manifest | 2 +- - dev-db/scylla/{scylla-1.6.3.ebuild => scylla-1.6.4.ebuild} | 0 - 2 files changed, 1 insertion(+), 1 deletion(-) - rename dev-db/scylla/{scylla-1.6.3.ebuild => scylla-1.6.4.ebuild} (100%) +Already up-to-date. *** syncing ultrabug *** synced ultrabug * Sync succeeded diff --git a/v-fox.html b/v-fox.html index ca353b360529..ff534d58f373 100644 --- a/v-fox.html +++ b/v-fox.html @@ -140,11 +140,11 @@ </pre></td><td>[FATAL]</td></tr> <tr class="" id="l65"><td><a href="#l65"><span>65</span></a></td><td><pre>ERROR pkgcore: returned val from gen_metadata was 'False' </pre></td></tr> - <tr class="err" id="l66"><td><a href="#l66"><span>66</span></a></td><td><pre>caught exception '%s' while processing '%s'(MetadataException('Metadata Exception: pkg ebuild src: games-emulation/dolphin-emu-9999-r1, attr description\nerror: Metadata Exception: pkg ebuild src: games-emulation/dolphin-emu-9999-r1, attr data\nerror: False',), <<class 'pkgcore.ebuild.ebuild_src.package'> cpv='games-emulation/dolphin-emu-9999-r1' @0x7f89db933570>) + <tr class="err" id="l66"><td><a href="#l66"><span>66</span></a></td><td><pre>caught exception '%s' while processing '%s'(MetadataException('Metadata Exception: pkg ebuild src: games-emulation/dolphin-emu-9999-r1, attr description\nerror: Metadata Exception: pkg ebuild src: games-emulation/dolphin-emu-9999-r1, attr data\nerror: False',), <<class 'pkgcore.ebuild.ebuild_src.package'> cpv='games-emulation/dolphin-emu-9999-r1' @0x7f230e60b570>) </pre></td><td>[FATAL]</td></tr> <tr class="" id="l67"><td><a href="#l67"><span>67</span></a></td><td><pre>ERROR pkgcore: returned val from gen_metadata was 'False' </pre></td></tr> - <tr class="err" id="l68"><td><a href="#l68"><span>68</span></a></td><td><pre>caught exception '%s' while processing '%s'(MetadataException('Metadata Exception: pkg ebuild src: games-emulation/dolphin-emu-9999, attr description\nerror: Metadata Exception: pkg ebuild src: games-emulation/dolphin-emu-9999, attr data\nerror: False',), <<class 'pkgcore.ebuild.ebuild_src.package'> cpv='games-emulation/dolphin-emu-9999' @0x7f89db9336b8>) + <tr class="err" id="l68"><td><a href="#l68"><span>68</span></a></td><td><pre>caught exception '%s' while processing '%s'(MetadataException('Metadata Exception: pkg ebuild src: games-emulation/dolphin-emu-9999, attr description\nerror: Metadata Exception: pkg ebuild src: games-emulation/dolphin-emu-9999, attr data\nerror: False',), <<class 'pkgcore.ebuild.ebuild_src.package'> cpv='games-emulation/dolphin-emu-9999' @0x7f230e60b6b8>) </pre></td><td>[FATAL]</td></tr> <tr class="" id="l69"><td><a href="#l69"><span>69</span></a></td><td><pre> * Cache regen failed with 1 </pre></td></tr> diff --git a/v-fox.txt b/v-fox.txt index 92527bfca62b..cacfc980d844 100644 --- a/v-fox.txt +++ b/v-fox.txt @@ -63,7 +63,7 @@ ERROR pkgcore: returned val from gen_metadata was 'False' ERROR pkgcore: returned val from gen_metadata was 'False' !!! caught exception False while processing ebuild src: games-emulation/dolphin-emu-9999 ERROR pkgcore: returned val from gen_metadata was 'False' -caught exception '%s' while processing '%s'(MetadataException('Metadata Exception: pkg ebuild src: games-emulation/dolphin-emu-9999-r1, attr description\nerror: Metadata Exception: pkg ebuild src: games-emulation/dolphin-emu-9999-r1, attr data\nerror: False',), <<class 'pkgcore.ebuild.ebuild_src.package'> cpv='games-emulation/dolphin-emu-9999-r1' @0x7f89db933570>) +caught exception '%s' while processing '%s'(MetadataException('Metadata Exception: pkg ebuild src: games-emulation/dolphin-emu-9999-r1, attr description\nerror: Metadata Exception: pkg ebuild src: games-emulation/dolphin-emu-9999-r1, attr data\nerror: False',), <<class 'pkgcore.ebuild.ebuild_src.package'> cpv='games-emulation/dolphin-emu-9999-r1' @0x7f230e60b570>) ERROR pkgcore: returned val from gen_metadata was 'False' -caught exception '%s' while processing '%s'(MetadataException('Metadata Exception: pkg ebuild src: games-emulation/dolphin-emu-9999, attr description\nerror: Metadata Exception: pkg ebuild src: games-emulation/dolphin-emu-9999, attr data\nerror: False',), <<class 'pkgcore.ebuild.ebuild_src.package'> cpv='games-emulation/dolphin-emu-9999' @0x7f89db9336b8>) +caught exception '%s' while processing '%s'(MetadataException('Metadata Exception: pkg ebuild src: games-emulation/dolphin-emu-9999, attr description\nerror: Metadata Exception: pkg ebuild src: games-emulation/dolphin-emu-9999, attr data\nerror: False',), <<class 'pkgcore.ebuild.ebuild_src.package'> cpv='games-emulation/dolphin-emu-9999' @0x7f230e60b6b8>) * Cache regen failed with 1 diff --git a/vaca.html b/vaca.html index ea1cef9a6c84..1b8d091523cd 100644 --- a/vaca.html +++ b/vaca.html @@ -100,7 +100,7 @@ </pre></td></tr> <tr class="" id="l45"><td><a href="#l45"><span>45</span></a></td><td><pre> * ebuild-daemon.lib, line 34: Called die </pre></td></tr> - <tr class="" id="l46"><td><a href="#l46"><span>46</span></a></td><td><pre>sandbox:stop caught signal 15 in pid 22057 + <tr class="" id="l46"><td><a href="#l46"><span>46</span></a></td><td><pre>sandbox:stop caught signal 15 in pid 16478 </pre></td></tr> <tr class="" id="l47"><td><a href="#l47"><span>47</span></a></td><td><pre>Sandboxed process killed by signal: Terminated </pre></td></tr> @@ -120,7 +120,7 @@ </pre></td></tr> <tr class="" id="l55"><td><a href="#l55"><span>55</span></a></td><td><pre> * ebuild-daemon.lib, line 34: Called die </pre></td></tr> - <tr class="" id="l56"><td><a href="#l56"><span>56</span></a></td><td><pre>sandbox:stop caught signal 15 in pid 22158 + <tr class="" id="l56"><td><a href="#l56"><span>56</span></a></td><td><pre>sandbox:stop caught signal 15 in pid 16589 </pre></td></tr> <tr class="" id="l57"><td><a href="#l57"><span>57</span></a></td><td><pre>Sandboxed process killed by signal: Terminated </pre></td></tr> @@ -130,9 +130,9 @@ </pre></td></tr> <tr class="err" id="l60"><td><a href="#l60"><span>60</span></a></td><td><pre>!!! caught exception False while processing ebuild src: net-analyzer/amun-9999 </pre></td><td>[FATAL]</td></tr> - <tr class="err" id="l61"><td><a href="#l61"><span>61</span></a></td><td><pre>caught exception '%s' while processing '%s'(MetadataException('Metadata Exception: pkg ebuild src: net-analyzer/amun-0.2.2, attr description\nerror: Metadata Exception: pkg ebuild src: net-analyzer/amun-0.2.2, attr data\nerror: inherit requires an unknown eclass, python cannot be found',), <<class 'pkgcore.ebuild.ebuild_src.package'> cpv='net-analyzer/amun-0.2.2' @0x7f032f45dbd8>) + <tr class="err" id="l61"><td><a href="#l61"><span>61</span></a></td><td><pre>caught exception '%s' while processing '%s'(MetadataException('Metadata Exception: pkg ebuild src: net-analyzer/amun-0.2.2, attr description\nerror: Metadata Exception: pkg ebuild src: net-analyzer/amun-0.2.2, attr data\nerror: inherit requires an unknown eclass, python cannot be found',), <<class 'pkgcore.ebuild.ebuild_src.package'> cpv='net-analyzer/amun-0.2.2' @0x7f4ae0b59bd8>) </pre></td><td>[FATAL]</td></tr> - <tr class="err" id="l62"><td><a href="#l62"><span>62</span></a></td><td><pre>caught exception '%s' while processing '%s'(MetadataException('Metadata Exception: pkg ebuild src: net-analyzer/amun-9999, attr description\nerror: Metadata Exception: pkg ebuild src: net-analyzer/amun-9999, attr data\nerror: inherit requires an unknown eclass, python cannot be found',), <<class 'pkgcore.ebuild.ebuild_src.package'> cpv='net-analyzer/amun-9999' @0x7f032f45dd20>) + <tr class="err" id="l62"><td><a href="#l62"><span>62</span></a></td><td><pre>caught exception '%s' while processing '%s'(MetadataException('Metadata Exception: pkg ebuild src: net-analyzer/amun-9999, attr description\nerror: Metadata Exception: pkg ebuild src: net-analyzer/amun-9999, attr data\nerror: inherit requires an unknown eclass, python cannot be found',), <<class 'pkgcore.ebuild.ebuild_src.package'> cpv='net-analyzer/amun-9999' @0x7f4ae0b59d20>) </pre></td><td>[FATAL]</td></tr> <tr class="" id="l63"><td><a href="#l63"><span>63</span></a></td><td><pre> * Cache regen failed with 1 </pre></td></tr> @@ -43,7 +43,7 @@ Sandboxed process killed by signal: Broken pipe * amun-0.2.2.ebuild, line 9: Called inherit 'eutils' 'python' 'user' * ebuild-default-functions.lib, line 209: Called __internal_inherit 'python' * ebuild-daemon.lib, line 34: Called die -sandbox:stop caught signal 15 in pid 22057 +sandbox:stop caught signal 15 in pid 16478 Sandboxed process killed by signal: Terminated * ERROR: net-analyzer/amun-9999 failed (depend phase): * inherit for python failed @@ -53,11 +53,11 @@ Sandboxed process killed by signal: Terminated * amun-9999.ebuild, line 9: Called inherit 'eutils' 'python' 'subversion' 'user' * ebuild-default-functions.lib, line 209: Called __internal_inherit 'python' * ebuild-daemon.lib, line 34: Called die -sandbox:stop caught signal 15 in pid 22158 +sandbox:stop caught signal 15 in pid 16589 Sandboxed process killed by signal: Terminated !!! caught exception inherit requires an unknown eclass, python cannot be found while processing ebuild src: net-analyzer/amun-0.2.2 ERROR pkgcore: returned val from gen_metadata was 'False' !!! caught exception False while processing ebuild src: net-analyzer/amun-9999 -caught exception '%s' while processing '%s'(MetadataException('Metadata Exception: pkg ebuild src: net-analyzer/amun-0.2.2, attr description\nerror: Metadata Exception: pkg ebuild src: net-analyzer/amun-0.2.2, attr data\nerror: inherit requires an unknown eclass, python cannot be found',), <<class 'pkgcore.ebuild.ebuild_src.package'> cpv='net-analyzer/amun-0.2.2' @0x7f032f45dbd8>) -caught exception '%s' while processing '%s'(MetadataException('Metadata Exception: pkg ebuild src: net-analyzer/amun-9999, attr description\nerror: Metadata Exception: pkg ebuild src: net-analyzer/amun-9999, attr data\nerror: inherit requires an unknown eclass, python cannot be found',), <<class 'pkgcore.ebuild.ebuild_src.package'> cpv='net-analyzer/amun-9999' @0x7f032f45dd20>) +caught exception '%s' while processing '%s'(MetadataException('Metadata Exception: pkg ebuild src: net-analyzer/amun-0.2.2, attr description\nerror: Metadata Exception: pkg ebuild src: net-analyzer/amun-0.2.2, attr data\nerror: inherit requires an unknown eclass, python cannot be found',), <<class 'pkgcore.ebuild.ebuild_src.package'> cpv='net-analyzer/amun-0.2.2' @0x7f4ae0b59bd8>) +caught exception '%s' while processing '%s'(MetadataException('Metadata Exception: pkg ebuild src: net-analyzer/amun-9999, attr description\nerror: Metadata Exception: pkg ebuild src: net-analyzer/amun-9999, attr data\nerror: inherit requires an unknown eclass, python cannot be found',), <<class 'pkgcore.ebuild.ebuild_src.package'> cpv='net-analyzer/amun-9999' @0x7f4ae0b59d20>) * Cache regen failed with 1 diff --git a/xwing.html b/xwing.html index d3b4b37af9db..208044b70d74 100644 --- a/xwing.html +++ b/xwing.html @@ -74,7 +74,7 @@ </pre></td></tr> <tr class="" id="l32"><td><a href="#l32"><span>32</span></a></td><td><pre> </pre></td></tr> - <tr class="" id="l33"><td><a href="#l33"><span>33</span></a></td><td><pre>sent 85 bytes received 133 bytes 87.20 bytes/sec + <tr class="" id="l33"><td><a href="#l33"><span>33</span></a></td><td><pre>sent 85 bytes received 133 bytes 145.33 bytes/sec </pre></td></tr> <tr class="" id="l34"><td><a href="#l34"><span>34</span></a></td><td><pre>total size is 32 speedup is 0.15 </pre></td></tr> diff --git a/xwing.txt b/xwing.txt index ba09a5612f83..8e99af649319 100644 --- a/xwing.txt +++ b/xwing.txt @@ -30,7 +30,7 @@ File list transfer time: 0.000 seconds Total bytes sent: 85 Total bytes received: 133 -sent 85 bytes received 133 bytes 87.20 bytes/sec +sent 85 bytes received 133 bytes 145.33 bytes/sec total size is 32 speedup is 0.15 *** syncing xwing *** synced xwing diff --git a/y2kbadbug.html b/y2kbadbug.html index 467f508549bb..9db1482f89ab 100644 --- a/y2kbadbug.html +++ b/y2kbadbug.html @@ -90,7 +90,7 @@ </pre></td><td>[FATAL]</td></tr> <tr class="" id="l40"><td><a href="#l40"><span>40</span></a></td><td><pre>ERROR pkgcore: returned val from gen_metadata was 'False' </pre></td></tr> - <tr class="err" id="l41"><td><a href="#l41"><span>41</span></a></td><td><pre>caught exception '%s' while processing '%s'(MetadataException('Metadata Exception: pkg ebuild src: x11-misc/kdocker-5.0, attr description\nerror: Metadata Exception: pkg ebuild src: x11-misc/kdocker-5.0, attr data\nerror: False',), <<class 'pkgcore.ebuild.ebuild_src.package'> cpv='x11-misc/kdocker-5.0' @0x7f8bb5b12a90>) + <tr class="err" id="l41"><td><a href="#l41"><span>41</span></a></td><td><pre>caught exception '%s' while processing '%s'(MetadataException('Metadata Exception: pkg ebuild src: x11-misc/kdocker-5.0, attr description\nerror: Metadata Exception: pkg ebuild src: x11-misc/kdocker-5.0, attr data\nerror: False',), <<class 'pkgcore.ebuild.ebuild_src.package'> cpv='x11-misc/kdocker-5.0' @0x7fdcb8d98a90>) </pre></td><td>[FATAL]</td></tr> <tr class="" id="l42"><td><a href="#l42"><span>42</span></a></td><td><pre> * Cache regen failed with 1 </pre></td></tr> diff --git a/y2kbadbug.txt b/y2kbadbug.txt index e6e6ca237afc..ca66567c41ab 100644 --- a/y2kbadbug.txt +++ b/y2kbadbug.txt @@ -38,5 +38,5 @@ $ pmaint regen --use-local-desc --pkg-desc-index -t 1 y2kbadbug ERROR pkgcore: returned val from gen_metadata was 'False' !!! caught exception False while processing ebuild src: x11-misc/kdocker-5.0 ERROR pkgcore: returned val from gen_metadata was 'False' -caught exception '%s' while processing '%s'(MetadataException('Metadata Exception: pkg ebuild src: x11-misc/kdocker-5.0, attr description\nerror: Metadata Exception: pkg ebuild src: x11-misc/kdocker-5.0, attr data\nerror: False',), <<class 'pkgcore.ebuild.ebuild_src.package'> cpv='x11-misc/kdocker-5.0' @0x7f8bb5b12a90>) +caught exception '%s' while processing '%s'(MetadataException('Metadata Exception: pkg ebuild src: x11-misc/kdocker-5.0, attr description\nerror: Metadata Exception: pkg ebuild src: x11-misc/kdocker-5.0, attr data\nerror: False',), <<class 'pkgcore.ebuild.ebuild_src.package'> cpv='x11-misc/kdocker-5.0' @0x7fdcb8d98a90>) * Cache regen failed with 1 diff --git a/zugaina.html b/zugaina.html index 8f8889f279b3..ce06d647d5f7 100644 --- a/zugaina.html +++ b/zugaina.html @@ -50,21 +50,21 @@ </pre></td></tr> <tr class="" id="l20"><td><a href="#l20"><span>20</span></a></td><td><pre>Matched data: 0 bytes </pre></td></tr> - <tr class="" id="l21"><td><a href="#l21"><span>21</span></a></td><td><pre>File list size: 50.96K + <tr class="" id="l21"><td><a href="#l21"><span>21</span></a></td><td><pre>File list size: 50.93K </pre></td></tr> <tr class="" id="l22"><td><a href="#l22"><span>22</span></a></td><td><pre>File list generation time: 0.001 seconds </pre></td></tr> <tr class="" id="l23"><td><a href="#l23"><span>23</span></a></td><td><pre>File list transfer time: 0.000 seconds </pre></td></tr> - <tr class="" id="l24"><td><a href="#l24"><span>24</span></a></td><td><pre>Total bytes sent: 646 + <tr class="" id="l24"><td><a href="#l24"><span>24</span></a></td><td><pre>Total bytes sent: 662 </pre></td></tr> - <tr class="" id="l25"><td><a href="#l25"><span>25</span></a></td><td><pre>Total bytes received: 58.37K + <tr class="" id="l25"><td><a href="#l25"><span>25</span></a></td><td><pre>Total bytes received: 58.38K </pre></td></tr> <tr class="" id="l26"><td><a href="#l26"><span>26</span></a></td><td><pre> </pre></td></tr> - <tr class="" id="l27"><td><a href="#l27"><span>27</span></a></td><td><pre>sent 646 bytes received 58.37K bytes 39.34K bytes/sec + <tr class="" id="l27"><td><a href="#l27"><span>27</span></a></td><td><pre>sent 662 bytes received 58.38K bytes 23.61K bytes/sec </pre></td></tr> - <tr class="" id="l28"><td><a href="#l28"><span>28</span></a></td><td><pre>total size is 2.87M speedup is 48.60 + <tr class="" id="l28"><td><a href="#l28"><span>28</span></a></td><td><pre>total size is 2.87M speedup is 48.59 </pre></td></tr> <tr class="" id="l29"><td><a href="#l29"><span>29</span></a></td><td><pre>*** syncing zugaina </pre></td></tr> diff --git a/zugaina.txt b/zugaina.txt index a35e1e814d61..cd6cc0c94c5e 100644 --- a/zugaina.txt +++ b/zugaina.txt @@ -18,14 +18,14 @@ Total file size: 2.87M bytes Total transferred file size: 0 bytes Literal data: 0 bytes Matched data: 0 bytes -File list size: 50.96K +File list size: 50.93K File list generation time: 0.001 seconds File list transfer time: 0.000 seconds -Total bytes sent: 646 -Total bytes received: 58.37K +Total bytes sent: 662 +Total bytes received: 58.38K -sent 646 bytes received 58.37K bytes 39.34K bytes/sec -total size is 2.87M speedup is 48.60 +sent 662 bytes received 58.38K bytes 23.61K bytes/sec +total size is 2.87M speedup is 48.59 *** syncing zugaina *** synced zugaina * Sync succeeded |